{"text_format":"1","workbook":"xlsx","n_sheets":10,"sheets":["Templates","Devices","Instructions","IO Assignment MCM01","NETWORK1","NETWORK","Part number","MCM01_DESC","Sheet2","MCM01_DESC_V2"],"not_rendered":{"charts":0,"images":10,"macros":1,"external_links":0,"defined_names":7,"comments":3,"pivot_tables":0},"unopened":[],"bounds":{"document_bytes":16777216,"sheet_cells":100000,"rows_first":2000,"rows_last":500,"rows_between":2000,"halvings":0,"cell_chars":16384,"cell_head_chars":4096},"cells_cut":0,"cells_raw":0,"read":"whole","date_system":"1900"}

{"sheet":"Templates","index":0,"n_rows":19,"n_cols":3,"rows_kept":19,"cut":false,"hidden":false,"merged":[]}
[]
["VFD IO TEMPLATE",null,"FIO IO Template"]
["I0",null,"IO00"]
["I1",null,"IO01"]
["I2",null,"IO02"]
["I3",null,"IO03"]
["IO0",null,"IO04"]
["IO1",null,"IO05"]
["SI0",null,"IO06"]
["SI1",null,"IO07"]
["SI2",null,"IO08"]
["SI3",null,"IO09"]
["SO0",null,"IO10"]
[null,null,"IO11"]
[null,null,"IO12"]
[null,null,"IO13"]
[null,null,"IO14"]
[null,null,"IO15"]
[null,null,"IO16"]

{"sheet":"Devices","index":1,"n_rows":992,"n_cols":9,"rows_kept":992,"cut":false,"hidden":false,"merged":[]}
[null,null,null,null,null,null,null,"Which MCM we assign?","MCM01"]
["PS1_1_BCN1_R"]
["PS1_1_BCN2_R"]
["PS1_1_DISC"]
["PS1_1_EPC1"]
["PS1_1_EPC1_2"]
["PS1_1_EPC2"]
["PS1_1_EPC2_2"]
["PS1_1_S1_PB"]
["PS1_1_S1_PB_LT"]
["PS1_1_S2_PB"]
["PS1_1_S2_PB_LT"]
["PS1_1_VFD1"]
["PS1_2_DISC"]
["PS1_2_TPE1"]
["PS1_2_TPE2"]
["PS1_2_VFD1"]
["PS1_3_DISC"]
["PS1_3_VFD1"]
["PS1_4_DISC"]
["PS1_4_TPE1"]
["PS1_4_TPE2"]
["PS1_4_VFD1"]
["PS1_5_BCN1_R"]
["PS1_5_BCN2_R"]
["PS1_5_DISC"]
["PS1_5_EPC1"]
["PS1_5_EPC1_2"]
["PS1_5_EPC2"]
["PS1_5_EPC2_2"]
["PS1_5_S1_PB"]
["PS1_5_S1_PB_LT"]
["PS1_5_S2_PB"]
["PS1_5_S2_PB_LT"]
["PS1_5_TPE1"]
["PS1_5_VFD1"]
["PS2_1_BCN1_R"]
["PS2_1_BCN2_R"]
["PS2_1_DISC"]
["PS2_1_EP2"]
["PS2_1_EPC1"]
["PS2_1_EPC1_2"]
["PS2_1_S1_PB"]
["PS2_1_S1_PB_LT"]
["PS2_1_S2_PB"]
["PS2_1_S2_PB_LT"]
["PS2_1_VFD1"]
["PS2_2_DISC"]
["PS2_2_TPE1"]
["PS2_2_TPE2"]
["PS2_2_VFD1"]
["PS2_3_BCN1_A"]
["PS2_3_DISC"]
["PS2_3_JR1_PB"]
["PS2_3_JR1_PB_LT"]
["PS2_3_TPE2"]
["PS2_3_VFD1"]
["PS2_4_DISC"]
["PS2_4_VFD1"]
["PS2_5_DISC"]
["PS2_5_TPE1"]
["PS2_5_TPE2"]
["PS2_5_VFD1"]
["PS2_6_BCN1_R"]
["PS2_6_BCN2_R"]
["PS2_6_DISC"]
["PS2_6_EPC1"]
["PS2_6_EPC1_2"]
["PS2_6_EPC2"]
["PS2_6_EPC2_2"]
["PS2_6_S1_PB"]
["PS2_6_S1_PB_LT"]
["PS2_6_S2_PB"]
["PS2_6_S2_PB_LT"]
["PS2_6_TPE1"]
["PS2_6_VFD1"]
["PS3_1_BCN1_R"]
["PS3_1_BCN2_A"]
["PS3_1_BCN2_R"]
["PS3_1_DISC"]
["PS3_1_EPC1"]
["PS3_1_EPC1_2"]
["PS3_1_EPC2"]
["PS3_1_EPC2_2"]
["PS3_1_S1_PB"]
["PS3_1_S1_PB_LT"]
["PS3_1_S2_PB"]
["PS3_1_S2_PB_LT"]
["PS3_1_TPE1"]
["PS3_1_VFD1"]
["PS3_10_DISC"]
["PS3_10_TPE1"]
["PS3_10_VFD1"]
["PS3_11_DISC"]
["PS3_11_VFD1"]
["PS3_12_BCN1_R"]
["PS3_12_BCN2_A"]
["PS3_12_BCN2_R"]
["PS3_12_DISC"]
["PS3_12_EPC1"]
["PS3_12_EPC1_2"]
["PS3_12_EPC2"]
["PS3_12_EPC2_2"]
["PS3_12_S1_PB"]
["PS3_12_S1_PB_LT"]
["PS3_12_S2_PB"]
["PS3_12_S2_PB_LT"]
["PS3_12_TPE1"]
["PS3_12_TPE2"]
["PS3_12_VFD1"]
["PS3_2_DISC"]
["PS3_2_TPE1"]
["PS3_2_VFD1"]
["PS3_3_BCN1_A"]
["PS3_3_DISC"]
["PS3_3_JR1_PB"]
["PS3_3_JR1_PB_LT"]
["PS3_3_TPE2"]
["PS3_3_VFD1"]
["PS3_4_DISC"]
["PS3_4_VFD1"]
["PS3_5_DISC"]
["PS3_5_TPE1"]
["PS3_5_TPE2"]
["PS3_5_VFD1"]
["PS3_6_DISC"]
["PS3_6_TPE1"]
["PS3_6_VFD1"]
["PS3_7_BCN1_A"]
["PS3_7_DISC"]
["PS3_7_JR1_PB"]
["PS3_7_JR1_PB_LT"]
["PS3_7_TPE1"]
["PS3_7_VFD1"]
["PS3_8_DISC"]
["PS3_8_VFD1"]
["PS3_9_DISC"]
["PS3_9_TPE1"]
["PS3_9_TPE2"]
["PS3_9_VFD1"]
["PS4_1_BCN1_R"]
["PS4_1_BCN2_R"]
["PS4_1_DISC"]
["PS4_1_EPC1"]
["PS4_1_EPC1_2"]
["PS4_1_EPC2"]
["PS4_1_EPC2_2"]
["PS4_1_S1_PB"]
["PS4_1_S1_PB_LT"]
["PS4_1_S2_PB"]
["PS4_1_S2_PB_LT"]
["PS4_1_VFD1"]
["PS4_10_DISC"]
["PS4_10_TPE1"]
["PS4_10_TPE2"]
["PS4_10_VFD1"]
["PS4_11_DISC"]
["PS4_11_TPE1"]
["PS4_11_VFD1"]
["PS4_12_DISC"]
["PS4_12_TPE1"]
["PS4_12_VFD1"]
["PS4_13_BCN1_A"]
["PS4_13_DISC"]
["PS4_13_JR1_PB"]
["PS4_13_JR1_PB_LT"]
["PS4_13_VFD1"]
["PS4_14_BCN1_A"]
["PS4_14_BCN1_R"]
["PS4_14_BCN2_R"]
["PS4_14_DISC"]
["PS4_14_EPC1"]
["PS4_14_EPC1_2"]
["PS4_14_EPC2"]
["PS4_14_EPC2_2"]
["PS4_14_S1_PB"]
["PS4_14_S1_PB_LT"]
["PS4_14_S2_PB"]
["PS4_14_S2_PB_LT"]
["PS4_14_TPE1"]
["PS4_14_VFD1"]
["PS4_2_BCN1_A"]
["PS4_2_DISC"]
["PS4_2_JR1_PB"]
["PS4_2_JR1_PB_LT"]
["PS4_2_TPE1"]
["PS4_2_TPE2"]
["PS4_2_VFD1"]
["PS4_3_DISC"]
["PS4_3_VFD1"]
["PS4_4_DISC"]
["PS4_4_TPE1"]
["PS4_4_TPE2"]
["PS4_4_VFD1"]
["PS4_5_DISC"]
["PS4_5_TPE1"]
["PS4_5_VFD1"]
["PS4_6_DISC"]
["PS4_6_TPE1"]
["PS4_6_VFD1"]
["PS4_7_DISC"]
["PS4_7_TPE1"]
["PS4_7_VFD1"]
["PS4_8_BCN1_A"]
["PS4_8_DISC"]
["PS4_8_JR1_PB"]
["PS4_8_JR1_PB_LT"]
["PS4_8_TPE1"]
["PS4_8_VFD1"]
["PS4_9_DISC"]
["PS4_9_VFD1"]
["UL1_10A_DISC"]
["UL1_10A_VFD1"]
["UL1_10B_DISC"]
["UL1_10B_VFD1"]
["UL1_11_DISC"]
["UL1_11_TPE1"]
["UL1_11_TPE2"]
["UL1_11_VFD1"]
["UL1_12_DISC"]
["UL1_12_TPE1"]
["UL1_12_VFD1"]
["UL1_13_DISC"]
["UL1_13_VFD1"]
["UL1_3_BCN1_R"]
["UL1_3_BCN2_R"]
["UL1_3_DISC"]
["UL1_3_DPE2"]
["UL1_3_ENC1"]
["UL1_3_EPC1"]
["UL1_3_EPC1_2"]
["UL1_3_EPC2"]
["UL1_3_EPC2_2"]
["UL1_3_FIO1"]
["UL1_3_LPE1"]
["UL1_3_S1_PB"]
["UL1_3_S1_PB_LT"]
["UL1_3_S2_PB"]
["UL1_3_S2_PB_LT"]
["UL1_3_TPE1"]
["UL1_3_TPE2"]
["UL1_3_VFD1"]
["UL1_4_BCN1_R"]
["UL1_4_DISC"]
["UL1_4_ENC1"]
["UL1_4_EPC1"]
["UL1_4_EPC1_2"]
["UL1_4_EPC2"]
["UL1_4_EPC2_2"]
["UL1_4_S1_PB"]
["UL1_4_S1_PB_LT"]
["UL1_4_S2_PB"]
["UL1_4_S2_PB_LT"]
["UL1_4_TPE1"]
["UL1_4_VFD1"]
["UL1_5_BCN2_R"]
["UL1_5_DISC"]
["UL1_5_ENC1"]
["UL1_5_TPE1"]
["UL1_5_VFD1"]
["UL1_6_DISC"]
["UL1_6_ENC1"]
["UL1_6_TPE1"]
["UL1_6_VFD1"]
["UL1_7_DISC"]
["UL1_7_ENC1"]
["UL1_7_TPE1"]
["UL1_7_VFD1"]
["UL1_8_DISC"]
["UL1_8_ENC1"]
["UL1_8_TPE1"]
["UL1_8_VFD1"]
["UL1_9_BCN1_R"]
["UL1_9_BCN2_R"]
["UL1_9_DISC"]
["UL1_9_ENC1"]
["UL1_9_EPC1"]
["UL1_9_EPC1_2"]
["UL1_9_EPC2"]
["UL1_9_EPC2_2"]
["UL1_9_JR1_PB"]
["UL1_9_JR1_PB_LT"]
["UL1_9_JR2_PB"]
["UL1_9_JR2_PB_LT"]
["UL1_9_S1_PB"]
["UL1_9_S1_PB_LT"]
["UL1_9_S2_PB"]
["UL1_9_S2_PB_LT"]
["UL1_9_TPE1"]
["UL1_9_TPE2"]
["UL1_9_TPE3"]
["UL1_9_TPE4"]
["UL1_9_TPE5"]
["UL1_9_VFD1"]
["UL1_BCN1_A"]
["UL10_1_BCN1_R"]
["UL10_1_BCN2_R"]
["UL10_1_DISC"]
["UL10_1_EPC1"]
["UL10_1_EPC1_2"]
["UL10_1_EPC2"]
["UL10_1_EPC2_2"]
["UL10_1_SS1_SPB"]
["UL10_1_SS1_STPB"]
["UL10_1_SS1_STPB_LT"]
["UL10_1_TPE1"]
["UL10_1_VFD1"]
["UL10_10_DISC"]
["UL10_10_VFD1"]
["UL10_2_DISC"]
["UL10_2_FIO1"]
["UL10_2_LPE1"]
["UL10_2_LPE2"]
["UL10_2_TPE1"]
["UL10_2_TPE2"]
["UL10_2_VFD1"]
["UL10_3_BCN1_R"]
["UL10_3_BCN2_R"]
["UL10_3_DISC"]
["UL10_3_EPC1"]
["UL10_3_EPC1_2"]
["UL10_3_EPC2"]
["UL10_3_EPC2_2"]
["UL10_3_S1_PB"]
["UL10_3_S1_PB_LT"]
["UL10_3_S2_PB"]
["UL10_3_S2_PB_LT"]
["UL10_3_TPE1"]
["UL10_3_VFD1"]
["UL10_4_DISC"]
["UL10_4_ENC1"]
["UL10_4_TPE1"]
["UL10_4_VFD1"]
["UL10_5_DISC"]
["UL10_5_ENC1"]
["UL10_5_TPE1"]
["UL10_5_VFD1"]
["UL10_6_DISC"]
["UL10_6_ENC1"]
["UL10_6_TPE1"]
["UL10_6_VFD1"]
["UL10_7_DISC"]
["UL10_7_ENC1"]
["UL10_7_TPE1"]
["UL10_7_VFD1"]
["UL10_8_DISC"]
["UL10_8_ENC1"]
["UL10_8_VFD1"]
["UL10_9_DISC"]
["UL10_9_ENC1"]
["UL10_9_TPE1"]
["UL10_9_TPE2"]
["UL10_9_VFD1"]
["UL11_1_EPC1"]
["UL11_1_EPC1_2"]
["UL11_1_EPC2"]
["UL11_1_EPC2_2"]
["UL11_10_BCN1_R"]
["UL11_10_DISC"]
["UL11_10_ENC1"]
["UL11_10_EPC1"]
["UL11_10_EPC1_2"]
["UL11_10_S1_PB"]
["UL11_10_S1_PB_LT"]
["UL11_10_TPE1"]
["UL11_10_TPE2"]
["UL11_10_VFD1"]
["UL11_11A_DISC"]
["UL11_11A_VFD1"]
["UL11_11B_DISC"]
["UL11_11B_VFD1"]
["UL11_12_DISC"]
["UL11_12_ENC1"]
["UL11_12_TPE1"]
["UL11_12_TPE2"]
["UL11_12_VFD1"]
["UL11_13_DISC"]
["UL11_13_ENC1"]
["UL11_13_TPE1"]
["UL11_13_VFD1"]
["UL11_14_DISC"]
["UL11_14_TPE1"]
["UL11_14_VFD1"]
["UL11_3_BCN1_R"]
["UL11_3_BCN2_R"]
["UL11_3_DISC"]
["UL11_3_ENC1"]
["UL11_3_FIO1"]
["UL11_3_LPE1"]
["UL11_3_LPE2"]
["UL11_3_S1_PB"]
["UL11_3_S1_PB_LT"]
["UL11_3_S2_PB"]
["UL11_3_S2_PB_LT"]
["UL11_3_TPE1"]
["UL11_3_TPE2"]
["UL11_3_VFD1"]
["UL11_4_BCN1_R"]
["UL11_4_BCN2_R"]
["UL11_4_DISC"]
["UL11_4_EPC1"]
["UL11_4_EPC1_2"]
["UL11_4_EPC2"]
["UL11_4_EPC2_2"]
["UL11_4_S1_PB"]
["UL11_4_S1_PB_LT"]
["UL11_4_S2_PB"]
["UL11_4_S2_PB_LT"]
["UL11_4_TPE1"]
["UL11_4_VFD1"]
["UL11_5_DISC"]
["UL11_5_ENC1"]
["UL11_5_TPE1"]
["UL11_5_VFD1"]
["UL11_6_DISC"]
["UL11_6_ENC1"]
["UL11_6_TPE1"]
["UL11_6_VFD1"]
["UL11_7_DISC"]
["UL11_7_ENC1"]
["UL11_7_TPE1"]
["UL11_7_VFD1"]
["UL11_8_DISC"]
["UL11_8_ENC1"]
["UL11_8_TPE1"]
["UL11_8_VFD1"]
["UL11_9_BCN1_A"]
["UL11_9_BCN1_R"]
["UL11_9_DISC"]
["UL11_9_ENC1"]
["UL11_9_EPC1"]
["UL11_9_EPC1_2"]
["UL11_9_JR1_PB"]
["UL11_9_JR1_PB_LT"]
["UL11_9_S1_PB"]
["UL11_9_S1_PB_LT"]
["UL11_9_TPE1"]
["UL11_9_TPE2"]
["UL11_9_TPE3"]
["UL11_9_VFD1"]
["UL12_10_DISC"]
["UL12_10_VFD1"]
["UL12_3_BCN1_R"]
["UL12_3_BCN2_R"]
["UL12_3_DISC"]
["UL12_3_ENC1"]
["UL12_3_EPC1"]
["UL12_3_EPC1_2"]
["UL12_3_EPC2"]
["UL12_3_EPC2_2"]
["UL12_3_FIO1"]
["UL12_3_LPE1"]
["UL12_3_LPE2"]
["UL12_3_S1_PB"]
["UL12_3_S1_PB_LT"]
["UL12_3_S2_PB"]
["UL12_3_S2_PB_LT"]
["UL12_3_TPE1"]
["UL12_3_TPE2"]
["UL12_3_VFD1"]
["UL12_4_BCN1_R"]
["UL12_4_BCN2_R"]
["UL12_4_DISC"]
["UL12_4_ENC1"]
["UL12_4_EPC1"]
["UL12_4_EPC1_2"]
["UL12_4_EPC2"]
["UL12_4_EPC2_2"]
["UL12_4_S1_PB"]
["UL12_4_S1_PB_LT"]
["UL12_4_S2_PB"]
["UL12_4_S2_PB_LT"]
["UL12_4_TPE1"]
["UL12_4_VFD1"]
["UL12_5_DISC"]
["UL12_5_ENC1"]
["UL12_5_VFD1"]
["UL12_6_DISC"]
["UL12_6_ENC1"]
["UL12_6_TPE1"]
["UL12_6_TPE2"]
["UL12_6_VFD1"]
["UL12_7_DISC"]
["UL12_7_ENC1"]
["UL12_7_TPE1"]
["UL12_7_VFD1"]
["UL12_8_DISC"]
["UL12_8_ENC1"]
["UL12_8_TPE1"]
["UL12_8_VFD1"]
["UL12_9_DISC"]
["UL12_9_ENC1"]
["UL12_9_TPE1"]
["UL12_9_VFD1"]
["UL2_10_DISC"]
["UL2_10_VFD1"]
["UL2_3_BCN1_R"]
["UL2_3_BCN2_R"]
["UL2_3_DISC"]
["UL2_3_ENC1"]
["UL2_3_EPC1"]
["UL2_3_EPC1_2"]
["UL2_3_EPC2"]
["UL2_3_EPC2_2"]
["UL2_3_FIO1"]
["UL2_3_LPE1"]
["UL2_3_LPE2"]
["UL2_3_S1_PB"]
["UL2_3_S1_PB_LT"]
["UL2_3_S2_PB"]
["UL2_3_S2_PB_LT"]
["UL2_3_TPE1"]
["UL2_3_TPE2"]
["UL2_3_VFD1"]
["UL2_4_BCN1_R"]
["UL2_4_BCN2_R"]
["UL2_4_DISC"]
["UL2_4_ENC1"]
["UL2_4_EPC1"]
["UL2_4_EPC1_2"]
["UL2_4_EPC2"]
["UL2_4_EPC2_2"]
["UL2_4_S1_PB"]
["UL2_4_S1_PB_LT"]
["UL2_4_S2_PB"]
["UL2_4_S2_PB_LT"]
["UL2_4_TPE1"]
["UL2_4_VFD1"]
["UL2_5_DISC"]
["UL2_5_ENC1"]
["UL2_5_VFD1"]
["UL2_6_DISC"]
["UL2_6_ENC1"]
["UL2_6_TPE1"]
["UL2_6_TPE2"]
["UL2_6_VFD1"]
["UL2_7_DISC"]
["UL2_7_ENC1"]
["UL2_7_TPE1"]
["UL2_7_VFD1"]
["UL2_8_DISC"]
["UL2_8_ENC1"]
["UL2_8_TPE1"]
["UL2_8_VFD1"]
["UL2_9_DISC"]
["UL2_9_ENC1"]
["UL2_9_TPE1"]
["UL2_9_VFD1"]
["UL3_1_BCN1_R"]
["UL3_1_BCN2_R"]
["UL3_1_DISC"]
["UL3_1_EPC1"]
["UL3_1_EPC1_2"]
["UL3_1_EPC2"]
["UL3_1_EPC2_2"]
["UL3_1_SS1_SPB"]
["UL3_1_SS1_STPB"]
["UL3_1_SS1_STPB_LT"]
["UL3_1_TPE1"]
["UL3_1_VFD1"]
["UL3_2_BCN1_R"]
["UL3_2_BCN2_R"]
["UL3_2_DISC"]
["UL3_2_ENC1"]
["UL3_2_EPC1"]
["UL3_2_EPC1_2"]
["UL3_2_EPC2"]
["UL3_2_EPC2_2"]
["UL3_2_FIO1"]
["UL3_2_LPE1"]
["UL3_2_LPE2"]
["UL3_2_S1_PB"]
["UL3_2_S1_PB_LT"]
["UL3_2_S2_PB"]
["UL3_2_S2_PB_LT"]
["UL3_2_TPE1"]
["UL3_2_TPE2"]
["UL3_2_VFD1"]
["UL3_3_DISC"]
["UL3_3_ENC1"]
["UL3_3_VFD1"]
["UL3_4_DISC"]
["UL3_4_ENC1"]
["UL3_4_TPE1"]
["UL3_4_TPE2"]
["UL3_4_VFD1"]
["UL3_5_DISC"]
["UL3_5_ENC1"]
["UL3_5_TPE1"]
["UL3_5_VFD1"]
["UL3_6_DISC"]
["UL3_6_ENC1"]
["UL3_6_TPE1"]
["UL3_6_VFD1"]
["UL3_7_DISC"]
["UL3_7_ENC1"]
["UL3_7_TPE1"]
["UL3_7_VFD1"]
["UL3_8_DISC"]
["UL3_8_ENC1"]
["UL3_8_TPE1"]
["UL3_8_VFD1"]
["UL3_9_DISC"]
["UL3_9_VFD1"]
["UL4_10A_DISC"]
["UL4_10A_VFD1"]
["UL4_10B_DISC"]
["UL4_10B_VFD1"]
["UL4_11_DISC"]
["UL4_11_TPE1"]
["UL4_11_TPE2"]
["UL4_11_VFD1"]
["UL4_12_DISC"]
["UL4_12_TPE1"]
["UL4_12_VFD1"]
["UL4_13_DISC"]
["UL4_13_VFD1"]
["UL4_3_BCN1_R"]
["UL4_3_BCN2_R"]
["UL4_3_DISC"]
["UL4_3_ENC1"]
["UL4_3_EPC1"]
["UL4_3_EPC1_2"]
["UL4_3_EPC2"]
["UL4_3_EPC2_2"]
["UL4_3_FIO1"]
["UL4_3_LPE1"]
["UL4_3_LPE2"]
["UL4_3_S1_PB"]
["UL4_3_S1_PB_LT"]
["UL4_3_S2_PB"]
["UL4_3_S2_PB_LT"]
["UL4_3_TPE1"]
["UL4_3_TPE2"]
["UL4_3_VFD1"]
["UL4_4_BCN1_R"]
["UL4_4_BCN2_R"]
["UL4_4_DISC"]
["UL4_4_ENC1"]
["UL4_4_EPC1"]
["UL4_4_EPC1_2"]
["UL4_4_EPC2"]
["UL4_4_EPC2_2"]
["UL4_4_S1_PB"]
["UL4_4_S1_PB_LT"]
["UL4_4_S2_PB"]
["UL4_4_S2_PB_LT"]
["UL4_4_TPE1"]
["UL4_4_VFD1"]
["UL4_5_DISC"]
["UL4_5_ENC1"]
["UL4_5_TPE1"]
["UL4_5_VFD1"]
["UL4_6_DISC"]
["UL4_6_ENC1"]
["UL4_6_TPE1"]
["UL4_6_VFD1"]
["UL4_7_DISC"]
["UL4_7_ENC1"]
["UL4_7_TPE1"]
["UL4_7_VFD1"]
["UL4_8_DISC"]
["UL4_8_ENC1"]
["UL4_8_TPE1"]
["UL4_8_VFD1"]
["UL4_9_BCN1_A"]
["UL4_9_BCN1_R"]
["UL4_9_BCN2_R"]
["UL4_9_DISC"]
["UL4_9_EPC1"]
["UL4_9_EPC1_2"]
["UL4_9_EPC2"]
["UL4_9_EPC2_2"]
["UL4_9_JR1_PB"]
["UL4_9_JR1_PB_LT"]
["UL4_9_JR2_PB"]
["UL4_9_JR2_PB_LT"]
["UL4_9_S1_PB"]
["UL4_9_S1_PB_LT"]
["UL4_9_S2_PB"]
["UL4_9_S2_PB_LT"]
["UL4_9_TPE1"]
["UL4_9_TPE2"]
["UL4_9_TPE3"]
["UL4_9_TPE4"]
["UL4_9_TPE5"]
["UL4_9_VFD1"]
["UL5_10_DISC"]
["UL5_10_VFD1"]
["UL5_3_BCN1_R"]
["UL5_3_BCN2_R"]
["UL5_3_DISC"]
["UL5_3_ENC1"]
["UL5_3_EPC1"]
["UL5_3_EPC1_2"]
["UL5_3_EPC2"]
["UL5_3_EPC2_2"]
["UL5_3_FIO1"]
["UL5_3_LPE1"]
["UL5_3_LPE2"]
["UL5_3_S1_PB"]
["UL5_3_S1_PB_LT"]
["UL5_3_S2_PB"]
["UL5_3_S2_PB_LT"]
["UL5_3_TPE1"]
["UL5_3_TPE2"]
["UL5_3_VFD1"]
["UL5_4_BCN1_R"]
["UL5_4_BCN2_R"]
["UL5_4_DISC"]
["UL5_4_ENC1"]
["UL5_4_EPC1"]
["UL5_4_EPC1_2"]
["UL5_4_EPC2"]
["UL5_4_EPC2_2"]
["UL5_4_S1_PB"]
["UL5_4_S1_PB_LT"]
["UL5_4_S2_PB"]
["UL5_4_S2_PB_LT"]
["UL5_4_TPE1"]
["UL5_4_VFD1"]
["UL5_5_DISC"]
["UL5_5_ENC1"]
["UL5_5_VFD1"]
["UL5_6_DISC"]
["UL5_6_ENC1"]
["UL5_6_TPE1"]
["UL5_6_TPE2"]
["UL5_6_VFD1"]
["UL5_7_DISC"]
["UL5_7_ENC1"]
["UL5_7_TPE1"]
["UL5_7_VFD1"]
["UL5_8_DISC"]
["UL5_8_ENC1"]
["UL5_8_TPE1"]
["UL5_8_VFD1"]
["UL5_9_DISC"]
["UL5_9_ENC1"]
["UL5_9_TPE1"]
["UL5_9_VFD1"]
["UL6_1_BCN1_R"]
["UL6_1_BCN2_R"]
["UL6_1_DISC"]
["UL6_1_EPC1"]
["UL6_1_EPC1_2"]
["UL6_1_EPC2"]
["UL6_1_EPC2_2"]
["UL6_1_SS1_SPB"]
["UL6_1_SS1_STPB"]
["UL6_1_SS1_STPB_LT"]
["UL6_1_TPE1"]
["UL6_1_VFD1"]
["UL6_2_BCN1_R"]
["UL6_2_BCN2_R"]
["UL6_2_DISC"]
["UL6_2_ENC1"]
["UL6_2_EPC1"]
["UL6_2_EPC1_2"]
["UL6_2_EPC2"]
["UL6_2_EPC2_2"]
["UL6_2_FIO1"]
["UL6_2_LPE1"]
["UL6_2_LPE2"]
["UL6_2_S1_PB"]
["UL6_2_S1_PB_LT"]
["UL6_2_S2_PB"]
["UL6_2_S2_PB_LT"]
["UL6_2_TPE1"]
["UL6_2_TPE2"]
["UL6_2_VFD1"]
["UL6_3_DISC"]
["UL6_3_ENC1"]
["UL6_3_VFD1"]
["UL6_4_DISC"]
["UL6_4_ENC1"]
["UL6_4_TPE1"]
["UL6_4_TPE2"]
["UL6_4_VFD1"]
["UL6_5_DISC"]
["UL6_5_ENC1"]
["UL6_5_TPE1"]
["UL6_5_VFD1"]
["UL6_6_DISC"]
["UL6_6_ENC1"]
["UL6_6_TPE1"]
["UL6_6_VFD1"]
["UL6_7_DISC"]
["UL6_7_ENC1"]
["UL6_7_TPE1"]
["UL6_7_VFD1"]
["UL6_8_DISC"]
["UL6_8_ENC1"]
["UL6_8_TPE1"]
["UL6_8_VFD1"]
["UL6_9_DISC"]
["UL6_9_VFD1"]
["UL7_1_EPC1"]
["UL7_1_EPC1_2"]
["UL7_1_EPC2"]
["UL7_1_EPC2_2"]
["UL7_10A_DISC"]
["UL7_10A_VFD1"]
["UL7_10B_DISC"]
["UL7_10B_VFD1"]
["UL7_11_DISC"]
["UL7_11_TPE1"]
["UL7_11_TPE2"]
["UL7_11_VFD1"]
["UL7_12_DISC"]
["UL7_12_TPE1"]
["UL7_12_VFD1"]
["UL7_13_DISC"]
["UL7_13_VFD1"]
["UL7_3_BCN1_R"]
["UL7_3_BCN2_R"]
["UL7_3_DISC"]
["UL7_3_ENC1"]
["UL7_3_FIO1"]
["UL7_3_LPE1"]
["UL7_3_LPE2"]
["UL7_3_S1_PB"]
["UL7_3_S1_PB_LT"]
["UL7_3_S2_PB"]
["UL7_3_S2_PB_LT"]
["UL7_3_TPE1"]
["UL7_3_TPE2"]
["UL7_3_VFD1"]
["UL7_4_BCN1_R"]
["UL7_4_BCN2_R"]
["UL7_4_DISC"]
["UL7_4_ENC1"]
["UL7_4_EPC1"]
["UL7_4_EPC1_2"]
["UL7_4_EPC2"]
["UL7_4_EPC2_2"]
["UL7_4_S1_PB"]
["UL7_4_S1_PB_LT"]
["UL7_4_S2_PB"]
["UL7_4_S2_PB_LT"]
["UL7_4_TPE1"]
["UL7_4_VFD1"]
["UL7_5_DISC"]
["UL7_5_ENC1"]
["UL7_5_TPE1"]
["UL7_5_VFD1"]
["UL7_6_DISC"]
["UL7_6_ENC1"]
["UL7_6_TPE1"]
["UL7_6_VFD1"]
["UL7_7_DISC"]
["UL7_7_ENC1"]
["UL7_7_TPE1"]
["UL7_7_VFD1"]
["UL7_8_DISC"]
["UL7_8_ENC1"]
["UL7_8_TPE1"]
["UL7_8_VFD1"]
["UL7_9_BCN1_A"]
["UL7_9_BCN1_R"]
["UL7_9_BCN2_R"]
["UL7_9_DISC"]
["UL7_9_EPC1"]
["UL7_9_EPC1_2"]
["UL7_9_EPC2"]
["UL7_9_EPC2_2"]
["UL7_9_JR1_PB"]
["UL7_9_JR1_PB_LT"]
["UL7_9_JR2_PB"]
["UL7_9_JR2_PB_LT"]
["UL7_9_S1_PB"]
["UL7_9_S1_PB_LT"]
["UL7_9_S2_PB"]
["UL7_9_S2_PB_LT"]
["UL7_9_TPE1"]
["UL7_9_TPE2"]
["UL7_9_TPE4"]
["UL7_9_TPE5"]
["UL7_9_VFD1"]
["UL8_1_BCN1_R"]
["UL8_1_BCN2_R"]
["UL8_1_DISC"]
["UL8_1_EPC1"]
["UL8_1_EPC1_2"]
["UL8_1_EPC2"]
["UL8_1_EPC2_2"]
["UL8_1_SS1_SPB"]
["UL8_1_SS1_STPB"]
["UL8_1_SS1_STPB_LT"]
["UL8_1_TPE1"]
["UL8_1_VFD1"]
["UL8_2_DISC"]
["UL8_2_FIO1"]
["UL8_2_LPE1"]
["UL8_2_LPE2"]
["UL8_2_TPE1"]
["UL8_2_TPE2"]
["UL8_2_VFD1"]
["UL8_3_BCN1_R"]
["UL8_3_BCN2_R"]
["UL8_3_DISC"]
["UL8_3_ENC1"]
["UL8_3_EPC1"]
["UL8_3_EPC1_2"]
["UL8_3_EPC2"]
["UL8_3_EPC2_2"]
["UL8_3_S1_PB"]
["UL8_3_S1_PB_LT"]
["UL8_3_S2_PB"]
["UL8_3_S2_PB_LT"]
["UL8_3_TPE1"]
["UL8_3_VFD1"]
["UL8_4_DISC"]
["UL8_4_ENC1"]
["UL8_4_VFD1"]
["UL8_5_DISC"]
["UL8_5_ENC1"]
["UL8_5_TPE1"]
["UL8_5_TPE2"]
["UL8_5_VFD1"]
["UL8_6_DISC"]
["UL8_6_ENC1"]
["UL8_6_TPE1"]
["UL8_6_VFD1"]
["UL8_7_DISC"]
["UL8_7_ENC1"]
["UL8_7_TPE1"]
["UL8_7_VFD1"]
["UL8_8_DISC"]
["UL8_8_ENC1"]
["UL8_8_TPE1"]
["UL8_8_VFD1"]
["UL8_9_DISC"]
["UL8_9_VFD1"]
["UL9_1_EPC1"]
["UL9_1_EPC1_2"]
["UL9_1_EPC2"]
["UL9_1_EPC2_2"]
["UL9_10_DISC"]
["UL9_10_ENC1"]
["UL9_10_TPE1"]
["UL9_10_VFD1"]
["UL9_11_DISC"]
["UL9_11_VFD1"]
["UL9_3_BCN1_R"]
["UL9_3_BCN2_R"]
["UL9_3_DISC"]
["UL9_3_ENC1"]
["UL9_3_FIO1"]
["UL9_3_LPE1"]
["UL9_3_LPE2"]
["UL9_3_S1_PB"]
["UL9_3_S1_PB_LT"]
["UL9_3_S2_PB"]
["UL9_3_S2_PB_LT"]
["UL9_3_TPE1"]
["UL9_3_TPE2"]
["UL9_3_VFD1"]
["UL9_4_BCN1_R"]
["UL9_4_BCN2_R"]
["UL9_4_DISC"]
["UL9_4_ENC1"]
["UL9_4_EPC1"]
["UL9_4_EPC1_2"]
["UL9_4_EPC2"]
["UL9_4_EPC2_2"]
["UL9_4_S1_PB"]
["UL9_4_S1_PB_LT"]
["UL9_4_S2_PB"]
["UL9_4_S2_PB_LT"]
["UL9_4_TPE1"]
["UL9_4_VFD1"]
["UL9_5_DISC"]
["UL9_5_ENC1"]
["UL9_5_VFD1"]
["UL9_6_DISC"]
["UL9_6_ENC1"]
["UL9_6_TPE1"]
["UL9_6_TPE2"]
["UL9_6_VFD1"]
["UL9_7_DISC"]
["UL9_7_ENC1"]
["UL9_7_TPE1"]
["UL9_7_VFD1"]
["UL9_8_DISC"]
["UL9_8_ENC1"]
["UL9_8_TPE1"]
["UL9_8_VFD1"]
["UL9_9_DISC"]
["UL9_9_ENC1"]
["UL9_9_TPE1"]
["UL9_9_VFD1"]

{"sheet":"Instructions","index":2,"n_rows":116,"n_cols":2,"rows_kept":116,"cut":false,"hidden":false,"merged":[]}
[]
["1. ","Put all device tags to cell A2"]
[]
[]
[]
[]
[]
[]
[]
[]
[]
[]
[]
[]
[]
[]
[]
[]
[]
[]
[]
[]
[]
[]
[]
[]
[]
[]
[]
[]
[]
[]
[]
[]
[]
[]
["2.","In cell I1 write MCM number"]
[]
[]
[]
[]
[]
[]
[]
[]
[]
["3. ","Click on \"Add Disconnects\" button. "]
[]
[]
[]
[]
[]
[]
[]
[]
[]
["4. ","Replace all _VFD1_DISC with _DISC. Without this point it will generate IO points for _VFD1_DISC device"]
[]
[]
[]
[]
[]
[]
[]
[]
[]
[]
[]
["5. ","Click on \"Split SS station\". This will split all _SS to SS_STPB, SS_SPB and SS_STPB_LT"]
[]
[]
[]
[]
[]
[]
[]
[]
["6. ","Click on \"Split start PB\". This will split all _S and _JR to _S_PB, _S_PB_LT, JR_PB and JR_PB_LT"]
[]
[]
[]
[]
[]
[]
[]
[]
["7.","Click on \"Duplicate EPC Tag\". This will add duplicate for all EPC and add _2 to copy"]
[]
[]
[]
[]
[]
[]
[]
[]
[]
["8.","Click on \"Create Assignment table template\". This will add new sheet with name \"IO Assignment MCM01 and fill with VFD and FIO names and their adresses"]
[]
[]
[]
[]
[]
[]
[]
[]
[]
["9.","Click on \"Assign Devices to VFD\". This will add device tags to correspond VFD IO. Works for Disc, TPE, JPE, EPC, ENC"]
[]
[]
[]
[]
[]
[]
[]
[]
["10. ","All Unassigned Pushbuttons and lights fill manually and all devices, that couldn't filled to VFD also will be here."]

{"sheet":"IO Assignment MCM01","index":3,"n_rows":2062,"n_cols":11,"rows_kept":2062,"cut":false,"hidden":false,"merged":[[776,6,830,6],[1902,5,1965,5],[1966,4,2061,4]]}
["Controller name","Signal type","Address name","Assigned device","Unassigned Device",null,null,null,null,null,"MCM01_DESC_V2"]
["PS1_01_VFD1","I0","PS1_01_VFD1_I0","PS1_1_VFD1_DISC"]
["PS1_01_VFD1","I1","PS1_01_VFD1_I1"]
["PS1_01_VFD1","I2","PS1_01_VFD1_I2"]
["PS1_01_VFD1","I3","PS1_01_VFD1_I3"]
["PS1_01_VFD1","IO0","PS1_01_VFD1_IO0","PS1_1_S1_PB"]
["PS1_01_VFD1","IO1","PS1_01_VFD1_IO1","PS1_1_S1_PB_LT"]
["PS1_01_VFD1","SI0","PS1_01_VFD1_SI0","PS1_1_EPC1"]
["PS1_01_VFD1","SI1","PS1_01_VFD1_SI1","PS1_1_EPC1_2"]
["PS1_01_VFD1","SI2","PS1_01_VFD1_SI2","PS1_1_EPC2"]
["PS1_01_VFD1","SI3","PS1_01_VFD1_SI3","PS1_1_EPC2_2"]
["PS1_01_VFD1","SO0","PS1_01_VFD1_SO0"]
["PS1_02_VFD1","I0","PS1_02_VFD1_I0","PS1_2_VFD1_DISC"]
["PS1_02_VFD1","I1","PS1_02_VFD1_I1"]
["PS1_02_VFD1","I2","PS1_02_VFD1_I2","PS1_2_TPE1"]
["PS1_02_VFD1","I3","PS1_02_VFD1_I3","PS1_2_TPE2"]
["PS1_02_VFD1","IO0","PS1_02_VFD1_IO0","PS1_1_BCN2_R"]
["PS1_02_VFD1","IO1","PS1_02_VFD1_IO1","PS1_1_BCN2_H"]
["PS1_02_VFD1","SI0","PS1_02_VFD1_SI0"]
["PS1_02_VFD1","SI1","PS1_02_VFD1_SI1"]
["PS1_02_VFD1","SI2","PS1_02_VFD1_SI2"]
["PS1_02_VFD1","SI3","PS1_02_VFD1_SI3"]
["PS1_02_VFD1","SO0","PS1_02_VFD1_SO0","PS1_1_BCN1_R"]
["PS1_03_VFD1","I0","PS1_03_VFD1_I0","PS1_3_VFD1_DISC"]
["PS1_03_VFD1","I1","PS1_03_VFD1_I1"]
["PS1_03_VFD1","I2","PS1_03_VFD1_I2"]
["PS1_03_VFD1","I3","PS1_03_VFD1_I3"]
["PS1_03_VFD1","IO0","PS1_03_VFD1_IO0","PS1_1_S2_PB"]
["PS1_03_VFD1","IO1","PS1_03_VFD1_IO1","PS1_1_S2_PB_LT"]
["PS1_03_VFD1","SI0","PS1_03_VFD1_SI0"]
["PS1_03_VFD1","SI1","PS1_03_VFD1_SI1"]
["PS1_03_VFD1","SI2","PS1_03_VFD1_SI2"]
["PS1_03_VFD1","SI3","PS1_03_VFD1_SI3"]
["PS1_03_VFD1","SO0","PS1_03_VFD1_SO0"]
["PS1_04_VFD1","I0","PS1_04_VFD1_I0","PS1_4_VFD1_DISC"]
["PS1_04_VFD1","I1","PS1_04_VFD1_I1"]
["PS1_04_VFD1","I2","PS1_04_VFD1_I2","PS1_4_TPE1"]
["PS1_04_VFD1","I3","PS1_04_VFD1_I3","PS1_4_TPE2"]
["PS1_04_VFD1","IO0","PS1_04_VFD1_IO0","PS1_5_S1_PB"]
["PS1_04_VFD1","IO1","PS1_04_VFD1_IO1","PS1_5_S1_PB_LT"]
["PS1_04_VFD1","SI0","PS1_04_VFD1_SI0"]
["PS1_04_VFD1","SI1","PS1_04_VFD1_SI1"]
["PS1_04_VFD1","SI2","PS1_04_VFD1_SI2"]
["PS1_04_VFD1","SI3","PS1_04_VFD1_SI3"]
["PS1_04_VFD1","SO0","PS1_04_VFD1_SO0","PS1_5_BCN2_R"]
["PS1_05_VFD1","I0","PS1_05_VFD1_I0","PS1_5_VFD1_DISC"]
["PS1_05_VFD1","I1","PS1_05_VFD1_I1"]
["PS1_05_VFD1","I2","PS1_05_VFD1_I2","PS1_5_TPE1"]
["PS1_05_VFD1","I3","PS1_05_VFD1_I3"]
["PS1_05_VFD1","IO0","PS1_05_VFD1_IO0","PS1_5_S2_PB"]
["PS1_05_VFD1","IO1","PS1_05_VFD1_IO1","PS1_5_S2_PB_LT"]
["PS1_05_VFD1","SI0","PS1_05_VFD1_SI0","PS1_5_EPC1"]
["PS1_05_VFD1","SI1","PS1_05_VFD1_SI1","PS1_5_EPC1_2"]
["PS1_05_VFD1","SI2","PS1_05_VFD1_SI2","PS1_5_EPC2"]
["PS1_05_VFD1","SI3","PS1_05_VFD1_SI3","PS1_5_EPC2_2"]
["PS1_05_VFD1","SO0","PS1_05_VFD1_SO0","PS1_5_BCN1_R"]
["PS2_01_VFD1","I0","PS2_01_VFD1_I0","PS2_1_VFD1_DISC"]
["PS2_01_VFD1","I1","PS2_01_VFD1_I1"]
["PS2_01_VFD1","I2","PS2_01_VFD1_I2"]
["PS2_01_VFD1","I3","PS2_01_VFD1_I3"]
["PS2_01_VFD1","IO0","PS2_01_VFD1_IO0","PS2_1_S1_PB"]
["PS2_01_VFD1","IO1","PS2_01_VFD1_IO1","PS2_1_S1_PB_LT"]
["PS2_01_VFD1","SI0","PS2_01_VFD1_SI0","PS2_1_EPC1"]
["PS2_01_VFD1","SI1","PS2_01_VFD1_SI1","PS2_1_EPC1_2"]
["PS2_01_VFD1","SI2","PS2_01_VFD1_SI2","PS2_1_EPC2"]
["PS2_01_VFD1","SI3","PS2_01_VFD1_SI3","PS2_1_EPC2_2"]
["PS2_01_VFD1","SO0","PS2_01_VFD1_SO0"]
["PS2_02_VFD1","I0","PS2_02_VFD1_I0","PS2_2_VFD1_DISC"]
["PS2_02_VFD1","I1","PS2_02_VFD1_I1"]
["PS2_02_VFD1","I2","PS2_02_VFD1_I2","PS2_2_TPE1"]
["PS2_02_VFD1","I3","PS2_02_VFD1_I3","PS2_2_TPE2"]
["PS2_02_VFD1","IO0","PS2_02_VFD1_IO0","PS2_1_BCN1_R"]
["PS2_02_VFD1","IO1","PS2_02_VFD1_IO1","PS2_1_BCN2_R"]
["PS2_02_VFD1","SI0","PS2_02_VFD1_SI0"]
["PS2_02_VFD1","SI1","PS2_02_VFD1_SI1"]
["PS2_02_VFD1","SI2","PS2_02_VFD1_SI2"]
["PS2_02_VFD1","SI3","PS2_02_VFD1_SI3"]
["PS2_02_VFD1","SO0","PS2_02_VFD1_SO0"]
["PS2_03_VFD1","I0","PS2_03_VFD1_I0","PS2_3_VFD1_DISC",null,null,null,null,null," "]
["PS2_03_VFD1","I1","PS2_03_VFD1_I1"]
["PS2_03_VFD1","I2","PS2_03_VFD1_I2","PS2_3_TPE2"]
["PS2_03_VFD1","I3","PS2_03_VFD1_I3"]
["PS2_03_VFD1","IO0","PS2_03_VFD1_IO0","PS2_1_S2_PB"]
["PS2_03_VFD1","IO1","PS2_03_VFD1_IO1","PS2_1_S2_PB_LT"]
["PS2_03_VFD1","SI0","PS2_03_VFD1_SI0"]
["PS2_03_VFD1","SI1","PS2_03_VFD1_SI1"]
["PS2_03_VFD1","SI2","PS2_03_VFD1_SI2"]
["PS2_03_VFD1","SI3","PS2_03_VFD1_SI3"]
["PS2_03_VFD1","SO0","PS2_03_VFD1_SO0","PS2_3_BCN1_A"]
["PS2_04_VFD1","I0","PS2_04_VFD1_I0","PS2_4_VFD1_DISC"]
["PS2_04_VFD1","I1","PS2_04_VFD1_I1"]
["PS2_04_VFD1","I2","PS2_04_VFD1_I2"]
["PS2_04_VFD1","I3","PS2_04_VFD1_I3"]
["PS2_04_VFD1","IO0","PS2_04_VFD1_IO0","PS2_3_JR1_PB"]
["PS2_04_VFD1","IO1","PS2_04_VFD1_IO1","PS2_3_JR1_PB_LT"]
["PS2_04_VFD1","SI0","PS2_04_VFD1_SI0"]
["PS2_04_VFD1","SI1","PS2_04_VFD1_SI1"]
["PS2_04_VFD1","SI2","PS2_04_VFD1_SI2"]
["PS2_04_VFD1","SI3","PS2_04_VFD1_SI3"]
["PS2_04_VFD1","SO0","PS2_04_VFD1_SO0"]
["PS2_05_VFD1","I0","PS2_05_VFD1_I0","PS2_5_VFD1_DISC"]
["PS2_05_VFD1","I1","PS2_05_VFD1_I1"]
["PS2_05_VFD1","I2","PS2_05_VFD1_I2","PS2_5_TPE1"]
["PS2_05_VFD1","I3","PS2_05_VFD1_I3","PS2_5_TPE2"]
["PS2_05_VFD1","IO0","PS2_05_VFD1_IO0","PS2_6_S2_PB"]
["PS2_05_VFD1","IO1","PS2_05_VFD1_IO1","PS2_6_S2_PB_LT"]
["PS2_05_VFD1","SI0","PS2_05_VFD1_SI0"]
["PS2_05_VFD1","SI1","PS2_05_VFD1_SI1"]
["PS2_05_VFD1","SI2","PS2_05_VFD1_SI2"]
["PS2_05_VFD1","SI3","PS2_05_VFD1_SI3"]
["PS2_05_VFD1","SO0","PS2_05_VFD1_SO0","PS2_6_BCN2_R"]
["PS2_06_VFD1","I0","PS2_06_VFD1_I0","PS2_6_VFD1_DISC"]
["PS2_06_VFD1","I1","PS2_06_VFD1_I1"]
["PS2_06_VFD1","I2","PS2_06_VFD1_I2","PS2_6_TPE1"]
["PS2_06_VFD1","I3","PS2_06_VFD1_I3"]
["PS2_06_VFD1","IO0","PS2_06_VFD1_IO0","PS2_6_S1_PB"]
["PS2_06_VFD1","IO1","PS2_06_VFD1_IO1","PS2_6_S1_PB_LT"]
["PS2_06_VFD1","SI0","PS2_06_VFD1_SI0","PS2_6_EPC1"]
["PS2_06_VFD1","SI1","PS2_06_VFD1_SI1","PS2_6_EPC1_2"]
["PS2_06_VFD1","SI2","PS2_06_VFD1_SI2","PS2_6_EPC2"]
["PS2_06_VFD1","SI3","PS2_06_VFD1_SI3","PS2_6_EPC2_2"]
["PS2_06_VFD1","SO0","PS2_06_VFD1_SO0","PS2_6_BCN1_R"]
["PS3_01_VFD1","I0","PS3_01_VFD1_I0","PS3_1_VFD1_DISC"]
["PS3_01_VFD1","I1","PS3_01_VFD1_I1"]
["PS3_01_VFD1","I2","PS3_01_VFD1_I2","PS3_1_TPE1"]
["PS3_01_VFD1","I3","PS3_01_VFD1_I3"]
["PS3_01_VFD1","IO0","PS3_01_VFD1_IO0","PS3_1_BCN2_A"]
["PS3_01_VFD1","IO1","PS3_01_VFD1_IO1","PS3_1_BCN2_R"]
["PS3_01_VFD1","SI0","PS3_01_VFD1_SI0","PS3_1_EPC1"]
["PS3_01_VFD1","SI1","PS3_01_VFD1_SI1","PS3_1_EPC1_2"]
["PS3_01_VFD1","SI2","PS3_01_VFD1_SI2","PS3_1_EPC2"]
["PS3_01_VFD1","SI3","PS3_01_VFD1_SI3","PS3_1_EPC2_2"]
["PS3_01_VFD1","SO0","PS3_01_VFD1_SO0","PS3_1_BCN1_R"]
["PS3_02_VFD1","I0","PS3_02_VFD1_I0","PS3_2_VFD1_DISC"]
["PS3_02_VFD1","I1","PS3_02_VFD1_I1"]
["PS3_02_VFD1","I2","PS3_02_VFD1_I2","PS3_2_TPE1"]
["PS3_02_VFD1","I3","PS3_02_VFD1_I3"]
["PS3_02_VFD1","IO0","PS3_02_VFD1_IO0","PS3_1_S1_PB"]
["PS3_02_VFD1","IO1","PS3_02_VFD1_IO1","PS3_1_S1_PB_LT"]
["PS3_02_VFD1","SI0","PS3_02_VFD1_SI0"]
["PS3_02_VFD1","SI1","PS3_02_VFD1_SI1"]
["PS3_02_VFD1","SI2","PS3_02_VFD1_SI2"]
["PS3_02_VFD1","SI3","PS3_02_VFD1_SI3"]
["PS3_02_VFD1","SO0","PS3_02_VFD1_SO0"]
["PS3_03_VFD1","I0","PS3_03_VFD1_I0","PS3_3_VFD1_DISC"]
["PS3_03_VFD1","I1","PS3_03_VFD1_I1"]
["PS3_03_VFD1","I2","PS3_03_VFD1_I2","PS3_3_TPE2"]
["PS3_03_VFD1","I3","PS3_03_VFD1_I3"]
["PS3_03_VFD1","IO0","PS3_03_VFD1_IO0","PS3_1_S2_PB"]
["PS3_03_VFD1","IO1","PS3_03_VFD1_IO1","PS3_1_S2_PB_LT"]
["PS3_03_VFD1","SI0","PS3_03_VFD1_SI0"]
["PS3_03_VFD1","SI1","PS3_03_VFD1_SI1"]
["PS3_03_VFD1","SI2","PS3_03_VFD1_SI2"]
["PS3_03_VFD1","SI3","PS3_03_VFD1_SI3"]
["PS3_03_VFD1","SO0","PS3_03_VFD1_SO0","PS3_3_BCN1_A"]
["PS3_04_VFD1","I0","PS3_04_VFD1_I0","PS3_4_VFD1_DISC"]
["PS3_04_VFD1","I1","PS3_04_VFD1_I1"]
["PS3_04_VFD1","I2","PS3_04_VFD1_I2"]
["PS3_04_VFD1","I3","PS3_04_VFD1_I3"]
["PS3_04_VFD1","IO0","PS3_04_VFD1_IO0","PS3_3_JR1_PB"]
["PS3_04_VFD1","IO1","PS3_04_VFD1_IO1","PS3_3_JR1_PB_LT"]
["PS3_04_VFD1","SI0","PS3_04_VFD1_SI0"]
["PS3_04_VFD1","SI1","PS3_04_VFD1_SI1"]
["PS3_04_VFD1","SI2","PS3_04_VFD1_SI2"]
["PS3_04_VFD1","SI3","PS3_04_VFD1_SI3"]
["PS3_04_VFD1","SO0","PS3_04_VFD1_SO0"]
["PS3_05_VFD1","I0","PS3_05_VFD1_I0","PS3_5_VFD1_DISC"]
["PS3_05_VFD1","I1","PS3_05_VFD1_I1"]
["PS3_05_VFD1","I2","PS3_05_VFD1_I2","PS3_5_TPE1"]
["PS3_05_VFD1","I3","PS3_05_VFD1_I3","PS3_5_TPE2"]
["PS3_05_VFD1","IO0","PS3_05_VFD1_IO0"]
["PS3_05_VFD1","IO1","PS3_05_VFD1_IO1"]
["PS3_05_VFD1","SI0","PS3_05_VFD1_SI0"]
["PS3_05_VFD1","SI1","PS3_05_VFD1_SI1"]
["PS3_05_VFD1","SI2","PS3_05_VFD1_SI2"]
["PS3_05_VFD1","SI3","PS3_05_VFD1_SI3"]
["PS3_05_VFD1","SO0","PS3_05_VFD1_SO0"]
["PS3_06_VFD1","I0","PS3_06_VFD1_I0","PS3_6_VFD1_DISC"]
["PS3_06_VFD1","I1","PS3_06_VFD1_I1"]
["PS3_06_VFD1","I2","PS3_06_VFD1_I2","PS3_6_TPE1"]
["PS3_06_VFD1","I3","PS3_06_VFD1_I3"]
["PS3_06_VFD1","IO0","PS3_06_VFD1_IO0"]
["PS3_06_VFD1","IO1","PS3_06_VFD1_IO1"]
["PS3_06_VFD1","SI0","PS3_06_VFD1_SI0"]
["PS3_06_VFD1","SI1","PS3_06_VFD1_SI1"]
["PS3_06_VFD1","SI2","PS3_06_VFD1_SI2"]
["PS3_06_VFD1","SI3","PS3_06_VFD1_SI3"]
["PS3_06_VFD1","SO0","PS3_06_VFD1_SO0"]
["PS3_07_VFD1","I0","PS3_07_VFD1_I0","PS3_7_VFD1_DISC"]
["PS3_07_VFD1","I1","PS3_07_VFD1_I1"]
["PS3_07_VFD1","I2","PS3_07_VFD1_I2","PS3_7_TPE1"]
["PS3_07_VFD1","I3","PS3_07_VFD1_I3"]
["PS3_07_VFD1","IO0","PS3_07_VFD1_IO0","PS3_7_JR1_PB"]
["PS3_07_VFD1","IO1","PS3_07_VFD1_IO1","PS3_7_JR1_PB_LT"]
["PS3_07_VFD1","SI0","PS3_07_VFD1_SI0"]
["PS3_07_VFD1","SI1","PS3_07_VFD1_SI1"]
["PS3_07_VFD1","SI2","PS3_07_VFD1_SI2"]
["PS3_07_VFD1","SI3","PS3_07_VFD1_SI3"]
["PS3_07_VFD1","SO0","PS3_07_VFD1_SO0","PS3_7_BCN1_A"]
["PS3_08_VFD1","I0","PS3_08_VFD1_I0","PS3_8_VFD1_DISC"]
["PS3_08_VFD1","I1","PS3_08_VFD1_I1"]
["PS3_08_VFD1","I2","PS3_08_VFD1_I2"]
["PS3_08_VFD1","I3","PS3_08_VFD1_I3"]
["PS3_08_VFD1","IO0","PS3_08_VFD1_IO0"]
["PS3_08_VFD1","IO1","PS3_08_VFD1_IO1"]
["PS3_08_VFD1","SI0","PS3_08_VFD1_SI0"]
["PS3_08_VFD1","SI1","PS3_08_VFD1_SI1"]
["PS3_08_VFD1","SI2","PS3_08_VFD1_SI2"]
["PS3_08_VFD1","SI3","PS3_08_VFD1_SI3"]
["PS3_08_VFD1","SO0","PS3_08_VFD1_SO0"]
["PS3_09_VFD1","I0","PS3_09_VFD1_I0","PS3_9_VFD1_DISC"]
["PS3_09_VFD1","I1","PS3_09_VFD1_I1"]
["PS3_09_VFD1","I2","PS3_09_VFD1_I2","PS3_9_TPE1"]
["PS3_09_VFD1","I3","PS3_09_VFD1_I3","PS3_9_TPE2"]
["PS3_09_VFD1","IO0","PS3_09_VFD1_IO0","PS3_12_BCN1_R"]
["PS3_09_VFD1","IO1","PS3_09_VFD1_IO1","PS3_12_BCN1_H"]
["PS3_09_VFD1","SI0","PS3_09_VFD1_SI0"]
["PS3_09_VFD1","SI1","PS3_09_VFD1_SI1"]
["PS3_09_VFD1","SI2","PS3_09_VFD1_SI2"]
["PS3_09_VFD1","SI3","PS3_09_VFD1_SI3"]
["PS3_09_VFD1","SO0","PS3_09_VFD1_SO0"]
["PS3_10_VFD1","I0","PS3_10_VFD1_I0","PS3_10_VFD1_DISC"]
["PS3_10_VFD1","I1","PS3_10_VFD1_I1"]
["PS3_10_VFD1","I2","PS3_10_VFD1_I2","PS3_10_TPE1"]
["PS3_10_VFD1","I3","PS3_10_VFD1_I3"]
["PS3_10_VFD1","IO0","PS3_10_VFD1_IO0","PS3_12_S2_PB"]
["PS3_10_VFD1","IO1","PS3_10_VFD1_IO1","PS3_12_S2_PB_LT"]
["PS3_10_VFD1","SI0","PS3_10_VFD1_SI0"]
["PS3_10_VFD1","SI1","PS3_10_VFD1_SI1"]
["PS3_10_VFD1","SI2","PS3_10_VFD1_SI2"]
["PS3_10_VFD1","SI3","PS3_10_VFD1_SI3"]
["PS3_10_VFD1","SO0","PS3_10_VFD1_SO0"]
["PS3_11_VFD1","I0","PS3_11_VFD1_I0","PS3_11_VFD1_DISC"]
["PS3_11_VFD1","I1","PS3_11_VFD1_I1"]
["PS3_11_VFD1","I2","PS3_11_VFD1_I2"]
["PS3_11_VFD1","I3","PS3_11_VFD1_I3"]
["PS3_11_VFD1","IO0","PS3_11_VFD1_IO0","PS3_12_S1_PB"]
["PS3_11_VFD1","IO1","PS3_11_VFD1_IO1","PS3_12_S1_PB_LT"]
["PS3_11_VFD1","SI0","PS3_11_VFD1_SI0"]
["PS3_11_VFD1","SI1","PS3_11_VFD1_SI1"]
["PS3_11_VFD1","SI2","PS3_11_VFD1_SI2"]
["PS3_11_VFD1","SI3","PS3_11_VFD1_SI3"]
["PS3_11_VFD1","SO0","PS3_11_VFD1_SO0"]
["PS3_12_VFD1","I0","PS3_12_VFD1_I0","PS3_12_VFD1_DISC"]
["PS3_12_VFD1","I1","PS3_12_VFD1_I1"]
["PS3_12_VFD1","I2","PS3_12_VFD1_I2","PS3_12_TPE1"]
["PS3_12_VFD1","I3","PS3_12_VFD1_I3","PS3_12_TPE2"]
["PS3_12_VFD1","IO0","PS3_12_VFD1_IO0","PS3_12_BCN2_A"]
["PS3_12_VFD1","IO1","PS3_12_VFD1_IO1","PS3_12_BCN2_R"]
["PS3_12_VFD1","SI0","PS3_12_VFD1_SI0","PS3_12_EPC1"]
["PS3_12_VFD1","SI1","PS3_12_VFD1_SI1","PS3_12_EPC1_2"]
["PS3_12_VFD1","SI2","PS3_12_VFD1_SI2","PS3_12_EPC2"]
["PS3_12_VFD1","SI3","PS3_12_VFD1_SI3","PS3_12_EPC2_2"]
["PS3_12_VFD1","SO0","PS3_12_VFD1_SO0"]
["PS4_01_VFD1","I0","PS4_01_VFD1_I0","PS4_1_VFD1_DISC"]
["PS4_01_VFD1","I1","PS4_01_VFD1_I1"]
["PS4_01_VFD1","I2","PS4_01_VFD1_I2"]
["PS4_01_VFD1","I3","PS4_01_VFD1_I3"]
["PS4_01_VFD1","IO0","PS4_01_VFD1_IO0","PS4_1_BCN1_R"]
["PS4_01_VFD1","IO1","PS4_01_VFD1_IO1","PS4_1_BCN2_R"]
["PS4_01_VFD1","SI0","PS4_01_VFD1_SI0","PS4_1_EPC1"]
["PS4_01_VFD1","SI1","PS4_01_VFD1_SI1","PS4_1_EPC1_2"]
["PS4_01_VFD1","SI2","PS4_01_VFD1_SI2","PS4_1_EPC2"]
["PS4_01_VFD1","SI3","PS4_01_VFD1_SI3","PS4_1_EPC2_2"]
["PS4_01_VFD1","SO0","PS4_01_VFD1_SO0"]
["PS4_02_VFD1","I0","PS4_02_VFD1_I0","PS4_2_VFD1_DISC"]
["PS4_02_VFD1","I1","PS4_02_VFD1_I1"]
["PS4_02_VFD1","I2","PS4_02_VFD1_I2","PS4_2_TPE1"]
["PS4_02_VFD1","I3","PS4_02_VFD1_I3","PS4_2_TPE2"]
["PS4_02_VFD1","IO0","PS4_02_VFD1_IO0","PS4_1_S1_PB"]
["PS4_02_VFD1","IO1","PS4_02_VFD1_IO1","PS4_1_S1_PB_LT"]
["PS4_02_VFD1","SI0","PS4_02_VFD1_SI0"]
["PS4_02_VFD1","SI1","PS4_02_VFD1_SI1"]
["PS4_02_VFD1","SI2","PS4_02_VFD1_SI2"]
["PS4_02_VFD1","SI3","PS4_02_VFD1_SI3"]
["PS4_02_VFD1","SO0","PS4_02_VFD1_SO0"]
["PS4_03_VFD1","I0","PS4_03_VFD1_I0","PS4_3_VFD1_DISC"]
["PS4_03_VFD1","I1","PS4_03_VFD1_I1"]
["PS4_03_VFD1","I2","PS4_03_VFD1_I2"]
["PS4_03_VFD1","I3","PS4_03_VFD1_I3"]
["PS4_03_VFD1","IO0","PS4_03_VFD1_IO0","PS4_1_S2_PB"]
["PS4_03_VFD1","IO1","PS4_03_VFD1_IO1","PS4_1_S2_PB_LT"]
["PS4_03_VFD1","SI0","PS4_03_VFD1_SI0"]
["PS4_03_VFD1","SI1","PS4_03_VFD1_SI1"]
["PS4_03_VFD1","SI2","PS4_03_VFD1_SI2"]
["PS4_03_VFD1","SI3","PS4_03_VFD1_SI3"]
["PS4_03_VFD1","SO0","PS4_03_VFD1_SO0"]
["PS4_04_VFD1","I0","PS4_04_VFD1_I0","PS4_4_VFD1_DISC"]
["PS4_04_VFD1","I1","PS4_04_VFD1_I1"]
["PS4_04_VFD1","I2","PS4_04_VFD1_I2","PS4_4_TPE1"]
["PS4_04_VFD1","I3","PS4_04_VFD1_I3","PS4_4_TPE2"]
["PS4_04_VFD1","IO0","PS4_04_VFD1_IO0","PS4_2_JR1_PB"]
["PS4_04_VFD1","IO1","PS4_04_VFD1_IO1","PS4_2_JR1_PB_LT"]
["PS4_04_VFD1","SI0","PS4_04_VFD1_SI0"]
["PS4_04_VFD1","SI1","PS4_04_VFD1_SI1"]
["PS4_04_VFD1","SI2","PS4_04_VFD1_SI2"]
["PS4_04_VFD1","SI3","PS4_04_VFD1_SI3"]
["PS4_04_VFD1","SO0","PS4_04_VFD1_SO0"]
["PS4_05_VFD1","I0","PS4_05_VFD1_I0","PS4_5_VFD1_DISC"]
["PS4_05_VFD1","I1","PS4_05_VFD1_I1"]
["PS4_05_VFD1","I2","PS4_05_VFD1_I2","PS4_5_TPE1"]
["PS4_05_VFD1","I3","PS4_05_VFD1_I3"]
["PS4_05_VFD1","IO0","PS4_05_VFD1_IO0","PS4_2_BCN1_A"]
["PS4_05_VFD1","IO1","PS4_05_VFD1_IO1","PS4_2_BCN1_H"]
["PS4_05_VFD1","SI0","PS4_05_VFD1_SI0"]
["PS4_05_VFD1","SI1","PS4_05_VFD1_SI1"]
["PS4_05_VFD1","SI2","PS4_05_VFD1_SI2"]
["PS4_05_VFD1","SI3","PS4_05_VFD1_SI3"]
["PS4_05_VFD1","SO0","PS4_05_VFD1_SO0"]
["PS4_06_VFD1","I0","PS4_06_VFD1_I0","PS4_6_VFD1_DISC"]
["PS4_06_VFD1","I1","PS4_06_VFD1_I1"]
["PS4_06_VFD1","I2","PS4_06_VFD1_I2","PS4_6_TPE1"]
["PS4_06_VFD1","I3","PS4_06_VFD1_I3"]
["PS4_06_VFD1","IO0","PS4_06_VFD1_IO0"]
["PS4_06_VFD1","IO1","PS4_06_VFD1_IO1"]
["PS4_06_VFD1","SI0","PS4_06_VFD1_SI0"]
["PS4_06_VFD1","SI1","PS4_06_VFD1_SI1"]
["PS4_06_VFD1","SI2","PS4_06_VFD1_SI2"]
["PS4_06_VFD1","SI3","PS4_06_VFD1_SI3"]
["PS4_06_VFD1","SO0","PS4_06_VFD1_SO0"]
["PS4_07_VFD1","I0","PS4_07_VFD1_I0","PS4_7_VFD1_DISC"]
["PS4_07_VFD1","I1","PS4_07_VFD1_I1"]
["PS4_07_VFD1","I2","PS4_07_VFD1_I2","PS4_7_TPE1"]
["PS4_07_VFD1","I3","PS4_07_VFD1_I3"]
["PS4_07_VFD1","IO0","PS4_07_VFD1_IO0"]
["PS4_07_VFD1","IO1","PS4_07_VFD1_IO1"]
["PS4_07_VFD1","SI0","PS4_07_VFD1_SI0"]
["PS4_07_VFD1","SI1","PS4_07_VFD1_SI1"]
["PS4_07_VFD1","SI2","PS4_07_VFD1_SI2"]
["PS4_07_VFD1","SI3","PS4_07_VFD1_SI3"]
["PS4_07_VFD1","SO0","PS4_07_VFD1_SO0"]
["PS4_08_VFD1","I0","PS4_08_VFD1_I0","PS4_8_VFD1_DISC"]
["PS4_08_VFD1","I1","PS4_08_VFD1_I1"]
["PS4_08_VFD1","I2","PS4_08_VFD1_I2","PS4_8_TPE1"]
["PS4_08_VFD1","I3","PS4_08_VFD1_I3"]
["PS4_08_VFD1","IO0","PS4_08_VFD1_IO0","PS4_8_JR1_PB"]
["PS4_08_VFD1","IO1","PS4_08_VFD1_IO1","PS4_8_JR1_PB_LT"]
["PS4_08_VFD1","SI0","PS4_08_VFD1_SI0"]
["PS4_08_VFD1","SI1","PS4_08_VFD1_SI1"]
["PS4_08_VFD1","SI2","PS4_08_VFD1_SI2"]
["PS4_08_VFD1","SI3","PS4_08_VFD1_SI3"]
["PS4_08_VFD1","SO0","PS4_08_VFD1_SO0","PS4_8_BCN1_A"]
["PS4_09_VFD1","I0","PS4_09_VFD1_I0","PS4_9_VFD1_DISC"]
["PS4_09_VFD1","I1","PS4_09_VFD1_I1"]
["PS4_09_VFD1","I2","PS4_09_VFD1_I2"]
["PS4_09_VFD1","I3","PS4_09_VFD1_I3"]
["PS4_09_VFD1","IO0","PS4_09_VFD1_IO0"]
["PS4_09_VFD1","IO1","PS4_09_VFD1_IO1"]
["PS4_09_VFD1","SI0","PS4_09_VFD1_SI0"]
["PS4_09_VFD1","SI1","PS4_09_VFD1_SI1"]
["PS4_09_VFD1","SI2","PS4_09_VFD1_SI2"]
["PS4_09_VFD1","SI3","PS4_09_VFD1_SI3"]
["PS4_09_VFD1","SO0","PS4_09_VFD1_SO0"]
["PS4_10_VFD1","I0","PS4_10_VFD1_I0","PS4_10_VFD1_DISC"]
["PS4_10_VFD1","I1","PS4_10_VFD1_I1"]
["PS4_10_VFD1","I2","PS4_10_VFD1_I2","PS4_10_TPE1"]
["PS4_10_VFD1","I3","PS4_10_VFD1_I3","PS4_10_TPE2"]
["PS4_10_VFD1","IO0","PS4_10_VFD1_IO0"]
["PS4_10_VFD1","IO1","PS4_10_VFD1_IO1"]
["PS4_10_VFD1","SI0","PS4_10_VFD1_SI0"]
["PS4_10_VFD1","SI1","PS4_10_VFD1_SI1"]
["PS4_10_VFD1","SI2","PS4_10_VFD1_SI2"]
["PS4_10_VFD1","SI3","PS4_10_VFD1_SI3"]
["PS4_10_VFD1","SO0","PS4_10_VFD1_SO0"]
["PS4_11_VFD1","I0","PS4_11_VFD1_I0","PS4_11_VFD1_DISC"]
["PS4_11_VFD1","I1","PS4_11_VFD1_I1"]
["PS4_11_VFD1","I2","PS4_11_VFD1_I2","PS4_11_TPE1"]
["PS4_11_VFD1","I3","PS4_11_VFD1_I3"]
["PS4_11_VFD1","IO0","PS4_11_VFD1_IO0","PS4_14_S2_PB"]
["PS4_11_VFD1","IO1","PS4_11_VFD1_IO1","PS4_14_S2_PB_LT"]
["PS4_11_VFD1","SI0","PS4_11_VFD1_SI0"]
["PS4_11_VFD1","SI1","PS4_11_VFD1_SI1"]
["PS4_11_VFD1","SI2","PS4_11_VFD1_SI2"]
["PS4_11_VFD1","SI3","PS4_11_VFD1_SI3"]
["PS4_11_VFD1","SO0","PS4_11_VFD1_SO0"]
["PS4_12_VFD1","I0","PS4_12_VFD1_I0","PS4_12_VFD1_DISC"]
["PS4_12_VFD1","I1","PS4_12_VFD1_I1"]
["PS4_12_VFD1","I2","PS4_12_VFD1_I2","PS4_12_TPE1"]
["PS4_12_VFD1","I3","PS4_12_VFD1_I3"]
["PS4_12_VFD1","IO0","PS4_12_VFD1_IO0","PS4_14_S1_PB"]
["PS4_12_VFD1","IO1","PS4_12_VFD1_IO1","PS4_14_S1_PB_LT"]
["PS4_12_VFD1","SI0","PS4_12_VFD1_SI0"]
["PS4_12_VFD1","SI1","PS4_12_VFD1_SI1"]
["PS4_12_VFD1","SI2","PS4_12_VFD1_SI2"]
["PS4_12_VFD1","SI3","PS4_12_VFD1_SI3"]
["PS4_12_VFD1","SO0","PS4_12_VFD1_SO0"]
["PS4_13_VFD1","I0","PS4_13_VFD1_I0","PS4_13_VFD1_DISC"]
["PS4_13_VFD1","I1","PS4_13_VFD1_I1"]
["PS4_13_VFD1","I2","PS4_13_VFD1_I2"]
["PS4_13_VFD1","I3","PS4_13_VFD1_I3"]
["PS4_13_VFD1","IO0","PS4_13_VFD1_IO0","PS4_13_JR1_PB"]
["PS4_13_VFD1","IO1","PS4_13_VFD1_IO1","PS4_13_JR1_PB_LT"]
["PS4_13_VFD1","SI0","PS4_13_VFD1_SI0"]
["PS4_13_VFD1","SI1","PS4_13_VFD1_SI1"]
["PS4_13_VFD1","SI2","PS4_13_VFD1_SI2"]
["PS4_13_VFD1","SI3","PS4_13_VFD1_SI3"]
["PS4_13_VFD1","SO0","PS4_13_VFD1_SO0","PS4_13_BCN1_A"]
["PS4_14_VFD1","I0","PS4_14_VFD1_I0","PS4_14_VFD1_DISC"]
["PS4_14_VFD1","I1","PS4_14_VFD1_I1"]
["PS4_14_VFD1","I2","PS4_14_VFD1_I2","PS4_14_TPE1"]
["PS4_14_VFD1","I3","PS4_14_VFD1_I3"]
["PS4_14_VFD1","IO0","PS4_14_VFD1_IO0","PS4_14_BCN1_A"]
["PS4_14_VFD1","IO1","PS4_14_VFD1_IO1","PS4_14_BCN1_R"]
["PS4_14_VFD1","SI0","PS4_14_VFD1_SI0","PS4_14_EPC1"]
["PS4_14_VFD1","SI1","PS4_14_VFD1_SI1","PS4_14_EPC1_2"]
["PS4_14_VFD1","SI2","PS4_14_VFD1_SI2","PS4_14_EPC2"]
["PS4_14_VFD1","SI3","PS4_14_VFD1_SI3","PS4_14_EPC2_2"]
["PS4_14_VFD1","SO0","PS4_14_VFD1_SO0","PS4_14_BCN2_R"]
["UL1_03_FIO1","IO00","UL1_03_FIO1_IO00","UL1_3_BCN1_R"]
["UL1_03_FIO1","IO01","UL1_03_FIO1_IO01"]
["UL1_03_FIO1","IO02","UL1_03_FIO1_IO02","UL1_3_BCN2_R"]
["UL1_03_FIO1","IO03","UL1_03_FIO1_IO03"]
["UL1_03_FIO1","IO04","UL1_03_FIO1_IO04","UL1_3_LPE1"]
["UL1_03_FIO1","IO05","UL1_03_FIO1_IO05"]
["UL1_03_FIO1","IO06","UL1_03_FIO1_IO06","UL1_3_LPE2"]
["UL1_03_FIO1","IO07","UL1_03_FIO1_IO07"]
["UL1_03_FIO1","IO08","UL1_03_FIO1_IO08","UL1_3_S1_PB"]
["UL1_03_FIO1","IO09","UL1_03_FIO1_IO09","UL1_3_S1_PB_LT"]
["UL1_03_FIO1","IO10","UL1_03_FIO1_IO10","UL1_3_S2_PB"]
["UL1_03_FIO1","IO11","UL1_03_FIO1_IO11","UL1_3_S2_PB_LT"]
["UL1_03_FIO1","IO12","UL1_03_FIO1_IO12"]
["UL1_03_FIO1","IO13","UL1_03_FIO1_IO13"]
["UL1_03_FIO1","IO14","UL1_03_FIO1_IO14"]
["UL1_03_FIO1","IO15","UL1_03_FIO1_IO15"]
["UL1_03_VFD1","I0","UL1_03_VFD1_I0","UL1_3_VFD1_DISC"]
["UL1_03_VFD1","I1","UL1_03_VFD1_I1","UL1_3_ENC1"]
["UL1_03_VFD1","I2","UL1_03_VFD1_I2","UL1_3_TPE1"]
["UL1_03_VFD1","I3","UL1_03_VFD1_I3","UL1_3_TPE2"]
["UL1_03_VFD1","IO0","UL1_03_VFD1_IO0"]
["UL1_03_VFD1","IO1","UL1_03_VFD1_IO1"]
["UL1_03_VFD1","SI0","UL1_03_VFD1_SI0","UL1_3_EPC1"]
["UL1_03_VFD1","SI1","UL1_03_VFD1_SI1","UL1_3_EPC1_2"]
["UL1_03_VFD1","SI2","UL1_03_VFD1_SI2","UL1_3_EPC2"]
["UL1_03_VFD1","SI3","UL1_03_VFD1_SI3","UL1_3_EPC2_2"]
["UL1_03_VFD1","SO0","UL1_03_VFD1_SO0"]
["UL1_04_VFD1","I0","UL1_04_VFD1_I0","UL1_4_VFD1_DISC"]
["UL1_04_VFD1","I1","UL1_04_VFD1_I1","UL1_4_ENC1"]
["UL1_04_VFD1","I2","UL1_04_VFD1_I2","UL1_4_TPE1"]
["UL1_04_VFD1","I3","UL1_04_VFD1_I3"]
["UL1_04_VFD1","IO0","UL1_04_VFD1_IO0","UL1_4_S1_PB"]
["UL1_04_VFD1","IO1","UL1_04_VFD1_IO1","UL1_4_S1_PB_LT"]
["UL1_04_VFD1","SI0","UL1_04_VFD1_SI0","UL1_4_EPC1"]
["UL1_04_VFD1","SI1","UL1_04_VFD1_SI1","UL1_4_EPC1_2"]
["UL1_04_VFD1","SI2","UL1_04_VFD1_SI2","UL1_4_EPC2"]
["UL1_04_VFD1","SI3","UL1_04_VFD1_SI3","UL1_4_EPC2_2"]
["UL1_04_VFD1","SO0","UL1_04_VFD1_SO0"]
["UL1_05_VFD1","I0","UL1_05_VFD1_I0","UL1_5_VFD1_DISC"]
["UL1_05_VFD1","I1","UL1_05_VFD1_I1","UL1_5_ENC1"]
["UL1_05_VFD1","I2","UL1_05_VFD1_I2","UL1_5_TPE1"]
["UL1_05_VFD1","I3","UL1_05_VFD1_I3"]
["UL1_05_VFD1","IO0","UL1_05_VFD1_IO0","UL1_4_S2_PB"]
["UL1_05_VFD1","IO1","UL1_05_VFD1_IO1","UL1_4_S2_PB_LT"]
["UL1_05_VFD1","SI0","UL1_05_VFD1_SI0"]
["UL1_05_VFD1","SI1","UL1_05_VFD1_SI1"]
["UL1_05_VFD1","SI2","UL1_05_VFD1_SI2"]
["UL1_05_VFD1","SI3","UL1_05_VFD1_SI3"]
["UL1_05_VFD1","SO0","UL1_05_VFD1_SO0"]
["UL1_06_VFD1","I0","UL1_06_VFD1_I0","UL1_6_VFD1_DISC"]
["UL1_06_VFD1","I1","UL1_06_VFD1_I1","UL1_6_ENC1"]
["UL1_06_VFD1","I2","UL1_06_VFD1_I2","UL1_6_TPE1"]
["UL1_06_VFD1","I3","UL1_06_VFD1_I3"]
["UL1_06_VFD1","IO0","UL1_06_VFD1_IO0","UL1_4_BCN1_R"]
["UL1_06_VFD1","IO1","UL1_06_VFD1_IO1","UL1_4_BCN2_R"]
["UL1_06_VFD1","SI0","UL1_06_VFD1_SI0"]
["UL1_06_VFD1","SI1","UL1_06_VFD1_SI1"]
["UL1_06_VFD1","SI2","UL1_06_VFD1_SI2"]
["UL1_06_VFD1","SI3","UL1_06_VFD1_SI3"]
["UL1_06_VFD1","SO0","UL1_06_VFD1_SO0"]
["UL1_07_VFD1","I0","UL1_07_VFD1_I0","UL1_7_VFD1_DISC"]
["UL1_07_VFD1","I1","UL1_07_VFD1_I1","UL1_7_ENC1"]
["UL1_07_VFD1","I2","UL1_07_VFD1_I2","UL1_7_TPE1"]
["UL1_07_VFD1","I3","UL1_07_VFD1_I3"]
["UL1_07_VFD1","IO0","UL1_07_VFD1_IO0","UL1_9_S1_PB"]
["UL1_07_VFD1","IO1","UL1_07_VFD1_IO1","UL1_9_S1_PB_LT"]
["UL1_07_VFD1","SI0","UL1_07_VFD1_SI0"]
["UL1_07_VFD1","SI1","UL1_07_VFD1_SI1"]
["UL1_07_VFD1","SI2","UL1_07_VFD1_SI2"]
["UL1_07_VFD1","SI3","UL1_07_VFD1_SI3"]
["UL1_07_VFD1","SO0","UL1_07_VFD1_SO0"]
["UL1_08_VFD1","I0","UL1_08_VFD1_I0","UL1_8_VFD1_DISC"]
["UL1_08_VFD1","I1","UL1_08_VFD1_I1","UL1_8_ENC1"]
["UL1_08_VFD1","I2","UL1_08_VFD1_I2","UL1_8_TPE1"]
["UL1_08_VFD1","I3","UL1_08_VFD1_I3","UL1_9_JR1_PB"]
["UL1_08_VFD1","IO0","UL1_08_VFD1_IO0","UL1_9_JR1_PB_LT"]
["UL1_08_VFD1","IO1","UL1_08_VFD1_IO1"]
["UL1_08_VFD1","SI0","UL1_08_VFD1_SI0"]
["UL1_08_VFD1","SI1","UL1_08_VFD1_SI1"]
["UL1_08_VFD1","SI2","UL1_08_VFD1_SI2"]
["UL1_08_VFD1","SI3","UL1_08_VFD1_SI3"]
["UL1_08_VFD1","SO0","UL1_08_VFD1_SO0"]
["UL1_09_VFD1","I0","UL1_09_VFD1_I0","UL1_9_VFD1_DISC"]
["UL1_09_VFD1","I1","UL1_09_VFD1_I1","UL1_9_ENC1"]
["UL1_09_VFD1","I2","UL1_09_VFD1_I2","UL1_9_TPE1"]
["UL1_09_VFD1","I3","UL1_09_VFD1_I3","UL1_9_TPE2"]
["UL1_09_VFD1","IO0","UL1_09_VFD1_IO0","UL1_9_BCN1_R"]
["UL1_09_VFD1","IO1","UL1_09_VFD1_IO1","UL1_9_BCN1_A"]
["UL1_09_VFD1","SI0","UL1_09_VFD1_SI0","UL1_9_EPC1"]
["UL1_09_VFD1","SI1","UL1_09_VFD1_SI1","UL1_9_EPC1_2"]
["UL1_09_VFD1","SI2","UL1_09_VFD1_SI2","UL1_9_EPC2"]
["UL1_09_VFD1","SI3","UL1_09_VFD1_SI3","UL1_9_EPC2_2"]
["UL1_09_VFD1","SO0","UL1_09_VFD1_SO0","UL1_9_BCN2_R"]
["UL1_10A_VFD1","I0","UL1_10A_VFD1_I0","UL1_10A_VFD1_DISC"]
["UL1_10A_VFD1","I1","UL1_10A_VFD1_I1","UL1_9_TPE3"]
["UL1_10A_VFD1","I2","UL1_10A_VFD1_I2","UL1_9_TPE4"]
["UL1_10A_VFD1","I3","UL1_10A_VFD1_I3","UL1_9_TPE5"]
["UL1_10A_VFD1","IO0","UL1_10A_VFD1_IO0","UL1_9_S2_PB"]
["UL1_10A_VFD1","IO1","UL1_10A_VFD1_IO1","UL1_9_S2_PB_LT"]
["UL1_10A_VFD1","SI0","UL1_10A_VFD1_SI0"]
["UL1_10A_VFD1","SI1","UL1_10A_VFD1_SI1"]
["UL1_10A_VFD1","SI2","UL1_10A_VFD1_SI2"]
["UL1_10A_VFD1","SI3","UL1_10A_VFD1_SI3"]
["UL1_10A_VFD1","SO0","UL1_10A_VFD1_SO0"]
["UL1_10B_VFD1","I0","UL1_10B_VFD1_I0","UL1_10B_VFD1_DISC"]
["UL1_10B_VFD1","I1","UL1_10B_VFD1_I1"]
["UL1_10B_VFD1","I2","UL1_10B_VFD1_I2"]
["UL1_10B_VFD1","I3","UL1_10B_VFD1_I3"]
["UL1_10B_VFD1","IO0","UL1_10B_VFD1_IO0"]
["UL1_10B_VFD1","IO1","UL1_10B_VFD1_IO1"]
["UL1_10B_VFD1","SI0","UL1_10B_VFD1_SI0"]
["UL1_10B_VFD1","SI1","UL1_10B_VFD1_SI1"]
["UL1_10B_VFD1","SI2","UL1_10B_VFD1_SI2"]
["UL1_10B_VFD1","SI3","UL1_10B_VFD1_SI3"]
["UL1_10B_VFD1","SO0","UL1_10B_VFD1_SO0"]
["UL1_11_VFD1","I0","UL1_11_VFD1_I0","UL1_11_VFD1_DISC"]
["UL1_11_VFD1","I1","UL1_11_VFD1_I1"]
["UL1_11_VFD1","I2","UL1_11_VFD1_I2","UL1_11_TPE1"]
["UL1_11_VFD1","I3","UL1_11_VFD1_I3","UL1_11_TPE2"]
["UL1_11_VFD1","IO0","UL1_11_VFD1_IO0"]
["UL1_11_VFD1","IO1","UL1_11_VFD1_IO1"]
["UL1_11_VFD1","SI0","UL1_11_VFD1_SI0"]
["UL1_11_VFD1","SI1","UL1_11_VFD1_SI1"]
["UL1_11_VFD1","SI2","UL1_11_VFD1_SI2"]
["UL1_11_VFD1","SI3","UL1_11_VFD1_SI3"]
["UL1_11_VFD1","SO0","UL1_11_VFD1_SO0"]
["UL1_12_VFD1","I0","UL1_12_VFD1_I0","UL1_12_VFD1_DISC"]
["UL1_12_VFD1","I1","UL1_12_VFD1_I1"]
["UL1_12_VFD1","I2","UL1_12_VFD1_I2","UL1_12_TPE1"]
["UL1_12_VFD1","I3","UL1_12_VFD1_I3"]
["UL1_12_VFD1","IO0","UL1_12_VFD1_IO0"]
["UL1_12_VFD1","IO1","UL1_12_VFD1_IO1"]
["UL1_12_VFD1","SI0","UL1_12_VFD1_SI0"]
["UL1_12_VFD1","SI1","UL1_12_VFD1_SI1"]
["UL1_12_VFD1","SI2","UL1_12_VFD1_SI2"]
["UL1_12_VFD1","SI3","UL1_12_VFD1_SI3"]
["UL1_12_VFD1","SO0","UL1_12_VFD1_SO0"]
["UL1_13_VFD1","I0","UL1_13_VFD1_I0","UL1_13_VFD1_DISC"]
["UL1_13_VFD1","I1","UL1_13_VFD1_I1"]
["UL1_13_VFD1","I2","UL1_13_VFD1_I2"]
["UL1_13_VFD1","I3","UL1_13_VFD1_I3"]
["UL1_13_VFD1","IO0","UL1_13_VFD1_IO0"]
["UL1_13_VFD1","IO1","UL1_13_VFD1_IO1"]
["UL1_13_VFD1","SI0","UL1_13_VFD1_SI0"]
["UL1_13_VFD1","SI1","UL1_13_VFD1_SI1"]
["UL1_13_VFD1","SI2","UL1_13_VFD1_SI2"]
["UL1_13_VFD1","SI3","UL1_13_VFD1_SI3"]
["UL1_13_VFD1","SO0","UL1_13_VFD1_SO0"]
["UL1_13_VFD1","ENC","UL1_13_VFD1_ENC1","UL1_13_ENC1","2025-06-06"]
["UL10_01_VFD1","I0","UL10_01_VFD1_I0","UL10_1_VFD1_DISC"]
["UL10_01_VFD1","I1","UL10_01_VFD1_I1"]
["UL10_01_VFD1","I2","UL10_01_VFD1_I2","UL10_1_TPE1"]
["UL10_01_VFD1","I3","UL10_01_VFD1_I3"]
["UL10_01_VFD1","IO0","UL10_01_VFD1_IO0"]
["UL10_01_VFD1","IO1","UL10_01_VFD1_IO1"]
["UL10_01_VFD1","SI0","UL10_01_VFD1_SI0","UL10_1_EPC1"]
["UL10_01_VFD1","SI1","UL10_01_VFD1_SI1","UL10_1_EPC1_2"]
["UL10_01_VFD1","SI2","UL10_01_VFD1_SI2","UL10_1_EPC2"]
["UL10_01_VFD1","SI3","UL10_01_VFD1_SI3","UL10_1_EPC2_2"]
["UL10_01_VFD1","SO0","UL10_01_VFD1_SO0"]
["UL10_02_FIO1","IO00","UL10_02_FIO1_IO00","UL10_1_BCN1_R"]
["UL10_02_FIO1","IO01","UL10_02_FIO1_IO01"]
["UL10_02_FIO1","IO02","UL10_02_FIO1_IO02","UL10_1_BCN2_R"]
["UL10_02_FIO1","IO03","UL10_02_FIO1_IO03"]
["UL10_02_FIO1","IO04","UL10_02_FIO1_IO04","UL10_1_SS1_SPB"]
["UL10_02_FIO1","IO05","UL10_02_FIO1_IO05","UL10_1_SS1_STPB"]
["UL10_02_FIO1","IO06","UL10_02_FIO1_IO06","UL10_1_SS1_STPB_LT"]
["UL10_02_FIO1","IO07","UL10_02_FIO1_IO07"]
["UL10_02_FIO1","IO08","UL10_02_FIO1_IO08","UL10_2_LPE1"]
["UL10_02_FIO1","IO09","UL10_02_FIO1_IO09"]
["UL10_02_FIO1","IO10","UL10_02_FIO1_IO10","UL10_2_LPE2"]
["UL10_02_FIO1","IO11","UL10_02_FIO1_IO11"]
["UL10_02_FIO1","IO12","UL10_02_FIO1_IO12"]
["UL10_02_FIO1","IO13","UL10_02_FIO1_IO13"]
["UL10_02_FIO1","IO14","UL10_02_FIO1_IO14"]
["UL10_02_FIO1","IO15","UL10_02_FIO1_IO15"]
["UL10_02_VFD1","I0","UL10_02_VFD1_I0","UL10_2_VFD1_DISC"]
["UL10_02_VFD1","I1","UL10_02_VFD1_I1"]
["UL10_02_VFD1","I2","UL10_02_VFD1_I2","UL10_2_TPE1"]
["UL10_02_VFD1","I3","UL10_02_VFD1_I3","UL10_2_TPE2"]
["UL10_02_VFD1","IO0","UL10_02_VFD1_IO0"]
["UL10_02_VFD1","IO1","UL10_02_VFD1_IO1"]
["UL10_02_VFD1","SI0","UL10_02_VFD1_SI0"]
["UL10_02_VFD1","SI1","UL10_02_VFD1_SI1"]
["UL10_02_VFD1","SI2","UL10_02_VFD1_SI2"]
["UL10_02_VFD1","SI3","UL10_02_VFD1_SI3"]
["UL10_02_VFD1","SO0","UL10_02_VFD1_SO0"]
["UL10_03_VFD1","I0","UL10_03_VFD1_I0","UL10_3_VFD1_DISC"]
["UL10_03_VFD1","I1","UL10_03_VFD1_I1"]
["UL10_03_VFD1","I2","UL10_03_VFD1_I2","UL10_3_TPE1"]
["UL10_03_VFD1","I3","UL10_03_VFD1_I3"]
["UL10_03_VFD1","IO0","UL10_03_VFD1_IO0","UL10_3_BCN1_R"]
["UL10_03_VFD1","IO1","UL10_03_VFD1_IO1","UL10_3_BCN1_H"]
["UL10_03_VFD1","SI0","UL10_03_VFD1_SI0","UL10_3_EPC1"]
["UL10_03_VFD1","SI1","UL10_03_VFD1_SI1","UL10_3_EPC1_2"]
["UL10_03_VFD1","SI2","UL10_03_VFD1_SI2","UL10_3_EPC2"]
["UL10_03_VFD1","SI3","UL10_03_VFD1_SI3","UL10_3_EPC2_2"]
["UL10_03_VFD1","SO0","UL10_03_VFD1_SO0","UL10_3_BCN2_R"]
["UL10_04_VFD1","I0","UL10_04_VFD1_I0","UL10_4_VFD1_DISC"]
["UL10_04_VFD1","I1","UL10_04_VFD1_I1","UL10_4_ENC1"]
["UL10_04_VFD1","I2","UL10_04_VFD1_I2","UL10_4_TPE1"]
["UL10_04_VFD1","I3","UL10_04_VFD1_I3"]
["UL10_04_VFD1","IO0","UL10_04_VFD1_IO0","UL10_3_S1_PB"]
["UL10_04_VFD1","IO1","UL10_04_VFD1_IO1","UL10_3_S1_PB_LT"]
["UL10_04_VFD1","SI0","UL10_04_VFD1_SI0"]
["UL10_04_VFD1","SI1","UL10_04_VFD1_SI1"]
["UL10_04_VFD1","SI2","UL10_04_VFD1_SI2"]
["UL10_04_VFD1","SI3","UL10_04_VFD1_SI3"]
["UL10_04_VFD1","SO0","UL10_04_VFD1_SO0"]
["UL10_05_VFD1","I0","UL10_05_VFD1_I0","UL10_5_VFD1_DISC"]
["UL10_05_VFD1","I1","UL10_05_VFD1_I1","UL10_5_ENC1"]
["UL10_05_VFD1","I2","UL10_05_VFD1_I2","UL10_5_TPE1"]
["UL10_05_VFD1","I3","UL10_05_VFD1_I3"]
["UL10_05_VFD1","IO0","UL10_05_VFD1_IO0","UL10_3_S2_PB"]
["UL10_05_VFD1","IO1","UL10_05_VFD1_IO1","UL10_3_S2_PB_LT"]
["UL10_05_VFD1","SI0","UL10_05_VFD1_SI0"]
["UL10_05_VFD1","SI1","UL10_05_VFD1_SI1"]
["UL10_05_VFD1","SI2","UL10_05_VFD1_SI2"]
["UL10_05_VFD1","SI3","UL10_05_VFD1_SI3"]
["UL10_05_VFD1","SO0","UL10_05_VFD1_SO0"]
["UL10_06_VFD1","I0","UL10_06_VFD1_I0","UL10_6_VFD1_DISC"]
["UL10_06_VFD1","I1","UL10_06_VFD1_I1","UL10_6_ENC1"]
["UL10_06_VFD1","I2","UL10_06_VFD1_I2","UL10_6_TPE1"]
["UL10_06_VFD1","I3","UL10_06_VFD1_I3"]
["UL10_06_VFD1","IO0","UL10_06_VFD1_IO0"]
["UL10_06_VFD1","IO1","UL10_06_VFD1_IO1"]
["UL10_06_VFD1","SI0","UL10_06_VFD1_SI0"]
["UL10_06_VFD1","SI1","UL10_06_VFD1_SI1"]
["UL10_06_VFD1","SI2","UL10_06_VFD1_SI2"]
["UL10_06_VFD1","SI3","UL10_06_VFD1_SI3"]
["UL10_06_VFD1","SO0","UL10_06_VFD1_SO0"]
["UL10_07_VFD1","I0","UL10_07_VFD1_I0","UL10_7_VFD1_DISC"]
["UL10_07_VFD1","I1","UL10_07_VFD1_I1","UL10_7_ENC1"]
["UL10_07_VFD1","I2","UL10_07_VFD1_I2","UL10_7_TPE1"]
["UL10_07_VFD1","I3","UL10_07_VFD1_I3"]
["UL10_07_VFD1","IO0","UL10_07_VFD1_IO0"]
["UL10_07_VFD1","IO1","UL10_07_VFD1_IO1"]
["UL10_07_VFD1","SI0","UL10_07_VFD1_SI0"]
["UL10_07_VFD1","SI1","UL10_07_VFD1_SI1"]
["UL10_07_VFD1","SI2","UL10_07_VFD1_SI2"]
["UL10_07_VFD1","SI3","UL10_07_VFD1_SI3"]
["UL10_07_VFD1","SO0","UL10_07_VFD1_SO0"]
["UL10_08_VFD1","I0","UL10_08_VFD1_I0","UL10_8_VFD1_DISC"]
["UL10_08_VFD1","I1","UL10_08_VFD1_I1","UL10_8_ENC1"]
["UL10_08_VFD1","I2","UL10_08_VFD1_I2"]
["UL10_08_VFD1","I3","UL10_08_VFD1_I3"]
["UL10_08_VFD1","IO0","UL10_08_VFD1_IO0"]
["UL10_08_VFD1","IO1","UL10_08_VFD1_IO1"]
["UL10_08_VFD1","SI0","UL10_08_VFD1_SI0"]
["UL10_08_VFD1","SI1","UL10_08_VFD1_SI1"]
["UL10_08_VFD1","SI2","UL10_08_VFD1_SI2"]
["UL10_08_VFD1","SI3","UL10_08_VFD1_SI3"]
["UL10_08_VFD1","SO0","UL10_08_VFD1_SO0"]
["UL10_09_VFD1","I0","UL10_09_VFD1_I0","UL10_9_VFD1_DISC"]
["UL10_09_VFD1","I1","UL10_09_VFD1_I1","UL10_9_ENC1"]
["UL10_09_VFD1","I2","UL10_09_VFD1_I2","UL10_9_TPE1"]
["UL10_09_VFD1","I3","UL10_09_VFD1_I3","UL10_9_TPE2"]
["UL10_09_VFD1","IO0","UL10_09_VFD1_IO0"]
["UL10_09_VFD1","IO1","UL10_09_VFD1_IO1"]
["UL10_09_VFD1","SI0","UL10_09_VFD1_SI0"]
["UL10_09_VFD1","SI1","UL10_09_VFD1_SI1"]
["UL10_09_VFD1","SI2","UL10_09_VFD1_SI2"]
["UL10_09_VFD1","SI3","UL10_09_VFD1_SI3"]
["UL10_09_VFD1","SO0","UL10_09_VFD1_SO0"]
["UL10_10_VFD1","I0","UL10_10_VFD1_I0","UL10_10_VFD1_DISC"]
["UL10_10_VFD1","I1","UL10_10_VFD1_I1"]
["UL10_10_VFD1","I2","UL10_10_VFD1_I2"]
["UL10_10_VFD1","I3","UL10_10_VFD1_I3"]
["UL10_10_VFD1","IO0","UL10_10_VFD1_IO0","UL1_9_JR2_PB"]
["UL10_10_VFD1","IO1","UL10_10_VFD1_IO1","UL1_9_JR2_PB_LT"]
["UL10_10_VFD1","SI0","UL10_10_VFD1_SI0"]
["UL10_10_VFD1","SI1","UL10_10_VFD1_SI1"]
["UL10_10_VFD1","SI2","UL10_10_VFD1_SI2"]
["UL10_10_VFD1","SI3","UL10_10_VFD1_SI3"]
["UL10_10_VFD1","SO0","UL10_10_VFD1_SO0"]
["UL11_03_FIO1","IO00","UL11_03_FIO1_IO00","UL11_3_BCN1_R"]
["UL11_03_FIO1","IO01","UL11_03_FIO1_IO01"]
["UL11_03_FIO1","IO02","UL11_03_FIO1_IO02","UL11_3_BCN2_R"]
["UL11_03_FIO1","IO03","UL11_03_FIO1_IO03"]
["UL11_03_FIO1","IO04","UL11_03_FIO1_IO04","UL11_3_LPE1"]
["UL11_03_FIO1","IO05","UL11_03_FIO1_IO05"]
["UL11_03_FIO1","IO06","UL11_03_FIO1_IO06","UL11_3_LPE2"]
["UL11_03_FIO1","IO07","UL11_03_FIO1_IO07"]
["UL11_03_FIO1","IO08","UL11_03_FIO1_IO08","UL11_3_S1_PB"]
["UL11_03_FIO1","IO09","UL11_03_FIO1_IO09","UL11_3_S1_PB_LT"]
["UL11_03_FIO1","IO10","UL11_03_FIO1_IO10","UL11_3_S2_PB"]
["UL11_03_FIO1","IO11","UL11_03_FIO1_IO11","UL11_3_S2_PB_LT"]
["UL11_03_FIO1","IO12","UL11_03_FIO1_IO12"]
["UL11_03_FIO1","IO13","UL11_03_FIO1_IO13"]
["UL11_03_FIO1","IO14","UL11_03_FIO1_IO14"]
["UL11_03_FIO1","IO15","UL11_03_FIO1_IO15"]
["UL11_03_VFD1","I0","UL11_03_VFD1_I0","UL11_3_VFD1_DISC"]
["UL11_03_VFD1","I1","UL11_03_VFD1_I1","UL11_3_ENC1"]
["UL11_03_VFD1","I2","UL11_03_VFD1_I2","UL11_3_TPE1"]
["UL11_03_VFD1","I3","UL11_03_VFD1_I3","UL11_3_TPE2"]
["UL11_03_VFD1","IO0","UL11_03_VFD1_IO0"]
["UL11_03_VFD1","IO1","UL11_03_VFD1_IO1"]
["UL11_03_VFD1","SI0","UL11_03_VFD1_SI0","UL11_3_EPC1"]
["UL11_03_VFD1","SI1","UL11_03_VFD1_SI1","UL11_3_EPC1_2"]
["UL11_03_VFD1","SI2","UL11_03_VFD1_SI2","UL11_3_EPC2"]
["UL11_03_VFD1","SI3","UL11_03_VFD1_SI3","UL11_3_EPC2_2"]
["UL11_03_VFD1","SO0","UL11_03_VFD1_SO0"]
["UL11_04_VFD1","I0","UL11_04_VFD1_I0","UL11_4_VFD1_DISC"]
["UL11_04_VFD1","I1","UL11_04_VFD1_I1"]
["UL11_04_VFD1","I2","UL11_04_VFD1_I2","UL11_4_TPE1"]
["UL11_04_VFD1","I3","UL11_04_VFD1_I3"]
["UL11_04_VFD1","IO0","UL11_04_VFD1_IO0","UL11_4_BCN1_R"]
["UL11_04_VFD1","IO1","UL11_04_VFD1_IO1","UL11_4_BCN2_R"]
["UL11_04_VFD1","SI0","UL11_04_VFD1_SI0","UL11_4_EPC1"]
["UL11_04_VFD1","SI1","UL11_04_VFD1_SI1","UL11_4_EPC1_2"]
["UL11_04_VFD1","SI2","UL11_04_VFD1_SI2","UL11_4_EPC2"]
["UL11_04_VFD1","SI3","UL11_04_VFD1_SI3","UL11_4_EPC2_2"]
["UL11_04_VFD1","SO0","UL11_04_VFD1_SO0"]
["UL11_05_VFD1","I0","UL11_05_VFD1_I0","UL11_5_VFD1_DISC"]
["UL11_05_VFD1","I1","UL11_05_VFD1_I1","UL11_5_ENC1"]
["UL11_05_VFD1","I2","UL11_05_VFD1_I2","UL11_5_TPE1"]
["UL11_05_VFD1","I3","UL11_05_VFD1_I3"]
["UL11_05_VFD1","IO0","UL11_05_VFD1_IO0","UL11_4_S1_PB"]
["UL11_05_VFD1","IO1","UL11_05_VFD1_IO1","UL11_4_S1_PB_LT"]
["UL11_05_VFD1","SI0","UL11_05_VFD1_SI0"]
["UL11_05_VFD1","SI1","UL11_05_VFD1_SI1"]
["UL11_05_VFD1","SI2","UL11_05_VFD1_SI2"]
["UL11_05_VFD1","SI3","UL11_05_VFD1_SI3"]
["UL11_05_VFD1","SO0","UL11_05_VFD1_SO0"]
["UL11_06_VFD1","I0","UL11_06_VFD1_I0","UL11_6_VFD1_DISC"]
["UL11_06_VFD1","I1","UL11_06_VFD1_I1","UL11_6_ENC1"]
["UL11_06_VFD1","I2","UL11_06_VFD1_I2","UL11_6_TPE1"]
["UL11_06_VFD1","I3","UL11_06_VFD1_I3"]
["UL11_06_VFD1","IO0","UL11_06_VFD1_IO0","UL11_4_S2_PB"]
["UL11_06_VFD1","IO1","UL11_06_VFD1_IO1","UL11_4_S2_PB_LT"]
["UL11_06_VFD1","SI0","UL11_06_VFD1_SI0"]
["UL11_06_VFD1","SI1","UL11_06_VFD1_SI1"]
["UL11_06_VFD1","SI2","UL11_06_VFD1_SI2"]
["UL11_06_VFD1","SI3","UL11_06_VFD1_SI3"]
["UL11_06_VFD1","SO0","UL11_06_VFD1_SO0"]
["UL11_07_VFD1","I0","UL11_07_VFD1_I0","UL11_7_VFD1_DISC"]
["UL11_07_VFD1","I1","UL11_07_VFD1_I1","UL11_7_ENC1"]
["UL11_07_VFD1","I2","UL11_07_VFD1_I2","UL11_7_TPE1"]
["UL11_07_VFD1","I3","UL11_07_VFD1_I3"]
["UL11_07_VFD1","IO0","UL11_07_VFD1_IO0"]
["UL11_07_VFD1","IO1","UL11_07_VFD1_IO1"]
["UL11_07_VFD1","SI0","UL11_07_VFD1_SI0"]
["UL11_07_VFD1","SI1","UL11_07_VFD1_SI1"]
["UL11_07_VFD1","SI2","UL11_07_VFD1_SI2"]
["UL11_07_VFD1","SI3","UL11_07_VFD1_SI3"]
["UL11_07_VFD1","SO0","UL11_07_VFD1_SO0"]
["UL11_08_VFD1","I0","UL11_08_VFD1_I0","UL11_8_VFD1_DISC"]
["UL11_08_VFD1","I1","UL11_08_VFD1_I1","UL11_8_ENC1"]
["UL11_08_VFD1","I2","UL11_08_VFD1_I2","UL11_8_TPE1"]
["UL11_08_VFD1","I3","UL11_08_VFD1_I3","UL11_9_TPE3"]
["UL11_08_VFD1","IO0","UL11_08_VFD1_IO0"]
["UL11_08_VFD1","IO1","UL11_08_VFD1_IO1"]
["UL11_08_VFD1","SI0","UL11_08_VFD1_SI0"]
["UL11_08_VFD1","SI1","UL11_08_VFD1_SI1"]
["UL11_08_VFD1","SI2","UL11_08_VFD1_SI2"]
["UL11_08_VFD1","SI3","UL11_08_VFD1_SI3"]
["UL11_08_VFD1","SO0","UL11_08_VFD1_SO0"]
["UL11_09_VFD1","I0","UL11_09_VFD1_I0","UL11_9_VFD1_DISC","ul-1"]
["UL11_09_VFD1","I1","UL11_09_VFD1_I1","UL11_9_ENC1","ul_1"]
["UL11_09_VFD1","I2","UL11_09_VFD1_I2","UL11_9_TPE1"]
["UL11_09_VFD1","I3","UL11_09_VFD1_I3","UL11_9_TPE2"]
["UL11_09_VFD1","IO0","UL11_09_VFD1_IO0","UL11_9_BCN1_A"]
["UL11_09_VFD1","IO1","UL11_09_VFD1_IO1","UL11_9_BCN1_R"]
["UL11_09_VFD1","SI0","UL11_09_VFD1_SI0","UL11_9_EPC1"]
["UL11_09_VFD1","SI1","UL11_09_VFD1_SI1","UL11_9_EPC1_2"]
["UL11_09_VFD1","SI2","UL11_09_VFD1_SI2","UL11_9_EPC2"]
["UL11_09_VFD1","SI3","UL11_09_VFD1_SI3","UL11_9_EPC2_2"]
["UL11_09_VFD1","SO0","UL11_09_VFD1_SO0","UL11_9_BCN2_R"]
["UL11_10A_VFD1","I0","UL11_10A_VFD1_I0","UL11_10A_VFD1_DISC",null,null,"UL11-10 VFD IS REMOVED FROM SYSTEM, THEREFORE UL11A BECOMES UL10A, UL11B BECOMES 10B, UL12 BECOMES UL11 SO ON AND SO FORTH."]
["UL11_10A_VFD1","I1","UL11_10A_VFD1_I1","UL11_9_TPE4"]
["UL11_10A_VFD1","I2","UL11_10A_VFD1_I2","UL11_9_TPE5"]
["UL11_10A_VFD1","I3","UL11_10A_VFD1_I3"]
["UL11_10A_VFD1","IO0","UL11_10A_VFD1_IO0","UL11_9_S1_PB"]
["UL11_10A_VFD1","IO1","UL11_10A_VFD1_IO1","UL11_9_S1_PB_LT"]
["UL11_10A_VFD1","SI0","UL11_10A_VFD1_SI0"]
["UL11_10A_VFD1","SI1","UL11_10A_VFD1_SI1"]
["UL11_10A_VFD1","SI2","UL11_10A_VFD1_SI2"]
["UL11_10A_VFD1","SI3","UL11_10A_VFD1_SI3"]
["UL11_10A_VFD1","SO0","UL11_10A_VFD1_SO0"]
["UL11_10B_VFD1","I0","UL11_10B_VFD1_I0","UL11_10B_VFD1_DISC"]
["UL11_10B_VFD1","I1","UL11_10B_VFD1_I1"]
["UL11_10B_VFD1","I2","UL11_10B_VFD1_I2"]
["UL11_10B_VFD1","I3","UL11_10B_VFD1_I3"]
["UL11_10B_VFD1","IO0","UL11_10B_VFD1_IO0","UL11_9_JR1_PB"]
["UL11_10B_VFD1","IO1","UL11_10B_VFD1_IO1","UL11_9_JR1_PB_LT"]
["UL11_10B_VFD1","SI0","UL11_10B_VFD1_SI0"]
["UL11_10B_VFD1","SI1","UL11_10B_VFD1_SI1"]
["UL11_10B_VFD1","SI2","UL11_10B_VFD1_SI2"]
["UL11_10B_VFD1","SI3","UL11_10B_VFD1_SI3"]
["UL11_10B_VFD1","SO0","UL11_10B_VFD1_SO0"]
["UL11_11_VFD1","I0","UL11_11_VFD1_I0","UL11_11_VFD1_DISC"]
["UL11_11_VFD1","I1","UL11_11_VFD1_I1","UL11_11_ENC1"]
["UL11_11_VFD1","I2","UL11_11_VFD1_I2","UL11_11_TPE1"]
["UL11_11_VFD1","I3","UL11_11_VFD1_I3","UL11_11_TPE2"]
["UL11_11_VFD1","IO0","UL11_11_VFD1_IO0","UL11_9_S2_PB"]
["UL11_11_VFD1","IO1","UL11_11_VFD1_IO1","UL11_9_S2_PB_LT"]
["UL11_11_VFD1","SI0","UL11_11_VFD1_SI0"]
["UL11_11_VFD1","SI1","UL11_11_VFD1_SI1"]
["UL11_11_VFD1","SI2","UL11_11_VFD1_SI2"]
["UL11_11_VFD1","SI3","UL11_11_VFD1_SI3"]
["UL11_11_VFD1","SO0","UL11_11_VFD1_SO0"]
["UL11_12_VFD1","I0","UL11_12_VFD1_I0","UL11_12_VFD1_DISC"]
["UL11_12_VFD1","I1","UL11_12_VFD1_I1","UL11_12_ENC1"]
["UL11_12_VFD1","I2","UL11_12_VFD1_I2","UL11_12_TPE1"]
["UL11_12_VFD1","I3","UL11_12_VFD1_I3"]
["UL11_12_VFD1","IO0","UL11_12_VFD1_IO0"]
["UL11_12_VFD1","IO1","UL11_12_VFD1_IO1"]
["UL11_12_VFD1","SI0","UL11_12_VFD1_SI0"]
["UL11_12_VFD1","SI1","UL11_12_VFD1_SI1"]
["UL11_12_VFD1","SI2","UL11_12_VFD1_SI2"]
["UL11_12_VFD1","SI3","UL11_12_VFD1_SI3"]
["UL11_12_VFD1","SO0","UL11_12_VFD1_SO0"]
["UL11_13_VFD1","I0","UL11_13_VFD1_I0","UL11_13_VFD1_DISC"]
["UL11_13_VFD1","I1","UL11_13_VFD1_I1"]
["UL11_13_VFD1","I2","UL11_13_VFD1_I2"]
["UL11_13_VFD1","I3","UL11_13_VFD1_I3"]
["UL11_13_VFD1","IO0","UL11_13_VFD1_IO0"]
["UL11_13_VFD1","IO1","UL11_13_VFD1_IO1"]
["UL11_13_VFD1","SI0","UL11_13_VFD1_SI0"]
["UL11_13_VFD1","SI1","UL11_13_VFD1_SI1"]
["UL11_13_VFD1","SI2","UL11_13_VFD1_SI2"]
["UL11_13_VFD1","SI3","UL11_13_VFD1_SI3"]
["UL11_13_VFD1","SO0","UL11_13_VFD1_SO0"]
["UL11_13_VFD1","ENC1","UL11_13_VFD1_ENC1","UL11_13_ENC1","2025-06-06"]
["UL12_03_FIO1","IO00","UL12_03_FIO1_IO00","UL12_3_BCN1_R"]
["UL12_03_FIO1","IO01","UL12_03_FIO1_IO01"]
["UL12_03_FIO1","IO02","UL12_03_FIO1_IO02","UL12_3_BCN2_R"]
["UL12_03_FIO1","IO03","UL12_03_FIO1_IO03"]
["UL12_03_FIO1","IO04","UL12_03_FIO1_IO04","UL12_3_LPE1"]
["UL12_03_FIO1","IO05","UL12_03_FIO1_IO05"]
["UL12_03_FIO1","IO06","UL12_03_FIO1_IO06","UL12_3_LPE2"]
["UL12_03_FIO1","IO07","UL12_03_FIO1_IO07"]
["UL12_03_FIO1","IO08","UL12_03_FIO1_IO08","UL12_3_S1_PB"]
["UL12_03_FIO1","IO09","UL12_03_FIO1_IO09","UL12_3_S1_PB_LT"]
["UL12_03_FIO1","IO10","UL12_03_FIO1_IO10","UL12_3_S2_PB"]
["UL12_03_FIO1","IO11","UL12_03_FIO1_IO11","UL12_3_S2_PB_LT"]
["UL12_03_FIO1","IO12","UL12_03_FIO1_IO12"]
["UL12_03_FIO1","IO13","UL12_03_FIO1_IO13"]
["UL12_03_FIO1","IO14","UL12_03_FIO1_IO14"]
["UL12_03_FIO1","IO15","UL12_03_FIO1_IO15"]
["UL12_03_VFD1","I0","UL12_03_VFD1_I0","UL12_3_VFD1_DISC"]
["UL12_03_VFD1","I1","UL12_03_VFD1_I1","UL12_3_ENC1"]
["UL12_03_VFD1","I2","UL12_03_VFD1_I2","UL12_3_TPE1"]
["UL12_03_VFD1","I3","UL12_03_VFD1_I3","UL12_3_TPE2"]
["UL12_03_VFD1","IO0","UL12_03_VFD1_IO0"]
["UL12_03_VFD1","IO1","UL12_03_VFD1_IO1"]
["UL12_03_VFD1","SI0","UL12_03_VFD1_SI0","UL12_3_EPC1"]
["UL12_03_VFD1","SI1","UL12_03_VFD1_SI1","UL12_3_EPC1_2"]
["UL12_03_VFD1","SI2","UL12_03_VFD1_SI2","UL12_3_EPC2"]
["UL12_03_VFD1","SI3","UL12_03_VFD1_SI3","UL12_3_EPC2_2"]
["UL12_03_VFD1","SO0","UL12_03_VFD1_SO0"]
["UL12_04_VFD1","I0","UL12_04_VFD1_I0","UL12_4_VFD1_DISC"]
["UL12_04_VFD1","I1","UL12_04_VFD1_I1","UL12_4_ENC1"]
["UL12_04_VFD1","I2","UL12_04_VFD1_I2","UL12_4_TPE1"]
["UL12_04_VFD1","I3","UL12_04_VFD1_I3"]
["UL12_04_VFD1","IO0","UL12_04_VFD1_IO0","UL12_4_BCN1_R"]
["UL12_04_VFD1","IO1","UL12_04_VFD1_IO1","UL12_4_BCN2_R"]
["UL12_04_VFD1","SI0","UL12_04_VFD1_SI0","UL12_4_EPC1"]
["UL12_04_VFD1","SI1","UL12_04_VFD1_SI1","UL12_4_EPC1_2"]
["UL12_04_VFD1","SI2","UL12_04_VFD1_SI2","UL12_4_EPC2"]
["UL12_04_VFD1","SI3","UL12_04_VFD1_SI3","UL12_4_EPC2_2"]
["UL12_04_VFD1","SO0","UL12_04_VFD1_SO0"]
["UL12_05_VFD1","I0","UL12_05_VFD1_I0","UL12_5_VFD1_DISC"]
["UL12_05_VFD1","I1","UL12_05_VFD1_I1","UL12_5_ENC1"]
["UL12_05_VFD1","I2","UL12_05_VFD1_I2"]
["UL12_05_VFD1","I3","UL12_05_VFD1_I3"]
["UL12_05_VFD1","IO0","UL12_05_VFD1_IO0","UL12_4_S1_PB"]
["UL12_05_VFD1","IO1","UL12_05_VFD1_IO1","UL12_4_S1_PB_LT"]
["UL12_05_VFD1","SI0","UL12_05_VFD1_SI0"]
["UL12_05_VFD1","SI1","UL12_05_VFD1_SI1"]
["UL12_05_VFD1","SI2","UL12_05_VFD1_SI2"]
["UL12_05_VFD1","SI3","UL12_05_VFD1_SI3"]
["UL12_05_VFD1","SO0","UL12_05_VFD1_SO0"]
["UL12_06_VFD1","I0","UL12_06_VFD1_I0","UL12_6_VFD1_DISC"]
["UL12_06_VFD1","I1","UL12_06_VFD1_I1","UL12_6_ENC1"]
["UL12_06_VFD1","I2","UL12_06_VFD1_I2","UL12_6_TPE1"]
["UL12_06_VFD1","I3","UL12_06_VFD1_I3","UL12_6_TPE2"]
["UL12_06_VFD1","IO0","UL12_06_VFD1_IO0","UL12_4_S2_PB"]
["UL12_06_VFD1","IO1","UL12_06_VFD1_IO1","UL12_4_S2_PB_LT"]
["UL12_06_VFD1","SI0","UL12_06_VFD1_SI0"]
["UL12_06_VFD1","SI1","UL12_06_VFD1_SI1"]
["UL12_06_VFD1","SI2","UL12_06_VFD1_SI2"]
["UL12_06_VFD1","SI3","UL12_06_VFD1_SI3"]
["UL12_06_VFD1","SO0","UL12_06_VFD1_SO0"]
["UL12_07_VFD1","I0","UL12_07_VFD1_I0","UL12_7_VFD1_DISC"]
["UL12_07_VFD1","I1","UL12_07_VFD1_I1","UL12_7_ENC1"]
["UL12_07_VFD1","I2","UL12_07_VFD1_I2","UL12_7_TPE1"]
["UL12_07_VFD1","I3","UL12_07_VFD1_I3"]
["UL12_07_VFD1","IO0","UL12_07_VFD1_IO0"]
["UL12_07_VFD1","IO1","UL12_07_VFD1_IO1"]
["UL12_07_VFD1","SI0","UL12_07_VFD1_SI0"]
["UL12_07_VFD1","SI1","UL12_07_VFD1_SI1"]
["UL12_07_VFD1","SI2","UL12_07_VFD1_SI2"]
["UL12_07_VFD1","SI3","UL12_07_VFD1_SI3"]
["UL12_07_VFD1","SO0","UL12_07_VFD1_SO0"]
["UL12_08_VFD1","I0","UL12_08_VFD1_I0","UL12_8_VFD1_DISC"]
["UL12_08_VFD1","I1","UL12_08_VFD1_I1","UL12_8_ENC1"]
["UL12_08_VFD1","I2","UL12_08_VFD1_I2","UL12_8_TPE1"]
["UL12_08_VFD1","I3","UL12_08_VFD1_I3"]
["UL12_08_VFD1","IO0","UL12_08_VFD1_IO0"]
["UL12_08_VFD1","IO1","UL12_08_VFD1_IO1"]
["UL12_08_VFD1","SI0","UL12_08_VFD1_SI0"]
["UL12_08_VFD1","SI1","UL12_08_VFD1_SI1"]
["UL12_08_VFD1","SI2","UL12_08_VFD1_SI2"]
["UL12_08_VFD1","SI3","UL12_08_VFD1_SI3"]
["UL12_08_VFD1","SO0","UL12_08_VFD1_SO0"]
["UL12_09_VFD1","I0","UL12_09_VFD1_I0","UL12_9_VFD1_DISC"]
["UL12_09_VFD1","I1","UL12_09_VFD1_I1","UL12_9_ENC1"]
["UL12_09_VFD1","I2","UL12_09_VFD1_I2","UL12_9_TPE1"]
["UL12_09_VFD1","I3","UL12_09_VFD1_I3"]
["UL12_09_VFD1","IO0","UL12_09_VFD1_IO0"]
["UL12_09_VFD1","IO1","UL12_09_VFD1_IO1"]
["UL12_09_VFD1","SI0","UL12_09_VFD1_SI0"]
["UL12_09_VFD1","SI1","UL12_09_VFD1_SI1"]
["UL12_09_VFD1","SI2","UL12_09_VFD1_SI2"]
["UL12_09_VFD1","SI3","UL12_09_VFD1_SI3"]
["UL12_09_VFD1","SO0","UL12_09_VFD1_SO0"]
["UL12_10_VFD1","I0","UL12_10_VFD1_I0","UL12_10_VFD1_DISC"]
["UL12_10_VFD1","I1","UL12_10_VFD1_I1"]
["UL12_10_VFD1","I2","UL12_10_VFD1_I2"]
["UL12_10_VFD1","I3","UL12_10_VFD1_I3"]
["UL12_10_VFD1","IO0","UL12_10_VFD1_IO0"]
["UL12_10_VFD1","IO1","UL12_10_VFD1_IO1"]
["UL12_10_VFD1","SI0","UL12_10_VFD1_SI0"]
["UL12_10_VFD1","SI1","UL12_10_VFD1_SI1"]
["UL12_10_VFD1","SI2","UL12_10_VFD1_SI2"]
["UL12_10_VFD1","SI3","UL12_10_VFD1_SI3"]
["UL12_10_VFD1","SO0","UL12_10_VFD1_SO0"]
["UL2_03_FIO1","IO00","UL2_03_FIO1_IO00","UL2_3_BCN1_R"]
["UL2_03_FIO1","IO01","UL2_03_FIO1_IO01"]
["UL2_03_FIO1","IO02","UL2_03_FIO1_IO02","UL2_3_BCN2_R"]
["UL2_03_FIO1","IO03","UL2_03_FIO1_IO03"]
["UL2_03_FIO1","IO04","UL2_03_FIO1_IO04","UL2_3_LPE1"]
["UL2_03_FIO1","IO05","UL2_03_FIO1_IO05"]
["UL2_03_FIO1","IO06","UL2_03_FIO1_IO06","UL2_3_LPE2"]
["UL2_03_FIO1","IO07","UL2_03_FIO1_IO07"]
["UL2_03_FIO1","IO08","UL2_03_FIO1_IO08","UL2_3_S1_PB"]
["UL2_03_FIO1","IO09","UL2_03_FIO1_IO09","UL2_3_S1_PB_LT"]
["UL2_03_FIO1","IO10","UL2_03_FIO1_IO10","UL2_3_S2_PB"]
["UL2_03_FIO1","IO11","UL2_03_FIO1_IO11","UL2_3_S2_PB_LT"]
["UL2_03_FIO1","IO12","UL2_03_FIO1_IO12"]
["UL2_03_FIO1","IO13","UL2_03_FIO1_IO13"]
["UL2_03_FIO1","IO14","UL2_03_FIO1_IO14"]
["UL2_03_FIO1","IO15","UL2_03_FIO1_IO15"]
["UL2_03_VFD1","I0","UL2_03_VFD1_I0","UL2_3_VFD1_DISC"]
["UL2_03_VFD1","I1","UL2_03_VFD1_I1","UL2_3_ENC1"]
["UL2_03_VFD1","I2","UL2_03_VFD1_I2","UL2_3_TPE1"]
["UL2_03_VFD1","I3","UL2_03_VFD1_I3","UL2_3_TPE2"]
["UL2_03_VFD1","IO0","UL2_03_VFD1_IO0"]
["UL2_03_VFD1","IO1","UL2_03_VFD1_IO1"]
["UL2_03_VFD1","SI0","UL2_03_VFD1_SI0","UL2_3_EPC1"]
["UL2_03_VFD1","SI1","UL2_03_VFD1_SI1","UL2_3_EPC1_2"]
["UL2_03_VFD1","SI2","UL2_03_VFD1_SI2","UL2_3_EPC2"]
["UL2_03_VFD1","SI3","UL2_03_VFD1_SI3","UL2_3_EPC2_2"]
["UL2_03_VFD1","SO0","UL2_03_VFD1_SO0"]
["UL2_04_VFD1","I0","UL2_04_VFD1_I0","UL2_4_VFD1_DISC"]
["UL2_04_VFD1","I1","UL2_04_VFD1_I1","UL2_4_ENC1"]
["UL2_04_VFD1","I2","UL2_04_VFD1_I2","UL2_4_TPE1"]
["UL2_04_VFD1","I3","UL2_04_VFD1_I3"]
["UL2_04_VFD1","IO0","UL2_04_VFD1_IO0","UL2_4_BCN1_R"]
["UL2_04_VFD1","IO1","UL2_04_VFD1_IO1","UL2_4_BCN2_R"]
["UL2_04_VFD1","SI0","UL2_04_VFD1_SI0","UL2_4_EPC1"]
["UL2_04_VFD1","SI1","UL2_04_VFD1_SI1","UL2_4_EPC1_2"]
["UL2_04_VFD1","SI2","UL2_04_VFD1_SI2","UL2_4_EPC2"]
["UL2_04_VFD1","SI3","UL2_04_VFD1_SI3","UL2_4_EPC2_2"]
["UL2_04_VFD1","SO0","UL2_04_VFD1_SO0"]
["UL2_05_VFD1","I0","UL2_05_VFD1_I0","UL2_5_VFD1_DISC"]
["UL2_05_VFD1","I1","UL2_05_VFD1_I1","UL2_5_ENC1"]
["UL2_05_VFD1","I2","UL2_05_VFD1_I2"]
["UL2_05_VFD1","I3","UL2_05_VFD1_I3"]
["UL2_05_VFD1","IO0","UL2_05_VFD1_IO0","UL2_4_S1_PB"]
["UL2_05_VFD1","IO1","UL2_05_VFD1_IO1","UL2_4_S1_PB_LT"]
["UL2_05_VFD1","SI0","UL2_05_VFD1_SI0"]
["UL2_05_VFD1","SI1","UL2_05_VFD1_SI1"]
["UL2_05_VFD1","SI2","UL2_05_VFD1_SI2"]
["UL2_05_VFD1","SI3","UL2_05_VFD1_SI3"]
["UL2_05_VFD1","SO0","UL2_05_VFD1_SO0"]
["UL2_06_VFD1","I0","UL2_06_VFD1_I0","UL2_6_VFD1_DISC"]
["UL2_06_VFD1","I1","UL2_06_VFD1_I1","UL2_6_ENC1"]
["UL2_06_VFD1","I2","UL2_06_VFD1_I2","UL2_6_TPE1"]
["UL2_06_VFD1","I3","UL2_06_VFD1_I3","UL2_6_TPE2"]
["UL2_06_VFD1","IO0","UL2_06_VFD1_IO0","UL2_4_S2_PB"]
["UL2_06_VFD1","IO1","UL2_06_VFD1_IO1","UL2_4_S2_PB_LT"]
["UL2_06_VFD1","SI0","UL2_06_VFD1_SI0"]
["UL2_06_VFD1","SI1","UL2_06_VFD1_SI1"]
["UL2_06_VFD1","SI2","UL2_06_VFD1_SI2"]
["UL2_06_VFD1","SI3","UL2_06_VFD1_SI3"]
["UL2_06_VFD1","SO0","UL2_06_VFD1_SO0"]
["UL2_07_VFD1","I0","UL2_07_VFD1_I0","UL2_7_VFD1_DISC"]
["UL2_07_VFD1","I1","UL2_07_VFD1_I1","UL2_7_ENC1"]
["UL2_07_VFD1","I2","UL2_07_VFD1_I2","UL2_7_TPE1"]
["UL2_07_VFD1","I3","UL2_07_VFD1_I3"]
["UL2_07_VFD1","IO0","UL2_07_VFD1_IO0"]
["UL2_07_VFD1","IO1","UL2_07_VFD1_IO1"]
["UL2_07_VFD1","SI0","UL2_07_VFD1_SI0"]
["UL2_07_VFD1","SI1","UL2_07_VFD1_SI1"]
["UL2_07_VFD1","SI2","UL2_07_VFD1_SI2"]
["UL2_07_VFD1","SI3","UL2_07_VFD1_SI3"]
["UL2_07_VFD1","SO0","UL2_07_VFD1_SO0"]
["UL2_08_VFD1","I0","UL2_08_VFD1_I0","UL2_8_VFD1_DISC"]
["UL2_08_VFD1","I1","UL2_08_VFD1_I1","UL2_8_ENC1"]
["UL2_08_VFD1","I2","UL2_08_VFD1_I2","UL2_8_TPE1"]
["UL2_08_VFD1","I3","UL2_08_VFD1_I3"]
["UL2_08_VFD1","IO0","UL2_08_VFD1_IO0"]
["UL2_08_VFD1","IO1","UL2_08_VFD1_IO1"]
["UL2_08_VFD1","SI0","UL2_08_VFD1_SI0"]
["UL2_08_VFD1","SI1","UL2_08_VFD1_SI1"]
["UL2_08_VFD1","SI2","UL2_08_VFD1_SI2"]
["UL2_08_VFD1","SI3","UL2_08_VFD1_SI3"]
["UL2_08_VFD1","SO0","UL2_08_VFD1_SO0"]
["UL2_09_VFD1","I0","UL2_09_VFD1_I0","UL2_9_VFD1_DISC"]
["UL2_09_VFD1","I1","UL2_09_VFD1_I1","UL2_9_ENC1"]
["UL2_09_VFD1","I2","UL2_09_VFD1_I2","UL2_9_TPE1"]
["UL2_09_VFD1","I3","UL2_09_VFD1_I3"]
["UL2_09_VFD1","IO0","UL2_09_VFD1_IO0"]
["UL2_09_VFD1","IO1","UL2_09_VFD1_IO1"]
["UL2_09_VFD1","SI0","UL2_09_VFD1_SI0"]
["UL2_09_VFD1","SI1","UL2_09_VFD1_SI1"]
["UL2_09_VFD1","SI2","UL2_09_VFD1_SI2"]
["UL2_09_VFD1","SI3","UL2_09_VFD1_SI3"]
["UL2_09_VFD1","SO0","UL2_09_VFD1_SO0"]
["UL2_10_VFD1","I0","UL2_10_VFD1_I0","UL2_10_VFD1_DISC"]
["UL2_10_VFD1","I1","UL2_10_VFD1_I1"]
["UL2_10_VFD1","I2","UL2_10_VFD1_I2"]
["UL2_10_VFD1","I3","UL2_10_VFD1_I3"]
["UL2_10_VFD1","IO0","UL2_10_VFD1_IO0"]
["UL2_10_VFD1","IO1","UL2_10_VFD1_IO1"]
["UL2_10_VFD1","SI0","UL2_10_VFD1_SI0"]
["UL2_10_VFD1","SI1","UL2_10_VFD1_SI1"]
["UL2_10_VFD1","SI2","UL2_10_VFD1_SI2"]
["UL2_10_VFD1","SI3","UL2_10_VFD1_SI3"]
["UL2_10_VFD1","SO0","UL2_10_VFD1_SO0"]
["UL3_01_VFD1","I0","UL3_01_VFD1_I0","UL3_1_VFD1_DISC"]
["UL3_01_VFD1","I1","UL3_01_VFD1_I1"]
["UL3_01_VFD1","I2","UL3_01_VFD1_I2","UL3_1_TPE1"]
["UL3_01_VFD1","I3","UL3_01_VFD1_I3"]
["UL3_01_VFD1","IO0","UL3_01_VFD1_IO0"]
["UL3_01_VFD1","IO1","UL3_01_VFD1_IO1"]
["UL3_01_VFD1","SI0","UL3_01_VFD1_SI0","UL3_1_EPC1"]
["UL3_01_VFD1","SI1","UL3_01_VFD1_SI1","UL3_1_EPC1_2"]
["UL3_01_VFD1","SI2","UL3_01_VFD1_SI2","UL3_1_EPC2"]
["UL3_01_VFD1","SI3","UL3_01_VFD1_SI3","UL3_1_EPC2_2"]
["UL3_01_VFD1","SO0","UL3_01_VFD1_SO0"]
["UL3_02_FIO1","IO00","UL3_02_FIO1_IO00","UL3_1_BCN1_R"]
["UL3_02_FIO1","IO01","UL3_02_FIO1_IO01","UL3_1_BCN2_R"]
["UL3_02_FIO1","IO02","UL3_02_FIO1_IO02","UL3_1_SS1_SPB"]
["UL3_02_FIO1","IO03","UL3_02_FIO1_IO03","UL3_1_SS1_STPB"]
["UL3_02_FIO1","IO04","UL3_02_FIO1_IO04","UL3_1_SS1_STPB_LT"]
["UL3_02_FIO1","IO05","UL3_02_FIO1_IO05"]
["UL3_02_FIO1","IO06","UL3_02_FIO1_IO06","UL3_2_LPE1"]
["UL3_02_FIO1","IO07","UL3_02_FIO1_IO07"]
["UL3_02_FIO1","IO08","UL3_02_FIO1_IO08","UL3_2_LPE2"]
["UL3_02_FIO1","IO09","UL3_02_FIO1_IO09"]
["UL3_02_FIO1","IO10","UL3_02_FIO1_IO10","UL3_2_BCN1_R"]
["UL3_02_FIO1","IO11","UL3_02_FIO1_IO11","UL3_2_BCN2_R"]
["UL3_02_FIO1","IO12","UL3_02_FIO1_IO12","UL3_2_S1_PB"]
["UL3_02_FIO1","IO13","UL3_02_FIO1_IO13","UL3_2_S1_PB_LT"]
["UL3_02_FIO1","IO14","UL3_02_FIO1_IO14","UL3_2_S2_PB"]
["UL3_02_FIO1","IO15","UL3_02_FIO1_IO15","UL3_2_S2_PB_LT"]
["UL3_02_VFD1","I0","UL3_02_VFD1_I0","UL3_2_VFD1_DISC"]
["UL3_02_VFD1","I1","UL3_02_VFD1_I1","UL3_2_ENC1"]
["UL3_02_VFD1","I2","UL3_02_VFD1_I2","UL3_2_TPE1"]
["UL3_02_VFD1","I3","UL3_02_VFD1_I3","UL3_2_TPE2"]
["UL3_02_VFD1","IO0","UL3_02_VFD1_IO0"]
["UL3_02_VFD1","IO1","UL3_02_VFD1_IO1"]
["UL3_02_VFD1","SI0","UL3_02_VFD1_SI0","UL3_2_EPC1"]
["UL3_02_VFD1","SI1","UL3_02_VFD1_SI1","UL3_2_EPC1_2"]
["UL3_02_VFD1","SI2","UL3_02_VFD1_SI2","UL3_2_EPC2"]
["UL3_02_VFD1","SI3","UL3_02_VFD1_SI3","UL3_2_EPC2_2"]
["UL3_02_VFD1","SO0","UL3_02_VFD1_SO0"]
["UL3_03_VFD1","I0","UL3_03_VFD1_I0","UL3_3_VFD1_DISC"]
["UL3_03_VFD1","I1","UL3_03_VFD1_I1","UL3_3_ENC1"]
["UL3_03_VFD1","I2","UL3_03_VFD1_I2"]
["UL3_03_VFD1","I3","UL3_03_VFD1_I3"]
["UL3_03_VFD1","IO0","UL3_03_VFD1_IO0"]
["UL3_03_VFD1","IO1","UL3_03_VFD1_IO1"]
["UL3_03_VFD1","SI0","UL3_03_VFD1_SI0"]
["UL3_03_VFD1","SI1","UL3_03_VFD1_SI1"]
["UL3_03_VFD1","SI2","UL3_03_VFD1_SI2"]
["UL3_03_VFD1","SI3","UL3_03_VFD1_SI3"]
["UL3_03_VFD1","SO0","UL3_03_VFD1_SO0"]
["UL3_04_VFD1","I0","UL3_04_VFD1_I0","UL3_4_VFD1_DISC"]
["UL3_04_VFD1","I1","UL3_04_VFD1_I1","UL3_4_ENC1"]
["UL3_04_VFD1","I2","UL3_04_VFD1_I2","UL3_4_TPE1"]
["UL3_04_VFD1","I3","UL3_04_VFD1_I3","UL3_4_TPE2"]
["UL3_04_VFD1","IO0","UL3_04_VFD1_IO0"]
["UL3_04_VFD1","IO1","UL3_04_VFD1_IO1"]
["UL3_04_VFD1","SI0","UL3_04_VFD1_SI0"]
["UL3_04_VFD1","SI1","UL3_04_VFD1_SI1"]
["UL3_04_VFD1","SI2","UL3_04_VFD1_SI2"]
["UL3_04_VFD1","SI3","UL3_04_VFD1_SI3"]
["UL3_04_VFD1","SO0","UL3_04_VFD1_SO0"]
["UL3_05_VFD1","I0","UL3_05_VFD1_I0","UL3_5_VFD1_DISC"]
["UL3_05_VFD1","I1","UL3_05_VFD1_I1","UL3_5_ENC1"]
["UL3_05_VFD1","I2","UL3_05_VFD1_I2","UL3_5_TPE1"]
["UL3_05_VFD1","I3","UL3_05_VFD1_I3"]
["UL3_05_VFD1","IO0","UL3_05_VFD1_IO0"]
["UL3_05_VFD1","IO1","UL3_05_VFD1_IO1"]
["UL3_05_VFD1","SI0","UL3_05_VFD1_SI0"]
["UL3_05_VFD1","SI1","UL3_05_VFD1_SI1"]
["UL3_05_VFD1","SI2","UL3_05_VFD1_SI2"]
["UL3_05_VFD1","SI3","UL3_05_VFD1_SI3"]
["UL3_05_VFD1","SO0","UL3_05_VFD1_SO0"]
["UL3_06_VFD1","I0","UL3_06_VFD1_I0","UL3_6_VFD1_DISC"]
["UL3_06_VFD1","I1","UL3_06_VFD1_I1","UL3_6_ENC1"]
["UL3_06_VFD1","I2","UL3_06_VFD1_I2","UL3_6_TPE1"]
["UL3_06_VFD1","I3","UL3_06_VFD1_I3"]
["UL3_06_VFD1","IO0","UL3_06_VFD1_IO0"]
["UL3_06_VFD1","IO1","UL3_06_VFD1_IO1"]
["UL3_06_VFD1","SI0","UL3_06_VFD1_SI0"]
["UL3_06_VFD1","SI1","UL3_06_VFD1_SI1"]
["UL3_06_VFD1","SI2","UL3_06_VFD1_SI2"]
["UL3_06_VFD1","SI3","UL3_06_VFD1_SI3"]
["UL3_06_VFD1","SO0","UL3_06_VFD1_SO0"]
["UL3_07_VFD1","I0","UL3_07_VFD1_I0","UL3_7_VFD1_DISC"]
["UL3_07_VFD1","I1","UL3_07_VFD1_I1","UL3_7_ENC1"]
["UL3_07_VFD1","I2","UL3_07_VFD1_I2","UL3_7_TPE1"]
["UL3_07_VFD1","I3","UL3_07_VFD1_I3"]
["UL3_07_VFD1","IO0","UL3_07_VFD1_IO0"]
["UL3_07_VFD1","IO1","UL3_07_VFD1_IO1"]
["UL3_07_VFD1","SI0","UL3_07_VFD1_SI0"]
["UL3_07_VFD1","SI1","UL3_07_VFD1_SI1"]
["UL3_07_VFD1","SI2","UL3_07_VFD1_SI2"]
["UL3_07_VFD1","SI3","UL3_07_VFD1_SI3"]
["UL3_07_VFD1","SO0","UL3_07_VFD1_SO0"]
["UL3_08_VFD1","I0","UL3_08_VFD1_I0","UL3_8_VFD1_DISC"]
["UL3_08_VFD1","I1","UL3_08_VFD1_I1","UL3_8_ENC1"]
["UL3_08_VFD1","I2","UL3_08_VFD1_I2","UL3_8_TPE1"]
["UL3_08_VFD1","I3","UL3_08_VFD1_I3"]
["UL3_08_VFD1","IO0","UL3_08_VFD1_IO0"]
["UL3_08_VFD1","IO1","UL3_08_VFD1_IO1"]
["UL3_08_VFD1","SI0","UL3_08_VFD1_SI0"]
["UL3_08_VFD1","SI1","UL3_08_VFD1_SI1"]
["UL3_08_VFD1","SI2","UL3_08_VFD1_SI2"]
["UL3_08_VFD1","SI3","UL3_08_VFD1_SI3"]
["UL3_08_VFD1","SO0","UL3_08_VFD1_SO0"]
["UL3_09_VFD1","I0","UL3_09_VFD1_I0","UL3_9_VFD1_DISC"]
["UL3_09_VFD1","I1","UL3_09_VFD1_I1"]
["UL3_09_VFD1","I2","UL3_09_VFD1_I2"]
["UL3_09_VFD1","I3","UL3_09_VFD1_I3"]
["UL3_09_VFD1","IO0","UL3_09_VFD1_IO0"]
["UL3_09_VFD1","IO1","UL3_09_VFD1_IO1"]
["UL3_09_VFD1","SI0","UL3_09_VFD1_SI0"]
["UL3_09_VFD1","SI1","UL3_09_VFD1_SI1"]
["UL3_09_VFD1","SI2","UL3_09_VFD1_SI2"]
["UL3_09_VFD1","SI3","UL3_09_VFD1_SI3"]
["UL3_09_VFD1","SO0","UL3_09_VFD1_SO0"]
["UL4_03_FIO1","IO00","UL4_03_FIO1_IO00","UL4_3_BCN1_R"]
["UL4_03_FIO1","IO01","UL4_03_FIO1_IO01"]
["UL4_03_FIO1","IO02","UL4_03_FIO1_IO02","UL4_3_BCN2_R"]
["UL4_03_FIO1","IO03","UL4_03_FIO1_IO03"]
["UL4_03_FIO1","IO04","UL4_03_FIO1_IO04","UL4_3_LPE1"]
["UL4_03_FIO1","IO05","UL4_03_FIO1_IO05"]
["UL4_03_FIO1","IO06","UL4_03_FIO1_IO06","UL4_3_LPE2"]
["UL4_03_FIO1","IO07","UL4_03_FIO1_IO07"]
["UL4_03_FIO1","IO08","UL4_03_FIO1_IO08","UL4_3_S1_PB"]
["UL4_03_FIO1","IO09","UL4_03_FIO1_IO09","UL4_3_S1_PB_LT"]
["UL4_03_FIO1","IO10","UL4_03_FIO1_IO10","UL4_3_S2_PB"]
["UL4_03_FIO1","IO11","UL4_03_FIO1_IO11","UL4_3_S2_PB_LT"]
["UL4_03_FIO1","IO12","UL4_03_FIO1_IO12"]
["UL4_03_FIO1","IO13","UL4_03_FIO1_IO13"]
["UL4_03_FIO1","IO14","UL4_03_FIO1_IO14"]
["UL4_03_FIO1","IO15","UL4_03_FIO1_IO15"]
["UL4_03_VFD1","I0","UL4_03_VFD1_I0","UL4_3_VFD1_DISC"]
["UL4_03_VFD1","I1","UL4_03_VFD1_I1","UL4_3_ENC1"]
["UL4_03_VFD1","I2","UL4_03_VFD1_I2","UL4_3_TPE1"]
["UL4_03_VFD1","I3","UL4_03_VFD1_I3","UL4_3_TPE2"]
["UL4_03_VFD1","IO0","UL4_03_VFD1_IO0"]
["UL4_03_VFD1","IO1","UL4_03_VFD1_IO1"]
["UL4_03_VFD1","SI0","UL4_03_VFD1_SI0","UL4_3_EPC1"]
["UL4_03_VFD1","SI1","UL4_03_VFD1_SI1","UL4_3_EPC1_2"]
["UL4_03_VFD1","SI2","UL4_03_VFD1_SI2","UL4_3_EPC2"]
["UL4_03_VFD1","SI3","UL4_03_VFD1_SI3","UL4_3_EPC2_2"]
["UL4_03_VFD1","SO0","UL4_03_VFD1_SO0"]
["UL4_04_VFD1","I0","UL4_04_VFD1_I0","UL4_4_VFD1_DISC"]
["UL4_04_VFD1","I1","UL4_04_VFD1_I1","UL4_4_ENC1"]
["UL4_04_VFD1","I2","UL4_04_VFD1_I2","UL4_4_TPE1"]
["UL4_04_VFD1","I3","UL4_04_VFD1_I3"]
["UL4_04_VFD1","IO0","UL4_04_VFD1_IO0","UL4_4_BCN2_R","2025-06-18"]
["UL4_04_VFD1","IO1","UL4_04_VFD1_IO1","UL4_4_BCN2_H"]
["UL4_04_VFD1","SI0","UL4_04_VFD1_SI0","UL4_4_EPC1"]
["UL4_04_VFD1","SI1","UL4_04_VFD1_SI1","UL4_4_EPC1_2"]
["UL4_04_VFD1","SI2","UL4_04_VFD1_SI2","UL4_4_EPC2"]
["UL4_04_VFD1","SI3","UL4_04_VFD1_SI3","UL4_4_EPC2_2"]
["UL4_04_VFD1","SO0","UL4_04_VFD1_SO0","UL4_4_BCN1_R","2025-06-18"]
["UL4_05_VFD1","I0","UL4_05_VFD1_I0","UL4_5_VFD1_DISC"]
["UL4_05_VFD1","I1","UL4_05_VFD1_I1","UL4_5_ENC1"]
["UL4_05_VFD1","I2","UL4_05_VFD1_I2","UL4_5_TPE1"]
["UL4_05_VFD1","I3","UL4_05_VFD1_I3"]
["UL4_05_VFD1","IO0","UL4_05_VFD1_IO0","UL4_4_S1_PB"]
["UL4_05_VFD1","IO1","UL4_05_VFD1_IO1","UL4_4_S1_PB_LT"]
["UL4_05_VFD1","SI0","UL4_05_VFD1_SI0"]
["UL4_05_VFD1","SI1","UL4_05_VFD1_SI1"]
["UL4_05_VFD1","SI2","UL4_05_VFD1_SI2"]
["UL4_05_VFD1","SI3","UL4_05_VFD1_SI3"]
["UL4_05_VFD1","SO0","UL4_05_VFD1_SO0"]
["UL4_06_VFD1","I0","UL4_06_VFD1_I0","UL4_6_VFD1_DISC"]
["UL4_06_VFD1","I1","UL4_06_VFD1_I1","UL4_6_ENC1"]
["UL4_06_VFD1","I2","UL4_06_VFD1_I2","UL4_6_TPE1"]
["UL4_06_VFD1","I3","UL4_06_VFD1_I3"]
["UL4_06_VFD1","IO0","UL4_06_VFD1_IO0","UL4_4_S2_PB"]
["UL4_06_VFD1","IO1","UL4_06_VFD1_IO1","UL4_4_S2_PB_LT"]
["UL4_06_VFD1","SI0","UL4_06_VFD1_SI0"]
["UL4_06_VFD1","SI1","UL4_06_VFD1_SI1"]
["UL4_06_VFD1","SI2","UL4_06_VFD1_SI2"]
["UL4_06_VFD1","SI3","UL4_06_VFD1_SI3"]
["UL4_06_VFD1","SO0","UL4_06_VFD1_SO0"]
["UL4_07_VFD1","I0","UL4_07_VFD1_I0","UL4_7_VFD1_DISC"]
["UL4_07_VFD1","I1","UL4_07_VFD1_I1","UL4_7_ENC1"]
["UL4_07_VFD1","I2","UL4_07_VFD1_I2","UL4_7_TPE1"]
["UL4_07_VFD1","I3","UL4_07_VFD1_I3"]
["UL4_07_VFD1","IO0","UL4_07_VFD1_IO0"]
["UL4_07_VFD1","IO1","UL4_07_VFD1_IO1"]
["UL4_07_VFD1","SI0","UL4_07_VFD1_SI0"]
["UL4_07_VFD1","SI1","UL4_07_VFD1_SI1"]
["UL4_07_VFD1","SI2","UL4_07_VFD1_SI2"]
["UL4_07_VFD1","SI3","UL4_07_VFD1_SI3"]
["UL4_07_VFD1","SO0","UL4_07_VFD1_SO0"]
["UL4_08_VFD1","I0","UL4_08_VFD1_I0","UL4_8_VFD1_DISC"]
["UL4_08_VFD1","I1","UL4_08_VFD1_I1","UL4_8_ENC1"]
["UL4_08_VFD1","I2","UL4_08_VFD1_I2","UL4_8_TPE1"]
["UL4_08_VFD1","I3","UL4_08_VFD1_I3"]
["UL4_08_VFD1","IO0","UL4_08_VFD1_IO0"]
["UL4_08_VFD1","IO1","UL4_08_VFD1_IO1"]
["UL4_08_VFD1","SI0","UL4_08_VFD1_SI0"]
["UL4_08_VFD1","SI1","UL4_08_VFD1_SI1"]
["UL4_08_VFD1","SI2","UL4_08_VFD1_SI2"]
["UL4_08_VFD1","SI3","UL4_08_VFD1_SI3"]
["UL4_08_VFD1","SO0","UL4_08_VFD1_SO0"]
["UL4_09_VFD1","I0","UL4_09_VFD1_I0","UL4_9_VFD1_DISC"]
["UL4_09_VFD1","I1","UL4_09_VFD1_I1","UL4_9_ENC1"]
["UL4_09_VFD1","I2","UL4_09_VFD1_I2","UL4_9_TPE1"]
["UL4_09_VFD1","I3","UL4_09_VFD1_I3","UL4_9_TPE2"]
["UL4_09_VFD1","IO0","UL4_09_VFD1_IO0","UL4_9_BCN1_A"]
["UL4_09_VFD1","IO1","UL4_09_VFD1_IO1","UL4_9_BCN1_R"]
["UL4_09_VFD1","SI0","UL4_09_VFD1_SI0","UL4_9_EPC1"]
["UL4_09_VFD1","SI1","UL4_09_VFD1_SI1","UL4_9_EPC1_2"]
["UL4_09_VFD1","SI2","UL4_09_VFD1_SI2","UL4_9_EPC2"]
["UL4_09_VFD1","SI3","UL4_09_VFD1_SI3","UL4_9_EPC2_2"]
["UL4_09_VFD1","SO0","UL4_09_VFD1_SO0","UL4_9_BCN2_R"]
["UL4_10A_VFD1","I0","UL4_10A_VFD1_I0","UL4_10A_VFD1_DISC"]
["UL4_10A_VFD1","I1","UL4_10A_VFD1_I1","UL4_9_TPE3"]
["UL4_10A_VFD1","I2","UL4_10A_VFD1_I2","UL4_9_TPE4"]
["UL4_10A_VFD1","I3","UL4_10A_VFD1_I3","UL4_9_TPE5"]
["UL4_10A_VFD1","IO0","UL4_10A_VFD1_IO0","UL4_9_JR1_PB"]
["UL4_10A_VFD1","IO1","UL4_10A_VFD1_IO1","UL4_9_JR1_PB_LT"]
["UL4_10A_VFD1","SI0","UL4_10A_VFD1_SI0"]
["UL4_10A_VFD1","SI1","UL4_10A_VFD1_SI1"]
["UL4_10A_VFD1","SI2","UL4_10A_VFD1_SI2"]
["UL4_10A_VFD1","SI3","UL4_10A_VFD1_SI3"]
["UL4_10A_VFD1","SO0","UL4_10A_VFD1_SO0"]
["UL4_10B_VFD1","I0","UL4_10B_VFD1_I0","UL4_10B_VFD1_DISC"]
["UL4_10B_VFD1","I1","UL4_10B_VFD1_I1"]
["UL4_10B_VFD1","I2","UL4_10B_VFD1_I2"]
["UL4_10B_VFD1","I3","UL4_10B_VFD1_I3"]
["UL4_10B_VFD1","IO0","UL4_10B_VFD1_IO0","UL4_9_JR2_PB"]
["UL4_10B_VFD1","IO1","UL4_10B_VFD1_IO1","UL4_9_JR2_PB_LT"]
["UL4_10B_VFD1","SI0","UL4_10B_VFD1_SI0"]
["UL4_10B_VFD1","SI1","UL4_10B_VFD1_SI1"]
["UL4_10B_VFD1","SI2","UL4_10B_VFD1_SI2"]
["UL4_10B_VFD1","SI3","UL4_10B_VFD1_SI3"]
["UL4_10B_VFD1","SO0","UL4_10B_VFD1_SO0"]
["UL4_11_VFD1","I0","UL4_11_VFD1_I0","UL4_11_VFD1_DISC"]
["UL4_11_VFD1","I1","UL4_11_VFD1_I1"]
["UL4_11_VFD1","I2","UL4_11_VFD1_I2","UL4_11_TPE1"]
["UL4_11_VFD1","I3","UL4_11_VFD1_I3","UL4_11_TPE2"]
["UL4_11_VFD1","IO0","UL4_11_VFD1_IO0","UL4_9_S1_PB"]
["UL4_11_VFD1","IO1","UL4_11_VFD1_IO1","UL4_9_S1_PB_LT"]
["UL4_11_VFD1","SI0","UL4_11_VFD1_SI0"]
["UL4_11_VFD1","SI1","UL4_11_VFD1_SI1"]
["UL4_11_VFD1","SI2","UL4_11_VFD1_SI2"]
["UL4_11_VFD1","SI3","UL4_11_VFD1_SI3"]
["UL4_11_VFD1","SO0","UL4_11_VFD1_SO0"]
["UL4_12_VFD1","I0","UL4_12_VFD1_I0","UL4_12_VFD1_DISC"]
["UL4_12_VFD1","I1","UL4_12_VFD1_I1"]
["UL4_12_VFD1","I2","UL4_12_VFD1_I2","UL4_12_TPE1"]
["UL4_12_VFD1","I3","UL4_12_VFD1_I3"]
["UL4_12_VFD1","IO0","UL4_12_VFD1_IO0","UL4_9_S2_PB"]
["UL4_12_VFD1","IO1","UL4_12_VFD1_IO1","UL4_9_S2_PB_LT"]
["UL4_12_VFD1","SI0","UL4_12_VFD1_SI0"]
["UL4_12_VFD1","SI1","UL4_12_VFD1_SI1"]
["UL4_12_VFD1","SI2","UL4_12_VFD1_SI2"]
["UL4_12_VFD1","SI3","UL4_12_VFD1_SI3"]
["UL4_12_VFD1","SO0","UL4_12_VFD1_SO0"]
["UL4_13_VFD1","I0","UL4_13_VFD1_I0","UL4_13_VFD1_DISC"]
["UL4_13_VFD1","I1","UL4_13_VFD1_I1"]
["UL4_13_VFD1","I2","UL4_13_VFD1_I2"]
["UL4_13_VFD1","I3","UL4_13_VFD1_I3"]
["UL4_13_VFD1","IO0","UL4_13_VFD1_IO0"]
["UL4_13_VFD1","IO1","UL4_13_VFD1_IO1"]
["UL4_13_VFD1","SI0","UL4_13_VFD1_SI0"]
["UL4_13_VFD1","SI1","UL4_13_VFD1_SI1"]
["UL4_13_VFD1","SI2","UL4_13_VFD1_SI2"]
["UL4_13_VFD1","SI3","UL4_13_VFD1_SI3"]
["UL4_13_VFD1","SO0","UL4_13_VFD1_SO0"]
["UL4_13_VFD1","ENC1","UL4_13_VFD1_ENC1","UL4_13_ENC1","2025-06-06"]
["UL5_03_FIO1","IO00","UL5_03_FIO1_IO00","UL5_3_BCN1_R"]
["UL5_03_FIO1","IO01","UL5_03_FIO1_IO01"]
["UL5_03_FIO1","IO02","UL5_03_FIO1_IO02","UL5_3_BCN2_R"]
["UL5_03_FIO1","IO03","UL5_03_FIO1_IO03"]
["UL5_03_FIO1","IO04","UL5_03_FIO1_IO04","UL5_3_LPE1"]
["UL5_03_FIO1","IO05","UL5_03_FIO1_IO05"]
["UL5_03_FIO1","IO06","UL5_03_FIO1_IO06","UL5_3_LPE2"]
["UL5_03_FIO1","IO07","UL5_03_FIO1_IO07"]
["UL5_03_FIO1","IO08","UL5_03_FIO1_IO08","UL5_3_S1_PB"]
["UL5_03_FIO1","IO09","UL5_03_FIO1_IO09","UL5_3_S1_PB_LT"]
["UL5_03_FIO1","IO10","UL5_03_FIO1_IO10","UL5_3_S2_PB"]
["UL5_03_FIO1","IO11","UL5_03_FIO1_IO11","UL5_3_S2_PB_LT"]
["UL5_03_FIO1","IO12","UL5_03_FIO1_IO12"]
["UL5_03_FIO1","IO13","UL5_03_FIO1_IO13"]
["UL5_03_FIO1","IO14","UL5_03_FIO1_IO14"]
["UL5_03_FIO1","IO15","UL5_03_FIO1_IO15"]
["UL5_03_VFD1","I0","UL5_03_VFD1_I0","UL5_3_VFD1_DISC"]
["UL5_03_VFD1","I1","UL5_03_VFD1_I1","UL5_3_ENC1"]
["UL5_03_VFD1","I2","UL5_03_VFD1_I2","UL5_3_TPE1"]
["UL5_03_VFD1","I3","UL5_03_VFD1_I3","UL5_3_TPE2"]
["UL5_03_VFD1","IO0","UL5_03_VFD1_IO0","UL5_4_S1_PB"]
["UL5_03_VFD1","IO1","UL5_03_VFD1_IO1","UL5_4_S1_PB_LT"]
["UL5_03_VFD1","SI0","UL5_03_VFD1_SI0","UL5_3_EPC1"]
["UL5_03_VFD1","SI1","UL5_03_VFD1_SI1","UL5_3_EPC1_2"]
["UL5_03_VFD1","SI2","UL5_03_VFD1_SI2","UL5_3_EPC2"]
["UL5_03_VFD1","SI3","UL5_03_VFD1_SI3","UL5_3_EPC2_2"]
["UL5_03_VFD1","SO0","UL5_03_VFD1_SO0"]
["UL5_04_VFD1","I0","UL5_04_VFD1_I0","UL5_4_VFD1_DISC"]
["UL5_04_VFD1","I1","UL5_04_VFD1_I1","UL5_4_ENC1"]
["UL5_04_VFD1","I2","UL5_04_VFD1_I2","UL5_4_TPE1"]
["UL5_04_VFD1","I3","UL5_04_VFD1_I3"]
["UL5_04_VFD1","IO0","UL5_04_VFD1_IO0","UL5_4_BCN1_R"]
["UL5_04_VFD1","IO1","UL5_04_VFD1_IO1","UL5_4_BCN2_R"]
["UL5_04_VFD1","SI0","UL5_04_VFD1_SI0","UL5_4_EPC1"]
["UL5_04_VFD1","SI1","UL5_04_VFD1_SI1","UL5_4_EPC1_2"]
["UL5_04_VFD1","SI2","UL5_04_VFD1_SI2","UL5_4_EPC2"]
["UL5_04_VFD1","SI3","UL5_04_VFD1_SI3","UL5_4_EPC2_2"]
["UL5_04_VFD1","SO0","UL5_04_VFD1_SO0"]
["UL5_05_VFD1","I0","UL5_05_VFD1_I0","UL5_5_VFD1_DISC"]
["UL5_05_VFD1","I1","UL5_05_VFD1_I1","UL5_5_ENC1"]
["UL5_05_VFD1","I2","UL5_05_VFD1_I2"]
["UL5_05_VFD1","I3","UL5_05_VFD1_I3"]
["UL5_05_VFD1","IO0","UL5_05_VFD1_IO0","UL5_4_S2_PB"]
["UL5_05_VFD1","IO1","UL5_05_VFD1_IO1","UL5_4_S2_PB_LT"]
["UL5_05_VFD1","SI0","UL5_05_VFD1_SI0"]
["UL5_05_VFD1","SI1","UL5_05_VFD1_SI1"]
["UL5_05_VFD1","SI2","UL5_05_VFD1_SI2"]
["UL5_05_VFD1","SI3","UL5_05_VFD1_SI3"]
["UL5_05_VFD1","SO0","UL5_05_VFD1_SO0"]
["UL5_06_VFD1","I0","UL5_06_VFD1_I0","UL5_6_VFD1_DISC"]
["UL5_06_VFD1","I1","UL5_06_VFD1_I1","UL5_6_ENC1"]
["UL5_06_VFD1","I2","UL5_06_VFD1_I2","UL5_6_TPE1"]
["UL5_06_VFD1","I3","UL5_06_VFD1_I3","UL5_6_TPE2"]
["UL5_06_VFD1","IO0","UL5_06_VFD1_IO0"]
["UL5_06_VFD1","IO1","UL5_06_VFD1_IO1"]
["UL5_06_VFD1","SI0","UL5_06_VFD1_SI0"]
["UL5_06_VFD1","SI1","UL5_06_VFD1_SI1"]
["UL5_06_VFD1","SI2","UL5_06_VFD1_SI2"]
["UL5_06_VFD1","SI3","UL5_06_VFD1_SI3"]
["UL5_06_VFD1","SO0","UL5_06_VFD1_SO0"]
["UL5_07_VFD1","I0","UL5_07_VFD1_I0","UL5_7_VFD1_DISC"]
["UL5_07_VFD1","I1","UL5_07_VFD1_I1","UL5_7_ENC1"]
["UL5_07_VFD1","I2","UL5_07_VFD1_I2","UL5_7_TPE1"]
["UL5_07_VFD1","I3","UL5_07_VFD1_I3"]
["UL5_07_VFD1","IO0","UL5_07_VFD1_IO0"]
["UL5_07_VFD1","IO1","UL5_07_VFD1_IO1"]
["UL5_07_VFD1","SI0","UL5_07_VFD1_SI0"]
["UL5_07_VFD1","SI1","UL5_07_VFD1_SI1"]
["UL5_07_VFD1","SI2","UL5_07_VFD1_SI2"]
["UL5_07_VFD1","SI3","UL5_07_VFD1_SI3"]
["UL5_07_VFD1","SO0","UL5_07_VFD1_SO0"]
["UL5_08_VFD1","I0","UL5_08_VFD1_I0","UL5_8_VFD1_DISC"]
["UL5_08_VFD1","I1","UL5_08_VFD1_I1","UL5_8_ENC1"]
["UL5_08_VFD1","I2","UL5_08_VFD1_I2","UL5_8_TPE1"]
["UL5_08_VFD1","I3","UL5_08_VFD1_I3"]
["UL5_08_VFD1","IO0","UL5_08_VFD1_IO0"]
["UL5_08_VFD1","IO1","UL5_08_VFD1_IO1"]
["UL5_08_VFD1","SI0","UL5_08_VFD1_SI0"]
["UL5_08_VFD1","SI1","UL5_08_VFD1_SI1"]
["UL5_08_VFD1","SI2","UL5_08_VFD1_SI2"]
["UL5_08_VFD1","SI3","UL5_08_VFD1_SI3"]
["UL5_08_VFD1","SO0","UL5_08_VFD1_SO0"]
["UL5_09_VFD1","I0","UL5_09_VFD1_I0","UL5_9_VFD1_DISC"]
["UL5_09_VFD1","I1","UL5_09_VFD1_I1","UL5_9_ENC1"]
["UL5_09_VFD1","I2","UL5_09_VFD1_I2","UL5_9_TPE1"]
["UL5_09_VFD1","I3","UL5_09_VFD1_I3"]
["UL5_09_VFD1","IO0","UL5_09_VFD1_IO0"]
["UL5_09_VFD1","IO1","UL5_09_VFD1_IO1"]
["UL5_09_VFD1","SI0","UL5_09_VFD1_SI0"]
["UL5_09_VFD1","SI1","UL5_09_VFD1_SI1"]
["UL5_09_VFD1","SI2","UL5_09_VFD1_SI2"]
["UL5_09_VFD1","SI3","UL5_09_VFD1_SI3"]
["UL5_09_VFD1","SO0","UL5_09_VFD1_SO0"]
["UL5_10_VFD1","I0","UL5_10_VFD1_I0","UL5_10_VFD1_DISC"]
["UL5_10_VFD1","I1","UL5_10_VFD1_I1"]
["UL5_10_VFD1","I2","UL5_10_VFD1_I2"]
["UL5_10_VFD1","I3","UL5_10_VFD1_I3"]
["UL5_10_VFD1","IO0","UL5_10_VFD1_IO0"]
["UL5_10_VFD1","IO1","UL5_10_VFD1_IO1"]
["UL5_10_VFD1","SI0","UL5_10_VFD1_SI0"]
["UL5_10_VFD1","SI1","UL5_10_VFD1_SI1"]
["UL5_10_VFD1","SI2","UL5_10_VFD1_SI2"]
["UL5_10_VFD1","SI3","UL5_10_VFD1_SI3"]
["UL5_10_VFD1","SO0","UL5_10_VFD1_SO0"]
["UL6_01_VFD1","I0","UL6_01_VFD1_I0","UL6_1_VFD1_DISC"]
["UL6_01_VFD1","I1","UL6_01_VFD1_I1"]
["UL6_01_VFD1","I2","UL6_01_VFD1_I2","UL6_1_TPE1"]
["UL6_01_VFD1","I3","UL6_01_VFD1_I3"]
["UL6_01_VFD1","IO0","UL6_01_VFD1_IO0"]
["UL6_01_VFD1","IO1","UL6_01_VFD1_IO1"]
["UL6_01_VFD1","SI0","UL6_01_VFD1_SI0","UL6_1_EPC1"]
["UL6_01_VFD1","SI1","UL6_01_VFD1_SI1","UL6_1_EPC1_2"]
["UL6_01_VFD1","SI2","UL6_01_VFD1_SI2","UL6_1_EPC2"]
["UL6_01_VFD1","SI3","UL6_01_VFD1_SI3","UL6_1_EPC2_2"]
["UL6_01_VFD1","SO0","UL6_01_VFD1_SO0"]
["UL6_02_FIO1","IO00","UL6_02_FIO1_IO00","UL6_1_BCN1_R"]
["UL6_02_FIO1","IO01","UL6_02_FIO1_IO01","UL6_1_BCN2_R"]
["UL6_02_FIO1","IO02","UL6_02_FIO1_IO02","UL6_1_SS1_SPB"]
["UL6_02_FIO1","IO03","UL6_02_FIO1_IO03","UL6_1_SS1_STPB"]
["UL6_02_FIO1","IO04","UL6_02_FIO1_IO04","UL6_1_SS1_STPB_LT"]
["UL6_02_FIO1","IO05","UL6_02_FIO1_IO05"]
["UL6_02_FIO1","IO06","UL6_02_FIO1_IO06","UL6_2_BCN1_R"]
["UL6_02_FIO1","IO07","UL6_02_FIO1_IO07","UL6_2_BCN2_R"]
["UL6_02_FIO1","IO08","UL6_02_FIO1_IO08","UL6_2_LPE1"]
["UL6_02_FIO1","IO09","UL6_02_FIO1_IO09"]
["UL6_02_FIO1","IO10","UL6_02_FIO1_IO10","UL6_2_LPE2"]
["UL6_02_FIO1","IO11","UL6_02_FIO1_IO11"]
["UL6_02_FIO1","IO12","UL6_02_FIO1_IO12","UL6_2_S1_PB"]
["UL6_02_FIO1","IO13","UL6_02_FIO1_IO13","UL6_2_S1_PB_LT"]
["UL6_02_FIO1","IO14","UL6_02_FIO1_IO14","UL6_2_S2_PB"]
["UL6_02_FIO1","IO15","UL6_02_FIO1_IO15","UL6_2_S2_PB_LT"]
["UL6_02_VFD1","I0","UL6_02_VFD1_I0","UL6_2_VFD1_DISC"]
["UL6_02_VFD1","I1","UL6_02_VFD1_I1","UL6_2_ENC1"]
["UL6_02_VFD1","I2","UL6_02_VFD1_I2","UL6_2_TPE1"]
["UL6_02_VFD1","I3","UL6_02_VFD1_I3","UL6_2_TPE2"]
["UL6_02_VFD1","IO0","UL6_02_VFD1_IO0"]
["UL6_02_VFD1","IO1","UL6_02_VFD1_IO1"]
["UL6_02_VFD1","SI0","UL6_02_VFD1_SI0","UL6_2_EPC1"]
["UL6_02_VFD1","SI1","UL6_02_VFD1_SI1","UL6_2_EPC1_2"]
["UL6_02_VFD1","SI2","UL6_02_VFD1_SI2","UL6_2_EPC2"]
["UL6_02_VFD1","SI3","UL6_02_VFD1_SI3","UL6_2_EPC2_2"]
["UL6_02_VFD1","SO0","UL6_02_VFD1_SO0"]
["UL6_03_VFD1","I0","UL6_03_VFD1_I0","UL6_3_VFD1_DISC"]
["UL6_03_VFD1","I1","UL6_03_VFD1_I1","UL6_3_ENC1"]
["UL6_03_VFD1","I2","UL6_03_VFD1_I2"]
["UL6_03_VFD1","I3","UL6_03_VFD1_I3"]
["UL6_03_VFD1","IO0","UL6_03_VFD1_IO0"]
["UL6_03_VFD1","IO1","UL6_03_VFD1_IO1"]
["UL6_03_VFD1","SI0","UL6_03_VFD1_SI0"]
["UL6_03_VFD1","SI1","UL6_03_VFD1_SI1"]
["UL6_03_VFD1","SI2","UL6_03_VFD1_SI2"]
["UL6_03_VFD1","SI3","UL6_03_VFD1_SI3"]
["UL6_03_VFD1","SO0","UL6_03_VFD1_SO0"]
["UL6_04_VFD1","I0","UL6_04_VFD1_I0","UL6_4_VFD1_DISC"]
["UL6_04_VFD1","I1","UL6_04_VFD1_I1","UL6_4_ENC1"]
["UL6_04_VFD1","I2","UL6_04_VFD1_I2","UL6_4_TPE1"]
["UL6_04_VFD1","I3","UL6_04_VFD1_I3","UL6_4_TPE2"]
["UL6_04_VFD1","IO0","UL6_04_VFD1_IO0"]
["UL6_04_VFD1","IO1","UL6_04_VFD1_IO1"]
["UL6_04_VFD1","SI0","UL6_04_VFD1_SI0"]
["UL6_04_VFD1","SI1","UL6_04_VFD1_SI1"]
["UL6_04_VFD1","SI2","UL6_04_VFD1_SI2"]
["UL6_04_VFD1","SI3","UL6_04_VFD1_SI3"]
["UL6_04_VFD1","SO0","UL6_04_VFD1_SO0"]
["UL6_05_VFD1","I0","UL6_05_VFD1_I0","UL6_5_VFD1_DISC"]
["UL6_05_VFD1","I1","UL6_05_VFD1_I1","UL6_5_ENC1"]
["UL6_05_VFD1","I2","UL6_05_VFD1_I2","UL6_5_TPE1"]
["UL6_05_VFD1","I3","UL6_05_VFD1_I3"]
["UL6_05_VFD1","IO0","UL6_05_VFD1_IO0"]
["UL6_05_VFD1","IO1","UL6_05_VFD1_IO1"]
["UL6_05_VFD1","SI0","UL6_05_VFD1_SI0"]
["UL6_05_VFD1","SI1","UL6_05_VFD1_SI1"]
["UL6_05_VFD1","SI2","UL6_05_VFD1_SI2"]
["UL6_05_VFD1","SI3","UL6_05_VFD1_SI3"]
["UL6_05_VFD1","SO0","UL6_05_VFD1_SO0"]
["UL6_06_VFD1","I0","UL6_06_VFD1_I0","UL6_6_VFD1_DISC"]
["UL6_06_VFD1","I1","UL6_06_VFD1_I1","UL6_6_ENC1"]
["UL6_06_VFD1","I2","UL6_06_VFD1_I2","UL6_6_TPE1"]
["UL6_06_VFD1","I3","UL6_06_VFD1_I3"]
["UL6_06_VFD1","IO0","UL6_06_VFD1_IO0"]
["UL6_06_VFD1","IO1","UL6_06_VFD1_IO1"]
["UL6_06_VFD1","SI0","UL6_06_VFD1_SI0"]
["UL6_06_VFD1","SI1","UL6_06_VFD1_SI1"]
["UL6_06_VFD1","SI2","UL6_06_VFD1_SI2"]
["UL6_06_VFD1","SI3","UL6_06_VFD1_SI3"]
["UL6_06_VFD1","SO0","UL6_06_VFD1_SO0"]
["UL6_07_VFD1","I0","UL6_07_VFD1_I0","UL6_7_VFD1_DISC"]
["UL6_07_VFD1","I1","UL6_07_VFD1_I1","UL6_7_ENC1"]
["UL6_07_VFD1","I2","UL6_07_VFD1_I2","UL6_7_TPE1"]
["UL6_07_VFD1","I3","UL6_07_VFD1_I3"]
["UL6_07_VFD1","IO0","UL6_07_VFD1_IO0"]
["UL6_07_VFD1","IO1","UL6_07_VFD1_IO1"]
["UL6_07_VFD1","SI0","UL6_07_VFD1_SI0"]
["UL6_07_VFD1","SI1","UL6_07_VFD1_SI1"]
["UL6_07_VFD1","SI2","UL6_07_VFD1_SI2"]
["UL6_07_VFD1","SI3","UL6_07_VFD1_SI3"]
["UL6_07_VFD1","SO0","UL6_07_VFD1_SO0"]
["UL6_08_VFD1","I0","UL6_08_VFD1_I0","UL6_8_VFD1_DISC"]
["UL6_08_VFD1","I1","UL6_08_VFD1_I1","UL6_8_ENC1"]
["UL6_08_VFD1","I2","UL6_08_VFD1_I2","UL6_8_TPE1"]
["UL6_08_VFD1","I3","UL6_08_VFD1_I3"]
["UL6_08_VFD1","IO0","UL6_08_VFD1_IO0"]
["UL6_08_VFD1","IO1","UL6_08_VFD1_IO1"]
["UL6_08_VFD1","SI0","UL6_08_VFD1_SI0"]
["UL6_08_VFD1","SI1","UL6_08_VFD1_SI1"]
["UL6_08_VFD1","SI2","UL6_08_VFD1_SI2"]
["UL6_08_VFD1","SI3","UL6_08_VFD1_SI3"]
["UL6_08_VFD1","SO0","UL6_08_VFD1_SO0"]
["UL6_09_VFD1","I0","UL6_09_VFD1_I0","UL6_9_VFD1_DISC"]
["UL6_09_VFD1","I1","UL6_09_VFD1_I1"]
["UL6_09_VFD1","I2","UL6_09_VFD1_I2"]
["UL6_09_VFD1","I3","UL6_09_VFD1_I3"]
["UL6_09_VFD1","IO0","UL6_09_VFD1_IO0"]
["UL6_09_VFD1","IO1","UL6_09_VFD1_IO1"]
["UL6_09_VFD1","SI0","UL6_09_VFD1_SI0"]
["UL6_09_VFD1","SI1","UL6_09_VFD1_SI1"]
["UL6_09_VFD1","SI2","UL6_09_VFD1_SI2"]
["UL6_09_VFD1","SI3","UL6_09_VFD1_SI3"]
["UL6_09_VFD1","SO0","UL6_09_VFD1_SO0"]
["UL7_03_FIO1","IO00","UL7_03_FIO1_IO00","UL7_3_BCN1_R"]
["UL7_03_FIO1","IO01","UL7_03_FIO1_IO01"]
["UL7_03_FIO1","IO02","UL7_03_FIO1_IO02","UL7_3_BCN2_R"]
["UL7_03_FIO1","IO03","UL7_03_FIO1_IO03"]
["UL7_03_FIO1","IO04","UL7_03_FIO1_IO04","UL7_3_LPE1"]
["UL7_03_FIO1","IO05","UL7_03_FIO1_IO05"]
["UL7_03_FIO1","IO06","UL7_03_FIO1_IO06","UL7_3_LPE2"]
["UL7_03_FIO1","IO07","UL7_03_FIO1_IO07"]
["UL7_03_FIO1","IO08","UL7_03_FIO1_IO08","UL7_3_S1_PB"]
["UL7_03_FIO1","IO09","UL7_03_FIO1_IO09","UL7_3_S1_PB_LT"]
["UL7_03_FIO1","IO10","UL7_03_FIO1_IO10","UL7_3_S2_PB"]
["UL7_03_FIO1","IO11","UL7_03_FIO1_IO11","UL7_3_S2_PB_LT"]
["UL7_03_FIO1","IO12","UL7_03_FIO1_IO12"]
["UL7_03_FIO1","IO13","UL7_03_FIO1_IO13"]
["UL7_03_FIO1","IO14","UL7_03_FIO1_IO14"]
["UL7_03_FIO1","IO15","UL7_03_FIO1_IO15"]
["UL7_03_VFD1","I0","UL7_03_VFD1_I0","UL7_3_VFD1_DISC"]
["UL7_03_VFD1","I1","UL7_03_VFD1_I1","UL7_3_ENC1"]
["UL7_03_VFD1","I2","UL7_03_VFD1_I2","UL7_3_TPE1"]
["UL7_03_VFD1","I3","UL7_03_VFD1_I3","UL7_3_TPE2"]
["UL7_03_VFD1","IO0","UL7_03_VFD1_IO0","UL7_4_S1_PB"]
["UL7_03_VFD1","IO1","UL7_03_VFD1_IO1","UL7_4_S1_PB_LT"]
["UL7_03_VFD1","SI0","UL7_03_VFD1_SI0","UL7_3_EPC1"]
["UL7_03_VFD1","SI1","UL7_03_VFD1_SI1","UL7_3_EPC1_2"]
["UL7_03_VFD1","SI2","UL7_03_VFD1_SI2","UL7_3_EPC2"]
["UL7_03_VFD1","SI3","UL7_03_VFD1_SI3","UL7_3_EPC2_2"]
["UL7_03_VFD1","SO0","UL7_03_VFD1_SO0"]
["UL7_04_VFD1","I0","UL7_04_VFD1_I0","UL7_4_VFD1_DISC"]
["UL7_04_VFD1","I1","UL7_04_VFD1_I1","UL7_4_ENC1"]
["UL7_04_VFD1","I2","UL7_04_VFD1_I2","UL7_4_TPE1"]
["UL7_04_VFD1","I3","UL7_04_VFD1_I3"]
["UL7_04_VFD1","IO0","UL7_04_VFD1_IO0","UL7_4_BCN1_R"]
["UL7_04_VFD1","IO1","UL7_04_VFD1_IO1","UL7_4_BCN2_R"]
["UL7_04_VFD1","SI0","UL7_04_VFD1_SI0","UL7_4_EPC1"]
["UL7_04_VFD1","SI1","UL7_04_VFD1_SI1","UL7_4_EPC1_2"]
["UL7_04_VFD1","SI2","UL7_04_VFD1_SI2","UL7_4_EPC2"]
["UL7_04_VFD1","SI3","UL7_04_VFD1_SI3","UL7_4_EPC2_2"]
["UL7_04_VFD1","SO0","UL7_04_VFD1_SO0"]
["UL7_05_VFD1","I0","UL7_05_VFD1_I0","UL7_5_VFD1_DISC"]
["UL7_05_VFD1","I1","UL7_05_VFD1_I1","UL7_5_ENC1"]
["UL7_05_VFD1","I2","UL7_05_VFD1_I2","UL7_5_TPE1"]
["UL7_05_VFD1","I3","UL7_05_VFD1_I3"]
["UL7_05_VFD1","IO0","UL7_05_VFD1_IO0","UL7_4_S2_PB"]
["UL7_05_VFD1","IO1","UL7_05_VFD1_IO1","UL7_4_S2_PB_LT"]
["UL7_05_VFD1","SI0","UL7_05_VFD1_SI0"]
["UL7_05_VFD1","SI1","UL7_05_VFD1_SI1"]
["UL7_05_VFD1","SI2","UL7_05_VFD1_SI2"]
["UL7_05_VFD1","SI3","UL7_05_VFD1_SI3"]
["UL7_05_VFD1","SO0","UL7_05_VFD1_SO0"]
["UL7_06_VFD1","I0","UL7_06_VFD1_I0","UL7_6_VFD1_DISC"]
["UL7_06_VFD1","I1","UL7_06_VFD1_I1","UL7_6_ENC1"]
["UL7_06_VFD1","I2","UL7_06_VFD1_I2","UL7_6_TPE1"]
["UL7_06_VFD1","I3","UL7_06_VFD1_I3"]
["UL7_06_VFD1","IO0","UL7_06_VFD1_IO0","UL7_9_S1_PB"]
["UL7_06_VFD1","IO1","UL7_06_VFD1_IO1","UL7_9_S1_PB_LT"]
["UL7_06_VFD1","SI0","UL7_06_VFD1_SI0"]
["UL7_06_VFD1","SI1","UL7_06_VFD1_SI1"]
["UL7_06_VFD1","SI2","UL7_06_VFD1_SI2"]
["UL7_06_VFD1","SI3","UL7_06_VFD1_SI3"]
["UL7_06_VFD1","SO0","UL7_06_VFD1_SO0"]
["UL7_07_VFD1","I0","UL7_07_VFD1_I0","UL7_7_VFD1_DISC"]
["UL7_07_VFD1","I1","UL7_07_VFD1_I1","UL7_7_ENC1"]
["UL7_07_VFD1","I2","UL7_07_VFD1_I2","UL7_7_TPE1"]
["UL7_07_VFD1","I3","UL7_07_VFD1_I3"]
["UL7_07_VFD1","IO0","UL7_07_VFD1_IO0","UL7_9_JR2_PB"]
["UL7_07_VFD1","IO1","UL7_07_VFD1_IO1","UL7_9_JR2_PB_LT"]
["UL7_07_VFD1","SI0","UL7_07_VFD1_SI0"]
["UL7_07_VFD1","SI1","UL7_07_VFD1_SI1"]
["UL7_07_VFD1","SI2","UL7_07_VFD1_SI2"]
["UL7_07_VFD1","SI3","UL7_07_VFD1_SI3"]
["UL7_07_VFD1","SO0","UL7_07_VFD1_SO0"]
["UL7_08_VFD1","I0","UL7_08_VFD1_I0","UL7_8_VFD1_DISC"]
["UL7_08_VFD1","I1","UL7_08_VFD1_I1","UL7_8_ENC1"]
["UL7_08_VFD1","I2","UL7_08_VFD1_I2","UL7_8_TPE1"]
["UL7_08_VFD1","I3","UL7_08_VFD1_I3"]
["UL7_08_VFD1","IO0","UL7_08_VFD1_IO0","UL7_9_JR1_PB"]
["UL7_08_VFD1","IO1","UL7_08_VFD1_IO1","UL7_9_JR1_PB_LT"]
["UL7_08_VFD1","SI0","UL7_08_VFD1_SI0"]
["UL7_08_VFD1","SI1","UL7_08_VFD1_SI1"]
["UL7_08_VFD1","SI2","UL7_08_VFD1_SI2"]
["UL7_08_VFD1","SI3","UL7_08_VFD1_SI3"]
["UL7_08_VFD1","SO0","UL7_08_VFD1_SO0"]
["UL7_09_VFD1","I0","UL7_09_VFD1_I0","UL7_9_VFD1_DISC"]
["UL7_09_VFD1","I1","UL7_09_VFD1_I1"]
["UL7_09_VFD1","I2","UL7_09_VFD1_I2","UL7_9_TPE1"]
["UL7_09_VFD1","I3","UL7_09_VFD1_I3","UL7_9_TPE2"]
["UL7_09_VFD1","IO0","UL7_09_VFD1_IO0","UL7_9_BCN1_A"]
["UL7_09_VFD1","IO1","UL7_09_VFD1_IO1","UL7_9_BCN1_R"]
["UL7_09_VFD1","SI0","UL7_09_VFD1_SI0","UL7_9_EPC1"]
["UL7_09_VFD1","SI1","UL7_09_VFD1_SI1","UL7_9_EPC1_2"]
["UL7_09_VFD1","SI2","UL7_09_VFD1_SI2","UL7_9_EPC2"]
["UL7_09_VFD1","SI3","UL7_09_VFD1_SI3","UL7_9_EPC2_2"]
["UL7_09_VFD1","SO0","UL7_09_VFD1_SO0","UL7_9_BCN2_R"]
["UL7_10A_VFD1","I0","UL7_10A_VFD1_I0","UL7_10A_VFD1_DISC"]
["UL7_10A_VFD1","I1","UL7_10A_VFD1_I1","UL7_9_TPE4"]
["UL7_10A_VFD1","I2","UL7_10A_VFD1_I2","UL7_9_TPE5"]
["UL7_10A_VFD1","I3","UL7_10A_VFD1_I3"]
["UL7_10A_VFD1","IO0","UL7_10A_VFD1_IO0","UL7_9_S2_PB"]
["UL7_10A_VFD1","IO1","UL7_10A_VFD1_IO1","UL7_9_S2_PB_LT"]
["UL7_10A_VFD1","SI0","UL7_10A_VFD1_SI0"]
["UL7_10A_VFD1","SI1","UL7_10A_VFD1_SI1"]
["UL7_10A_VFD1","SI2","UL7_10A_VFD1_SI2"]
["UL7_10A_VFD1","SI3","UL7_10A_VFD1_SI3"]
["UL7_10A_VFD1","SO0","UL7_10A_VFD1_SO0"]
["UL7_10B_VFD1","I0","UL7_10B_VFD1_I0","UL7_10B_VFD1_DISC"]
["UL7_10B_VFD1","I1","UL7_10B_VFD1_I1"]
["UL7_10B_VFD1","I2","UL7_10B_VFD1_I2"]
["UL7_10B_VFD1","I3","UL7_10B_VFD1_I3"]
["UL7_10B_VFD1","IO0","UL7_10B_VFD1_IO0"]
["UL7_10B_VFD1","IO1","UL7_10B_VFD1_IO1"]
["UL7_10B_VFD1","SI0","UL7_10B_VFD1_SI0"]
["UL7_10B_VFD1","SI1","UL7_10B_VFD1_SI1"]
["UL7_10B_VFD1","SI2","UL7_10B_VFD1_SI2"]
["UL7_10B_VFD1","SI3","UL7_10B_VFD1_SI3"]
["UL7_10B_VFD1","SO0","UL7_10B_VFD1_SO0"]
["UL7_11_VFD1","I0","UL7_11_VFD1_I0","UL7_11_VFD1_DISC"]
["UL7_11_VFD1","I1","UL7_11_VFD1_I1"]
["UL7_11_VFD1","I2","UL7_11_VFD1_I2","UL7_11_TPE1"]
["UL7_11_VFD1","I3","UL7_11_VFD1_I3","UL7_11_TPE2"]
["UL7_11_VFD1","IO0","UL7_11_VFD1_IO0"]
["UL7_11_VFD1","IO1","UL7_11_VFD1_IO1"]
["UL7_11_VFD1","SI0","UL7_11_VFD1_SI0"]
["UL7_11_VFD1","SI1","UL7_11_VFD1_SI1"]
["UL7_11_VFD1","SI2","UL7_11_VFD1_SI2"]
["UL7_11_VFD1","SI3","UL7_11_VFD1_SI3"]
["UL7_11_VFD1","SO0","UL7_11_VFD1_SO0"]
["UL7_12_VFD1","I0","UL7_12_VFD1_I0","UL7_12_VFD1_DISC"]
["UL7_12_VFD1","I1","UL7_12_VFD1_I1"]
["UL7_12_VFD1","I2","UL7_12_VFD1_I2","UL7_12_TPE1"]
["UL7_12_VFD1","I3","UL7_12_VFD1_I3"]
["UL7_12_VFD1","IO0","UL7_12_VFD1_IO0"]
["UL7_12_VFD1","IO1","UL7_12_VFD1_IO1"]
["UL7_12_VFD1","SI0","UL7_12_VFD1_SI0"]
["UL7_12_VFD1","SI1","UL7_12_VFD1_SI1"]
["UL7_12_VFD1","SI2","UL7_12_VFD1_SI2"]
["UL7_12_VFD1","SI3","UL7_12_VFD1_SI3"]
["UL7_12_VFD1","SO0","UL7_12_VFD1_SO0"]
["UL7_13_VFD1","I0","UL7_13_VFD1_I0","UL7_13_VFD1_DISC"]
["UL7_13_VFD1","I1","UL7_13_VFD1_I1"]
["UL7_13_VFD1","I2","UL7_13_VFD1_I2"]
["UL7_13_VFD1","I3","UL7_13_VFD1_I3"]
["UL7_13_VFD1","IO0","UL7_13_VFD1_IO0"]
["UL7_13_VFD1","IO1","UL7_13_VFD1_IO1"]
["UL7_13_VFD1","SI0","UL7_13_VFD1_SI0"]
["UL7_13_VFD1","SI1","UL7_13_VFD1_SI1"]
["UL7_13_VFD1","SI2","UL7_13_VFD1_SI2"]
["UL7_13_VFD1","SI3","UL7_13_VFD1_SI3"]
["UL7_13_VFD1","SO0","UL7_13_VFD1_SO0"]
["UL7_13_VFD1","ENC1","UL7_13_VFD1_ENC1","UL7_13_ENC1","2025-06-06"]
["UL8_01_VFD1","I0","UL8_01_VFD1_I0","UL8_1_VFD1_DISC"]
["UL8_01_VFD1","I1","UL8_01_VFD1_I1"]
["UL8_01_VFD1","I2","UL8_01_VFD1_I2","UL8_1_TPE1"]
["UL8_01_VFD1","I3","UL8_01_VFD1_I3"]
["UL8_01_VFD1","IO0","UL8_01_VFD1_IO0"]
["UL8_01_VFD1","IO1","UL8_01_VFD1_IO1"]
["UL8_01_VFD1","SI0","UL8_01_VFD1_SI0","UL8_1_EPC1"]
["UL8_01_VFD1","SI1","UL8_01_VFD1_SI1","UL8_1_EPC1_2"]
["UL8_01_VFD1","SI2","UL8_01_VFD1_SI2","UL8_1_EPC2"]
["UL8_01_VFD1","SI3","UL8_01_VFD1_SI3","UL8_1_EPC2_2"]
["UL8_01_VFD1","SO0","UL8_01_VFD1_SO0"]
["UL8_02_FIO1","IO00","UL8_02_FIO1_IO00","UL8_1_BCN1_R"]
["UL8_02_FIO1","IO01","UL8_02_FIO1_IO01"]
["UL8_02_FIO1","IO02","UL8_02_FIO1_IO02","UL8_1_BCN2_R"]
["UL8_02_FIO1","IO03","UL8_02_FIO1_IO03","UL8_1_SS1_SPB"]
["UL8_02_FIO1","IO04","UL8_02_FIO1_IO04","UL8_1_SS1_STPB"]
["UL8_02_FIO1","IO05","UL8_02_FIO1_IO05","UL8_1_SS1_STPB_LT"]
["UL8_02_FIO1","IO06","UL8_02_FIO1_IO06","UL8_2_LPE1","2025-06-03"]
["UL8_02_FIO1","IO07","UL8_02_FIO1_IO07"]
["UL8_02_FIO1","IO08","UL8_02_FIO1_IO08","UL8_2_LPE2","2025-06-03"]
["UL8_02_FIO1","IO09","UL8_02_FIO1_IO09"]
["UL8_02_FIO1","IO10","UL8_02_FIO1_IO10"]
["UL8_02_FIO1","IO11","UL8_02_FIO1_IO11"]
["UL8_02_FIO1","IO12","UL8_02_FIO1_IO12"]
["UL8_02_FIO1","IO13","UL8_02_FIO1_IO13"]
["UL8_02_FIO1","IO14","UL8_02_FIO1_IO14"]
["UL8_02_FIO1","IO15","UL8_02_FIO1_IO15"]
["UL8_02_VFD1","I0","UL8_02_VFD1_I0","UL8_2_VFD1_DISC"]
["UL8_02_VFD1","I1","UL8_02_VFD1_I1"]
["UL8_02_VFD1","I2","UL8_02_VFD1_I2","UL8_2_TPE1"]
["UL8_02_VFD1","I3","UL8_02_VFD1_I3","UL8_2_TPE2"]
["UL8_02_VFD1","IO0","UL8_02_VFD1_IO0"]
["UL8_02_VFD1","IO1","UL8_02_VFD1_IO1"]
["UL8_02_VFD1","SI0","UL8_02_VFD1_SI0"]
["UL8_02_VFD1","SI1","UL8_02_VFD1_SI1"]
["UL8_02_VFD1","SI2","UL8_02_VFD1_SI2"]
["UL8_02_VFD1","SI3","UL8_02_VFD1_SI3"]
["UL8_02_VFD1","SO0","UL8_02_VFD1_SO0"]
["UL8_03_VFD1","I0","UL8_03_VFD1_I0","UL8_3_VFD1_DISC"]
["UL8_03_VFD1","I1","UL8_03_VFD1_I1","UL8_3_ENC1"]
["UL8_03_VFD1","I2","UL8_03_VFD1_I2","UL8_3_TPE1"]
["UL8_03_VFD1","I3","UL8_03_VFD1_I3"]
["UL8_03_VFD1","IO0","UL8_03_VFD1_IO0","UL8_3_BCN1_R"]
["UL8_03_VFD1","IO1","UL8_03_VFD1_IO1","UL8_3_BCN2_R"]
["UL8_03_VFD1","SI0","UL8_03_VFD1_SI0","UL8_3_EPC1"]
["UL8_03_VFD1","SI1","UL8_03_VFD1_SI1","UL8_3_EPC1_2"]
["UL8_03_VFD1","SI2","UL8_03_VFD1_SI2","UL8_3_EPC2"]
["UL8_03_VFD1","SI3","UL8_03_VFD1_SI3","UL8_3_EPC2_2"]
["UL8_03_VFD1","SO0","UL8_03_VFD1_SO0"]
["UL8_04_VFD1","I0","UL8_04_VFD1_I0","UL8_4_VFD1_DISC"]
["UL8_04_VFD1","I1","UL8_04_VFD1_I1","UL8_4_ENC1"]
["UL8_04_VFD1","I2","UL8_04_VFD1_I2"]
["UL8_04_VFD1","I3","UL8_04_VFD1_I3"]
["UL8_04_VFD1","IO0","UL8_04_VFD1_IO0","UL8_3_S1_PB"]
["UL8_04_VFD1","IO1","UL8_04_VFD1_IO1","UL8_3_S1_PB_LT"]
["UL8_04_VFD1","SI0","UL8_04_VFD1_SI0"]
["UL8_04_VFD1","SI1","UL8_04_VFD1_SI1"]
["UL8_04_VFD1","SI2","UL8_04_VFD1_SI2"]
["UL8_04_VFD1","SI3","UL8_04_VFD1_SI3"]
["UL8_04_VFD1","SO0","UL8_04_VFD1_SO0"]
["UL8_05_VFD1","I0","UL8_05_VFD1_I0","UL8_5_VFD1_DISC"]
["UL8_05_VFD1","I1","UL8_05_VFD1_I1","UL8_5_ENC1"]
["UL8_05_VFD1","I2","UL8_05_VFD1_I2","UL8_5_TPE1"]
["UL8_05_VFD1","I3","UL8_05_VFD1_I3","UL8_5_TPE2"]
["UL8_05_VFD1","IO0","UL8_05_VFD1_IO0","UL8_3_S2_PB"]
["UL8_05_VFD1","IO1","UL8_05_VFD1_IO1","UL8_3_S2_PB_LT"]
["UL8_05_VFD1","SI0","UL8_05_VFD1_SI0"]
["UL8_05_VFD1","SI1","UL8_05_VFD1_SI1"]
["UL8_05_VFD1","SI2","UL8_05_VFD1_SI2"]
["UL8_05_VFD1","SI3","UL8_05_VFD1_SI3"]
["UL8_05_VFD1","SO0","UL8_05_VFD1_SO0"]
["UL8_06_VFD1","I0","UL8_06_VFD1_I0","UL8_6_VFD1_DISC"]
["UL8_06_VFD1","I1","UL8_06_VFD1_I1","UL8_6_ENC1"]
["UL8_06_VFD1","I2","UL8_06_VFD1_I2","UL8_6_TPE1"]
["UL8_06_VFD1","I3","UL8_06_VFD1_I3"]
["UL8_06_VFD1","IO0","UL8_06_VFD1_IO0"]
["UL8_06_VFD1","IO1","UL8_06_VFD1_IO1"]
["UL8_06_VFD1","SI0","UL8_06_VFD1_SI0"]
["UL8_06_VFD1","SI1","UL8_06_VFD1_SI1"]
["UL8_06_VFD1","SI2","UL8_06_VFD1_SI2"]
["UL8_06_VFD1","SI3","UL8_06_VFD1_SI3"]
["UL8_06_VFD1","SO0","UL8_06_VFD1_SO0"]
["UL8_07_VFD1","I0","UL8_07_VFD1_I0","UL8_7_VFD1_DISC"]
["UL8_07_VFD1","I1","UL8_07_VFD1_I1","UL8_7_ENC1"]
["UL8_07_VFD1","I2","UL8_07_VFD1_I2","UL8_7_TPE1"]
["UL8_07_VFD1","I3","UL8_07_VFD1_I3"]
["UL8_07_VFD1","IO0","UL8_07_VFD1_IO0"]
["UL8_07_VFD1","IO1","UL8_07_VFD1_IO1"]
["UL8_07_VFD1","SI0","UL8_07_VFD1_SI0"]
["UL8_07_VFD1","SI1","UL8_07_VFD1_SI1"]
["UL8_07_VFD1","SI2","UL8_07_VFD1_SI2"]
["UL8_07_VFD1","SI3","UL8_07_VFD1_SI3"]
["UL8_07_VFD1","SO0","UL8_07_VFD1_SO0"]
["UL8_08_VFD1","I0","UL8_08_VFD1_I0","UL8_8_VFD1_DISC"]
["UL8_08_VFD1","I1","UL8_08_VFD1_I1","UL8_8_ENC1"]
["UL8_08_VFD1","I2","UL8_08_VFD1_I2","UL8_8_TPE1"]
["UL8_08_VFD1","I3","UL8_08_VFD1_I3"]
["UL8_08_VFD1","IO0","UL8_08_VFD1_IO0"]
["UL8_08_VFD1","IO1","UL8_08_VFD1_IO1"]
["UL8_08_VFD1","SI0","UL8_08_VFD1_SI0"]
["UL8_08_VFD1","SI1","UL8_08_VFD1_SI1"]
["UL8_08_VFD1","SI2","UL8_08_VFD1_SI2"]
["UL8_08_VFD1","SI3","UL8_08_VFD1_SI3"]
["UL8_08_VFD1","SO0","UL8_08_VFD1_SO0"]
["UL8_09_VFD1","I0","UL8_09_VFD1_I0","UL8_9_VFD1_DISC"]
["UL8_09_VFD1","I1","UL8_09_VFD1_I1"]
["UL8_09_VFD1","I2","UL8_09_VFD1_I2"]
["UL8_09_VFD1","I3","UL8_09_VFD1_I3"]
["UL8_09_VFD1","IO0","UL8_09_VFD1_IO0"]
["UL8_09_VFD1","IO1","UL8_09_VFD1_IO1"]
["UL8_09_VFD1","SI0","UL8_09_VFD1_SI0"]
["UL8_09_VFD1","SI1","UL8_09_VFD1_SI1"]
["UL8_09_VFD1","SI2","UL8_09_VFD1_SI2"]
["UL8_09_VFD1","SI3","UL8_09_VFD1_SI3"]
["UL8_09_VFD1","SO0","UL8_09_VFD1_SO0"]
["UL9_03_FIO1","IO00","UL9_03_FIO1_IO00","UL9_3_BCN1_R"]
["UL9_03_FIO1","IO01","UL9_03_FIO1_IO01"]
["UL9_03_FIO1","IO02","UL9_03_FIO1_IO02","UL9_3_BCN2_R"]
["UL9_03_FIO1","IO03","UL9_03_FIO1_IO03"]
["UL9_03_FIO1","IO04","UL9_03_FIO1_IO04","UL9_3_LPE1"]
["UL9_03_FIO1","IO05","UL9_03_FIO1_IO05"]
["UL9_03_FIO1","IO06","UL9_03_FIO1_IO06","UL9_3_LPE2"]
["UL9_03_FIO1","IO07","UL9_03_FIO1_IO07"]
["UL9_03_FIO1","IO08","UL9_03_FIO1_IO08","UL9_3_S1_PB"]
["UL9_03_FIO1","IO09","UL9_03_FIO1_IO09","UL9_3_S1_PB_LT"]
["UL9_03_FIO1","IO10","UL9_03_FIO1_IO10","UL9_3_S2_PB"]
["UL9_03_FIO1","IO11","UL9_03_FIO1_IO11","UL9_3_S2_PB_LT"]
["UL9_03_FIO1","IO12","UL9_03_FIO1_IO12"]
["UL9_03_FIO1","IO13","UL9_03_FIO1_IO13"]
["UL9_03_FIO1","IO14","UL9_03_FIO1_IO14"]
["UL9_03_FIO1","IO15","UL9_03_FIO1_IO15"]
["UL9_03_VFD1","I0","UL9_03_VFD1_I0","UL9_3_VFD1_DISC"]
["UL9_03_VFD1","I1","UL9_03_VFD1_I1","UL9_3_ENC1"]
["UL9_03_VFD1","I2","UL9_03_VFD1_I2","UL9_3_TPE1"]
["UL9_03_VFD1","I3","UL9_03_VFD1_I3","UL9_3_TPE2"]
["UL9_03_VFD1","IO0","UL9_03_VFD1_IO0"]
["UL9_03_VFD1","IO1","UL9_03_VFD1_IO1"]
["UL9_03_VFD1","SI0","UL9_03_VFD1_SI0","UL9_3_EPC1"]
["UL9_03_VFD1","SI1","UL9_03_VFD1_SI1","UL9_3_EPC1_2"]
["UL9_03_VFD1","SI2","UL9_03_VFD1_SI2","UL9_3_EPC2"]
["UL9_03_VFD1","SI3","UL9_03_VFD1_SI3","UL9_3_EPC2_2"]
["UL9_03_VFD1","SO0","UL9_03_VFD1_SO0"]
["UL9_04_VFD1","I0","UL9_04_VFD1_I0","UL9_4_VFD1_DISC"]
["UL9_04_VFD1","I1","UL9_04_VFD1_I1","UL9_4_ENC1"]
["UL9_04_VFD1","I2","UL9_04_VFD1_I2","UL9_4_TPE1"]
["UL9_04_VFD1","I3","UL9_04_VFD1_I3"]
["UL9_04_VFD1","IO0","UL9_04_VFD1_IO0","UL9_4_BCN1_R"]
["UL9_04_VFD1","IO1","UL9_04_VFD1_IO1","UL9_4_BCN2_R"]
["UL9_04_VFD1","SI0","UL9_04_VFD1_SI0","UL9_4_EPC1"]
["UL9_04_VFD1","SI1","UL9_04_VFD1_SI1","UL9_4_EPC1_2"]
["UL9_04_VFD1","SI2","UL9_04_VFD1_SI2","UL9_4_EPC2"]
["UL9_04_VFD1","SI3","UL9_04_VFD1_SI3","UL9_4_EPC2_2"]
["UL9_04_VFD1","SO0","UL9_04_VFD1_SO0"]
["UL9_05_VFD1","I0","UL9_05_VFD1_I0","UL9_5_VFD1_DISC"]
["UL9_05_VFD1","I1","UL9_05_VFD1_I1","UL9_5_ENC1"]
["UL9_05_VFD1","I2","UL9_05_VFD1_I2"]
["UL9_05_VFD1","I3","UL9_05_VFD1_I3"]
["UL9_05_VFD1","IO0","UL9_05_VFD1_IO0","UL9_4_S1_PB"]
["UL9_05_VFD1","IO1","UL9_05_VFD1_IO1","UL9_4_S1_PB_LT"]
["UL9_05_VFD1","SI0","UL9_05_VFD1_SI0"]
["UL9_05_VFD1","SI1","UL9_05_VFD1_SI1"]
["UL9_05_VFD1","SI2","UL9_05_VFD1_SI2"]
["UL9_05_VFD1","SI3","UL9_05_VFD1_SI3"]
["UL9_05_VFD1","SO0","UL9_05_VFD1_SO0"]
["UL9_06_VFD1","I0","UL9_06_VFD1_I0","UL9_6_VFD1_DISC"]
["UL9_06_VFD1","I1","UL9_06_VFD1_I1","UL9_6_ENC1"]
["UL9_06_VFD1","I2","UL9_06_VFD1_I2","UL9_6_TPE1"]
["UL9_06_VFD1","I3","UL9_06_VFD1_I3","UL9_6_TPE2"]
["UL9_06_VFD1","IO0","UL9_06_VFD1_IO0","UL9_4_S2_PB"]
["UL9_06_VFD1","IO1","UL9_06_VFD1_IO1","UL9_4_S2_PB_LT"]
["UL9_06_VFD1","SI0","UL9_06_VFD1_SI0"]
["UL9_06_VFD1","SI1","UL9_06_VFD1_SI1"]
["UL9_06_VFD1","SI2","UL9_06_VFD1_SI2"]
["UL9_06_VFD1","SI3","UL9_06_VFD1_SI3"]
["UL9_06_VFD1","SO0","UL9_06_VFD1_SO0"]
["UL9_07_VFD1","I0","UL9_07_VFD1_I0","UL9_7_VFD1_DISC"]
["UL9_07_VFD1","I1","UL9_07_VFD1_I1","UL9_7_ENC1"]
["UL9_07_VFD1","I2","UL9_07_VFD1_I2","UL9_7_TPE1"]
["UL9_07_VFD1","I3","UL9_07_VFD1_I3"]
["UL9_07_VFD1","IO0","UL9_07_VFD1_IO0"]
["UL9_07_VFD1","IO1","UL9_07_VFD1_IO1"]
["UL9_07_VFD1","SI0","UL9_07_VFD1_SI0"]
["UL9_07_VFD1","SI1","UL9_07_VFD1_SI1"]
["UL9_07_VFD1","SI2","UL9_07_VFD1_SI2"]
["UL9_07_VFD1","SI3","UL9_07_VFD1_SI3"]
["UL9_07_VFD1","SO0","UL9_07_VFD1_SO0"]
["UL9_08_VFD1","I0","UL9_08_VFD1_I0","UL9_8_VFD1_DISC"]
["UL9_08_VFD1","I1","UL9_08_VFD1_I1","UL9_8_ENC1"]
["UL9_08_VFD1","I2","UL9_08_VFD1_I2","UL9_8_TPE1"]
["UL9_08_VFD1","I3","UL9_08_VFD1_I3"]
["UL9_08_VFD1","IO0","UL9_08_VFD1_IO0"]
["UL9_08_VFD1","IO1","UL9_08_VFD1_IO1"]
["UL9_08_VFD1","SI0","UL9_08_VFD1_SI0"]
["UL9_08_VFD1","SI1","UL9_08_VFD1_SI1"]
["UL9_08_VFD1","SI2","UL9_08_VFD1_SI2"]
["UL9_08_VFD1","SI3","UL9_08_VFD1_SI3"]
["UL9_08_VFD1","SO0","UL9_08_VFD1_SO0"]
["UL9_09_VFD1","I0","UL9_09_VFD1_I0","UL9_9_VFD1_DISC"]
["UL9_09_VFD1","I1","UL9_09_VFD1_I1","UL9_9_ENC1"]
["UL9_09_VFD1","I2","UL9_09_VFD1_I2","UL9_9_TPE1"]
["UL9_09_VFD1","I3","UL9_09_VFD1_I3"]
["UL9_09_VFD1","IO0","UL9_09_VFD1_IO0"]
["UL9_09_VFD1","IO1","UL9_09_VFD1_IO1"]
["UL9_09_VFD1","SI0","UL9_09_VFD1_SI0"]
["UL9_09_VFD1","SI1","UL9_09_VFD1_SI1"]
["UL9_09_VFD1","SI2","UL9_09_VFD1_SI2"]
["UL9_09_VFD1","SI3","UL9_09_VFD1_SI3"]
["UL9_09_VFD1","SO0","UL9_09_VFD1_SO0"]
["UL9_10_VFD1","I0","UL9_10_VFD1_I0","UL9_10_VFD1_DISC"]
["UL9_10_VFD1","I1","UL9_10_VFD1_I1","UL9_10_ENC1"]
["UL9_10_VFD1","I2","UL9_10_VFD1_I2","UL9_10_TPE1"]
["UL9_10_VFD1","I3","UL9_10_VFD1_I3"]
["UL9_10_VFD1","IO0","UL9_10_VFD1_IO0"]
["UL9_10_VFD1","IO1","UL9_10_VFD1_IO1"]
["UL9_10_VFD1","SI0","UL9_10_VFD1_SI0"]
["UL9_10_VFD1","SI1","UL9_10_VFD1_SI1"]
["UL9_10_VFD1","SI2","UL9_10_VFD1_SI2"]
["UL9_10_VFD1","SI3","UL9_10_VFD1_SI3"]
["UL9_10_VFD1","SO0","UL9_10_VFD1_SO0"]
["UL9_11_VFD1","I0","UL9_11_VFD1_I0","UL9_11_VFD1_DISC"]
["UL9_11_VFD1","I1","UL9_11_VFD1_I1"]
["UL9_11_VFD1","I2","UL9_11_VFD1_I2"]
["UL9_11_VFD1","I3","UL9_11_VFD1_I3"]
["UL9_11_VFD1","IO0","UL9_11_VFD1_IO0"]
["UL9_11_VFD1","IO1","UL9_11_VFD1_IO1"]
["UL9_11_VFD1","SI0","UL9_11_VFD1_SI0"]
["UL9_11_VFD1","SI1","UL9_11_VFD1_SI1"]
["UL9_11_VFD1","SI2","UL9_11_VFD1_SI2"]
["UL9_11_VFD1","SI3","UL9_11_VFD1_SI3"]
["UL9_11_VFD1","SO0","UL9_11_VFD1_SO0"]
["UL1_13_FIO1","IO00","UL1_13_FIO1_IO00","UL1_13_SOL1",null,"2025-06-06"]
["UL1_13_FIO1","IO01","UL1_13_FIO1_IO01"]
["UL1_13_FIO1","IO02","UL1_13_FIO1_IO02","UL1_13_SOL2"]
["UL1_13_FIO1","IO03","UL1_13_FIO1_IO03"]
["UL1_13_FIO1","IO04","UL1_13_FIO1_IO04","UL1_13_SOL3"]
["UL1_13_FIO1","O05","UL1_13_FIO1_IO05"]
["UL1_13_FIO1","IO06","UL1_13_FIO1_IO06","UL1_13_PE1","DEBRIS SENSOR"]
["UL1_13_FIO1","O07","UL1_13_FIO1_IO07"]
["UL1_13_FIO1","IO08","UL1_13_FIO1_IO08","UL1_13_PE2","BELT ENGAGEMENT"]
["UL1_13_FIO1","IO09","UL1_13_FIO1_IO09"]
["UL1_13_FIO1","IO10","UL1_13_FIO1_IO10","UL1_13_PE3","ENTRANCE PE"]
["UL1_13_FIO1","IO11","UL1_13_FIO1_IO11"]
["UL1_13_FIO1","IO12","UL1_13_FIO1_IO12","UL1_13_PE4","EXIT PE"]
["UL1_13_FIO1","O13","UL1_13_FIO1_IO13"]
["UL1_13_FIO1","IO14","UL1_13_FIO1_IO14","UL1_13_PE5","DEBRIS SENSOR"]
["UL1_13_FIO1","O15","UL1_13_FIO1_IO15"]
["UL4_13_FIO1","IO00","UL4_13_FIO1_IO00","UL4_13_SOL1"]
["UL4_13_FIO1","IO01","UL4_13_FIO1_IO01"]
["UL4_13_FIO1","IO02","UL4_13_FIO1_IO02","UL4_13_SOL2"]
["UL4_13_FIO1","IO03","UL4_13_FIO1_IO03"]
["UL4_13_FIO1","IO04","UL4_13_FIO1_IO04","UL4_13_SOL3"]
["UL4_13_FIO1","O05","UL4_13_FIO1_IO05"]
["UL4_13_FIO1","IO06","UL4_13_FIO1_IO06","UL4_13_PE1","DEBRIS SENSOR"]
["UL4_13_FIO1","O07","UL4_13_FIO1_IO07"]
["UL4_13_FIO1","IO08","UL4_13_FIO1_IO08","UL4_13_PE2","BELT ENGAGEMENT"]
["UL4_13_FIO1","IO09","UL4_13_FIO1_IO09"]
["UL4_13_FIO1","IO10","UL4_13_FIO1_IO10","UL4_13_PE3","ENTRANCE PE"]
["UL4_13_FIO1","IO11","UL4_13_FIO1_IO11"]
["UL4_13_FIO1","IO12","UL4_13_FIO1_IO12","UL4_13_PE4","EXIT PE"]
["UL4_13_FIO1","O13","UL4_13_FIO1_IO13"]
["UL4_13_FIO1","IO14","UL4_13_FIO1_IO14","UL4_13_PE5","DEBRIS SENSOR"]
["UL4_13_FIO1","O15","UL4_13_FIO1_IO15"]
["UL7_13_FIO1","IO00","UL7_13_FIO1_IO00","UL7_13_SOL1"]
["UL7_13_FIO1","IO01","UL7_13_FIO1_IO01"]
["UL7_13_FIO1","IO02","UL7_13_FIO1_IO02","UL7_13_SOL2"]
["UL7_13_FIO1","IO03","UL7_13_FIO1_IO03"]
["UL7_13_FIO1","IO04","UL7_13_FIO1_IO04","UL7_13_SOL3"]
["UL7_13_FIO1","O05","UL7_13_FIO1_IO05"]
["UL7_13_FIO1","IO06","UL7_13_FIO1_IO06","UL7_13_PE1","DEBRIS SENSOR"]
["UL7_13_FIO1","O07","UL7_13_FIO1_IO07"]
["UL7_13_FIO1","IO08","UL7_13_FIO1_IO08","UL7_13_PE2","BELT ENGAGEMENT"]
["UL7_13_FIO1","IO09","UL7_13_FIO1_IO09"]
["UL7_13_FIO1","IO10","UL7_13_FIO1_IO10","UL7_13_PE3","ENTRANCE PE"]
["UL7_13_FIO1","IO11","UL7_13_FIO1_IO11"]
["UL7_13_FIO1","IO12","UL7_13_FIO1_IO12","UL7_13_PE4","EXIT PE"]
["UL7_13_FIO1","O13","UL7_13_FIO1_IO13"]
["UL7_13_FIO1","IO14","UL7_13_FIO1_IO14","UL7_13_PE5","DEBRIS SENSOR"]
["UL7_13_FIO1","O15","UL7_13_FIO1_IO15"]
["UL11_13_FIO1","IO00","UL11_13_FIO1_IO00","UL11_13_SOL1"]
["UL11_13_FIO1","IO01","UL11_13_FIO1_IO01"]
["UL11_13_FIO1","IO02","UL11_13_FIO1_IO02","UL11_13_SOL2"]
["UL11_13_FIO1","IO03","UL11_13_FIO1_IO03"]
["UL11_13_FIO1","IO04","UL11_13_FIO1_IO04","UL11_13_SOL3"]
["UL11_13_FIO1","O05","UL11_13_FIO1_IO05"]
["UL11_13_FIO1","IO06","UL11_13_FIO1_IO06","UL11_13_PE1","DEBRIS SENSOR"]
["UL11_13_FIO1","O07","UL11_13_FIO1_IO07"]
["UL11_13_FIO1","IO08","UL11_13_FIO1_IO08","UL11_13_PE2","BELT ENGAGEMENT"]
["UL11_13_FIO1","IO09","UL11_13_FIO1_IO09"]
["UL11_13_FIO1","IO10","UL11_13_FIO1_IO10","UL11_13_PE3","ENTRANCE PE"]
["UL11_13_FIO1","IO11","UL11_13_FIO1_IO11"]
["UL11_13_FIO1","IO12","UL11_13_FIO1_IO12","UL11_13_PE4","EXIT PE"]
["UL11_13_FIO1","O13","UL11_13_FIO1_IO13"]
["UL11_13_FIO1","IO14","UL11_13_FIO1_IO14","UL11_13_PE5","DEBRIS SENSOR"]
["UL11_13_FIO1","O15","UL11_13_FIO1_IO15"]
["PDP1_FIO1","IO00",{"$f":"_xlfn.CONCAT(A1967,\"_\",B1967)","v":"PDP1_FIO1_IO00"},"PDP1_CB1","2025-06-06"]
["PDP1_FIO1","IO01",{"$f":"_xlfn.CONCAT(A1968,\"_\",B1968)","v":"PDP1_FIO1_IO01"},"PDP1_CB2"]
["PDP1_FIO1","IO02","PDP1_FIO1_IO02","PDP1_CB3"]
["PDP1_FIO1","IO03","PDP1_FIO1_IO03","PDP1_CB4"]
["PDP1_FIO1","IO04","PDP1_FIO1_IO04","PDP1_CB5"]
["PDP1_FIO1","O05","PDP1_FIO1_O05"]
["PDP1_FIO1","IO06","PDP1_FIO1_IO06","PDP1_CB6"]
["PDP1_FIO1","O07","PDP1_FIO1_O07"]
["PDP1_FIO1","IO08","PDP1_FIO1_IO08","PDP1_CB7"]
["PDP1_FIO1","IO09","PDP1_FIO1_IO09","PDP1_CB8"]
["PDP1_FIO1","IO10","PDP1_FIO1_IO10","PDP1_CB9"]
["PDP1_FIO1","IO11","PDP1_FIO1_IO11","PDP1_CB10"]
["PDP1_FIO1","IO12","PDP1_FIO1_IO12","PDP1_PWM1"]
["PDP1_FIO1","O13","PDP1_FIO1_O13"]
["PDP1_FIO1","IO14","PDP1_FIO1_IO14","PDP1_FIO1H"]
["PDP1_FIO1","O15","PDP1_FIO1_O15"]
["PDP1_FIOH1","IO00","PDP1_FIOH1_IO00","PDP1_CB11"]
["PDP1_FIOH1","IO01","PDP1_FIOH1_IO01","PDP1_CB12"]
["PDP1_FIOH1","IO02","PDP1_FIOH1_IO02","PDP1_CB13"]
["PDP1_FIOH1","IO03","PDP1_FIOH1_IO03","PDP1_CB14"]
["PDP1_FIOH1","IO04","PDP1_FIOH1_IO04","PDP1_CB15"]
["PDP1_FIOH1","IO05","PDP1_FIOH1_IO05","PDP1_CB16"]
["PDP1_FIOH1","IO06","PDP1_FIOH1_IO06","PDP1_CB17"]
["PDP1_FIOH1","IO07","PDP1_FIOH1_IO07","PDP1_CB18"]
["PDP1_FIOH1","IO08","PDP1_FIOH1_IO08","PDP1_CB19"]
["PDP1_FIOH1","IO09","PDP1_FIOH1_IO09","PDP1_CB20"]
["PDP1_FIOH1","IO10","PDP1_FIOH1_IO10","PDP1_CB21"]
["PDP1_FIOH1","IO11","PDP1_FIOH1_IO11","PDP1_CB22"]
["PDP1_FIOH1","IO12","PDP1_FIOH1_IO12","PDP1_CB23"]
["PDP1_FIOH1","IO13","PDP1_FIOH1_IO13","PDP1_CB24"]
["PDP1_FIOH1","IO14","PDP1_FIOH1_IO14","PDP1_CB25"]
["PDP1_FIOH1","IO15","PDP1_FIOH1_IO15","PDP1_CB26"]
["PDP2_FIO1","IO00",{"$f":"_xlfn.CONCAT(A1999,\"_\",B1999)","v":"PDP2_FIO1_IO00"},"PDP2_CB1"]
["PDP2_FIO1","IO01",{"$f":"_xlfn.CONCAT(A2000,\"_\",B2000)","v":"PDP2_FIO1_IO01"},"PDP2_CB2"]
["PDP2_FIO1","IO02","PDP2_FIO1_IO02","PDP2_CB3"]
["PDP2_FIO1","IO03","PDP2_FIO1_IO03","PDP2_CB4"]
["PDP2_FIO1","IO04","PDP2_FIO1_IO04","PDP2_CB5"]
["PDP2_FIO1","O05","PDP2_FIO1_O05"]
["PDP2_FIO1","IO06","PDP2_FIO1_IO06","PDP2_CB6"]
["PDP2_FIO1","O07","PDP2_FIO1_O07"]
["PDP2_FIO1","IO08","PDP2_FIO1_IO08","PDP2_CB7"]
["PDP2_FIO1","IO09","PDP2_FIO1_IO09","PDP2_CB8"]
["PDP2_FIO1","IO10","PDP2_FIO1_IO10","PDP2_CB9"]
["PDP2_FIO1","IO11","PDP2_FIO1_IO11","PDP2_CB10"]
["PDP2_FIO1","IO12","PDP2_FIO1_IO12","PDP2_PWM1"]
["PDP2_FIO1","O13","PDP2_FIO1_O13"]
["PDP2_FIO1","IO14","PDP2_FIO1_IO14","PDP2_FIO1H"]
["PDP2_FIO1","O15","PDP2_FIO1_O15"]
["PDP2_FIOH1","IO00","PDP2_FIOH1_IO00","PDP2_CB11"]
["PDP2_FIOH1","IO01","PDP2_FIOH1_IO01","PDP2_CB12"]
["PDP2_FIOH1","IO02","PDP2_FIOH1_IO02","PDP2_CB13"]
["PDP2_FIOH1","IO03","PDP2_FIOH1_IO03","PDP2_CB14"]
["PDP2_FIOH1","IO04","PDP2_FIOH1_IO04","PDP2_CB15"]
["PDP2_FIOH1","IO05","PDP2_FIOH1_IO05","PDP2_CB16"]
["PDP2_FIOH1","IO06","PDP2_FIOH1_IO06","PDP2_CB17"]
["PDP2_FIOH1","IO07","PDP2_FIOH1_IO07","PDP2_CB18"]
["PDP2_FIOH1","IO08","PDP2_FIOH1_IO08","PDP2_CB19"]
["PDP2_FIOH1","IO09","PDP2_FIOH1_IO09","PDP2_CB20"]
["PDP2_FIOH1","IO10","PDP2_FIOH1_IO10","PDP2_CB21"]
["PDP2_FIOH1","IO11","PDP2_FIOH1_IO11","PDP2_CB22"]
["PDP2_FIOH1","IO12","PDP2_FIOH1_IO12","PDP2_CB23"]
["PDP2_FIOH1","IO13","PDP2_FIOH1_IO13","PDP2_CB24"]
["PDP2_FIOH1","IO14","PDP2_FIOH1_IO14","PDP2_CB25"]
["PDP2_FIOH1","IO15","PDP2_FIOH1_IO15","PDP2_CB26"]
["PDP6_FIO1","IO00",{"$f":"_xlfn.CONCAT(A2031,\"_\",B2031)","v":"PDP6_FIO1_IO00"},"PDP6_CB1"]
["PDP6_FIO1","IO01",{"$f":"_xlfn.CONCAT(A2032,\"_\",B2032)","v":"PDP6_FIO1_IO01"},"PDP6_CB2"]
["PDP6_FIO1","IO02","PDP6_FIO1_IO02","PDP6_CB3"]
["PDP6_FIO1","IO03","PDP6_FIO1_IO03","PDP6_CB4"]
["PDP6_FIO1","IO04","PDP6_FIO1_IO04","PDP6_CB5"]
["PDP6_FIO1","O05","PDP6_FIO1_O05"]
["PDP6_FIO1","IO06","PDP6_FIO1_IO06","PDP6_CB6"]
["PDP6_FIO1","O07","PDP6_FIO1_O07"]
["PDP6_FIO1","IO08","PDP6_FIO1_IO08","PDP6_CB7"]
["PDP6_FIO1","IO09","PDP6_FIO1_IO09","PDP6_CB8"]
["PDP6_FIO1","IO10","PDP6_FIO1_IO10","PDP6_CB9"]
["PDP6_FIO1","IO11","PDP6_FIO1_IO11","PDP6_CB10"]
["PDP6_FIO1","IO12","PDP6_FIO1_IO12","PDP6_PWM1"]
["PDP6_FIO1","O13","PDP6_FIO1_O13"]
["PDP6_FIO1","IO14","PDP6_FIO1_IO14","PDP6_FIO1H"]
["PDP6_FIO1","O15","PDP6_FIO1_O15"]
["PDP6_FIOH1","IO00","PDP6_FIOH1_IO00","PDP6_CB11"]
["PDP6_FIOH1","IO01","PDP6_FIOH1_IO01","PDP6_CB12"]
["PDP6_FIOH1","IO02","PDP6_FIOH1_IO02","PDP6_CB13"]
["PDP6_FIOH1","IO03","PDP6_FIOH1_IO03","PDP6_CB14"]
["PDP6_FIOH1","IO04","PDP6_FIOH1_IO04","PDP6_CB15"]
["PDP6_FIOH1","IO05","PDP6_FIOH1_IO05","PDP6_CB16"]
["PDP6_FIOH1","IO06","PDP6_FIOH1_IO06","PDP6_CB17"]
["PDP6_FIOH1","IO07","PDP6_FIOH1_IO07","PDP6_CB18"]
["PDP6_FIOH1","IO08","PDP6_FIOH1_IO08","PDP6_CB19"]
["PDP6_FIOH1","IO09","PDP6_FIOH1_IO09","PDP6_CB20"]
["PDP6_FIOH1","IO10","PDP6_FIOH1_IO10","PDP6_CB21"]
["PDP6_FIOH1","IO11","PDP6_FIOH1_IO11","PDP6_CB22"]
["PDP6_FIOH1","IO12","PDP6_FIOH1_IO12","PDP6_CB23"]
["PDP6_FIOH1","IO13","PDP6_FIOH1_IO13","PDP6_CB24"]
["PDP6_FIOH1","IO14","PDP6_FIOH1_IO14","PDP6_CB25"]
["PDP6_FIOH1","IO15","PDP6_FIOH1_IO15","PDP6_CB26"]

{"sheet":"NETWORK1","index":4,"n_rows":188,"n_cols":19,"rows_kept":188,"cut":false,"hidden":false,"merged":[[87,11,90,11],[149,3,161,3],[149,4,161,4],[92,3,112,3],[92,4,112,4],[174,3,187,3],[174,4,187,4],[162,3,173,3],[162,4,173,4],[113,3,133,3],[113,4,133,4],[134,3,148,3],[134,4,148,4],[53,3,72,3],[53,4,72,4],[38,3,52,3],[38,4,52,4],[73,3,91,3],[73,4,91,4],[1,5,1,11],[1,3,1,4],[18,3,37,3],[18,4,37,4],[3,3,17,3],[3,4,17,4]]}
[null,"MCM01"]
["SLOT0","1756-L83ES","IP","RING",null,"STAR"]
["SLOT1","1756-N2",null,"DPM","IP","VFD NAME","VFD PART NUMBER","IP","PDP","DPM","HP","VFD PART NUMBER",null,null,null,{"$f":"_xlfn.CONCAT(Q3,\"_VFD1\")","v":"PS1_1_VFD1"},"PS1_1",2,{"$f":"VLOOKUP(R3,'Part number'!$C$1:$D$13,2,FALSE)","v":"35S-6D2-P101"}]
["SLOT2","1756-EN4TR","11.200.1.1","UL1_4_DPM1","11.200.1.2","UL1_1_EX1",{"$f":"VLOOKUP(F4,$P$3:$S$176,4,FALSE)","v":"CALJAN"},"11.200.1.30","PDP01","DPM1_UL1_4_P1",{"$f":"VLOOKUP(G4,'Part number'!$B$2:$C$13,2,0)","v":"EXTENDO"},null,null,"MCM01","PDP1",{"$f":"_xlfn.CONCAT(Q4,\"_VFD1\")","v":"PS1_2_VFD1"},"PS1_2",2,{"$f":"VLOOKUP(R4,'Part number'!$C$1:$D$13,2,FALSE)","v":"35S-6D2-P101"}]
["SLOT3","1756-N2",null,null,null,"UL1_3_VFD1","35S-6D4-P111","11.200.1.31","PDP01","DPM1_UL1_4_P2",{"$f":"VLOOKUP(G5,'Part number'!$B$2:$C$13,2,0)","v":5},null,null,null,"PDP2",{"$f":"_xlfn.CONCAT(Q5,\"_VFD1\")","v":"PS1_3_VFD1"},"PS1_3",2,{"$f":"VLOOKUP(R5,'Part number'!$C$1:$D$13,2,FALSE)","v":"35S-6D2-P101"}]
["SLOT4","1756-N2",null,null,null,"UL1_4_VFD1","35S-6D4-P111","11.200.1.32","PDP01","DPM1_UL1_4_P3",{"$f":"VLOOKUP(G6,'Part number'!$B$2:$C$13,2,0)","v":5},null,null,null,"PDP6",{"$f":"_xlfn.CONCAT(Q6,\"_VFD1\")","v":"PS1_4_VFD1"},"PS1_4",7.5,{"$f":"VLOOKUP(R6,'Part number'!$C$1:$D$13,2,FALSE)","v":"35S-6D5-P111"}]
["SLOT5","1756-IB16",null,null,null,"UL1_5_VFD1","35S-6D3-P101","11.200.1.33","PDP01","DPM1_UL1_4_P4",{"$f":"VLOOKUP(G7,'Part number'!$B$2:$C$13,2,0)","v":3},null,null,null,null,"PS1_4_DPM1","PS1_4_DPM1","DPM",{"$f":"VLOOKUP(R7,'Part number'!$C$1:$D$13,2,FALSE)","v":{"$error":"#N/A"}}]
["SLOT6","1756-OB16E",null,null,null,"UL1_6_VFD1","35S-6D3-P101","11.200.1.34","PDP01","DPM1_UL1_4_P5",{"$f":"VLOOKUP(G8,'Part number'!$B$2:$C$13,2,0)","v":3},null,null,null,null,{"$f":"_xlfn.CONCAT(Q8,\"_VFD1\")","v":"PS1_5_VFD1"},"PS1_5",5,{"$f":"VLOOKUP(R8,'Part number'!$C$1:$D$13,2,FALSE)","v":"35S-6D4-P111"}]
["SLOT7","1756-IB16S",null,null,null,"UL1_7_VFD1","35S-6D3-P101","11.200.1.35","PDP01","DPM1_UL1_4_P6",{"$f":"VLOOKUP(G9,'Part number'!$B$2:$C$13,2,0)","v":3},null,null,null,null,"PS2_1_VFD1","PS2_1",2,{"$f":"VLOOKUP(R9,'Part number'!$C$1:$D$13,2,FALSE)","v":"35S-6D2-P101"}]
["SLOT8","1756-N2",null,null,null,"UL1_8_VFD1","35S-6D3-P101","11.200.1.36","PDP01","DPM1_UL1_4_P7",{"$f":"VLOOKUP(G10,'Part number'!$B$2:$C$13,2,0)","v":3},null,null,null,null,"PS2_2_VFD1","PS2_2",3,{"$f":"VLOOKUP(R10,'Part number'!$C$1:$D$13,2,FALSE)","v":"35S-6D3-P101"}]
["SLOT9","1756-N2",null,null,null,"UL1_9_VFD1","35S-6D4-P111","11.200.1.37","PDP01","DPM1_UL1_4_P8",{"$f":"VLOOKUP(G11,'Part number'!$B$2:$C$13,2,0)","v":5},null,null,null,null,"PS2_3_VFD1","PS2_3",5,{"$f":"VLOOKUP(R11,'Part number'!$C$1:$D$13,2,FALSE)","v":"35S-6D4-P111"}]
[null,null,null,null,null,"UL1_10A_VFD1","35S-6D3-P101","11.200.1.38","PDP01","DPM1_UL1_4_P9",{"$f":"VLOOKUP(G12,'Part number'!$B$2:$C$13,2,0)","v":3},null,null,null,null,"PS2_4_VFD1","PS2_4",2,{"$f":"VLOOKUP(R12,'Part number'!$C$1:$D$13,2,FALSE)","v":"35S-6D2-P101"}]
[null,null,null,null,null,"UL1_10B_VFD1","35S-6D3-P101","11.200.1.39","PDP01","DPM1_UL1_4_P10",{"$f":"VLOOKUP(G13,'Part number'!$B$2:$C$13,2,0)","v":3},null,null,null,null,"PS2_5_VFD1","PS2_5",7.5,{"$f":"VLOOKUP(R13,'Part number'!$C$1:$D$13,2,FALSE)","v":"35S-6D5-P111"}]
["DPM COUNT",11,null,null,null,"UL1_11_VFD1","35S-6D2-P101","11.200.1.40","PDP01","DPM1_UL1_4_P11",{"$f":"VLOOKUP(G14,'Part number'!$B$2:$C$13,2,0)","v":2},null,null,null,null,"PS2_6_VFD1","PS2_6",3,{"$f":"VLOOKUP(R14,'Part number'!$C$1:$D$13,2,FALSE)","v":"35S-6D3-P101"}]
[null,null,null,null,null,"UL1_12_VFD1","35S-6D2-P101","11.200.1.41","PDP01","DPM1_UL1_4_P12",{"$f":"VLOOKUP(G15,'Part number'!$B$2:$C$13,2,0)","v":2},null,null,null,null,"PS3_1_VFD1","PS3_1",2,{"$f":"VLOOKUP(R15,'Part number'!$C$1:$D$13,2,FALSE)","v":"35S-6D2-P101"}]
[null,null,null,null,null,"UL1_13_VFD1","35S-6D4-P111","11.200.1.42","PDP01","DPM1_UL1_4_P13",{"$f":"VLOOKUP(G16,'Part number'!$B$2:$C$13,2,0)","v":5},null,null,null,null,"PS3_10_VFD1","PS3_10",5,{"$f":"VLOOKUP(R16,'Part number'!$C$1:$D$13,2,FALSE)","v":"35S-6D4-P111"}]
[null,null,null,null,null,"UL1_3_FIO1","5032-8IOLM12DR","11.200.1.43","PDP01","DPM1_UL1_4_P14",{"$f":"VLOOKUP(G17,'Part number'!$B$2:$C$13,2,0)","v":"FIO"},null,null,null,null,"PS3_11_VFD1","PS3_11",3,{"$f":"VLOOKUP(R17,'Part number'!$C$1:$D$13,2,FALSE)","v":"35S-6D3-P101"}]
[null,null,null,null,null,"UL1_13_FIO1","5032-8IOLM12DR","11.200.1.216",null,null,null,null,"ADDED 5/26",null,null,"PS3_12_VFD1","PS3_12",3,{"$f":"VLOOKUP(R18,'Part number'!$C$1:$D$13,2,FALSE)","v":"35S-6D3-P101"}]
[null,null,null,"UL2_4_DPM1","11.200.1.3","UL2_1_EX1",{"$f":"VLOOKUP(F19,$P$3:$S$176,4,FALSE)","v":"CALJAN"},"11.200.1.44","PDP01","DPM2_UL2_4_P1",{"$f":"VLOOKUP(G19,'Part number'!$B$2:$C$13,2,0)","v":"EXTENDO"},null,null,null,null,"PS3_2_VFD1","PS3_2",3,{"$f":"VLOOKUP(R19,'Part number'!$C$1:$D$13,2,FALSE)","v":"35S-6D3-P101"}]
[null,null,null,null,null,"UL2_3_VFD1","35S-6D4-P111","11.200.1.45","PDP01","DPM2_UL2_4_P2",{"$f":"VLOOKUP(G20,'Part number'!$B$2:$C$13,2,0)","v":5},null,null,null,null,"PS3_3_VFD1","PS3_3",3,{"$f":"VLOOKUP(R20,'Part number'!$C$1:$D$13,2,FALSE)","v":"35S-6D3-P101"}]
[null,null,null,null,null,"UL2_4_VFD1","35S-6D4-P111","11.200.1.46","PDP01","DPM2_UL2_4_P3",{"$f":"VLOOKUP(G21,'Part number'!$B$2:$C$13,2,0)","v":5},null,null,null,null,"PS3_4_VFD1","PS3_4",2,{"$f":"VLOOKUP(R21,'Part number'!$C$1:$D$13,2,FALSE)","v":"35S-6D2-P101"}]
[null,null,null,null,null,"UL2_5_VFD1","35S-6D2-P101","11.200.1.47","PDP01","DPM2_UL2_4_P4",{"$f":"VLOOKUP(G22,'Part number'!$B$2:$C$13,2,0)","v":2},null,null,null,null,"PS3_5_VFD1","PS3_5",5,{"$f":"VLOOKUP(R22,'Part number'!$C$1:$D$13,2,FALSE)","v":"35S-6D4-P111"}]
[null,null,null,null,null,"UL2_6_VFD1","35S-6D3-P101","11.200.1.48","PDP01","DPM2_UL2_4_P5",{"$f":"VLOOKUP(G23,'Part number'!$B$2:$C$13,2,0)","v":3},null,null,null,null,"PS3_6_VFD1","PS3_6",5,{"$f":"VLOOKUP(R23,'Part number'!$C$1:$D$13,2,FALSE)","v":"35S-6D4-P111"}]
[null,null,null,null,null,"UL2_7_VFD1","35S-6D3-P101","11.200.1.49","PDP01","DPM2_UL2_4_P6",{"$f":"VLOOKUP(G24,'Part number'!$B$2:$C$13,2,0)","v":3},null,null,null,null,"PS3_6_DPM1","PS3_6_DPM1","DPM",{"$f":"VLOOKUP(R24,'Part number'!$C$1:$D$13,2,FALSE)","v":{"$error":"#N/A"}}]
[null,null,null,null,null,"UL2_8_VFD1","35S-6D3-P101","11.200.1.50","PDP01","DPM2_UL2_4_P7",{"$f":"VLOOKUP(G25,'Part number'!$B$2:$C$13,2,0)","v":3},null,null,null,null,{"$f":"_xlfn.CONCAT(Q25,\"_VFD1\")","v":"PS3_7_VFD1"},"PS3_7",10,{"$f":"VLOOKUP(R25,'Part number'!$C$1:$D$13,2,FALSE)","v":"35S-6D6-P111"}]
[null,null,null,null,null,"UL2_9_VFD1","35S-6D3-P101","11.200.1.51","PDP01","DPM2_UL2_4_P8",{"$f":"VLOOKUP(G26,'Part number'!$B$2:$C$13,2,0)","v":3},null,null,null,null,"PS3_8_VFD1","PS3_8",3,{"$f":"VLOOKUP(R26,'Part number'!$C$1:$D$13,2,FALSE)","v":"35S-6D3-P101"}]
[null,null,null,null,null,"UL2_10_VFD1","35S-6D2-P101","11.200.1.52","PDP01","DPM2_UL2_4_P9",{"$f":"VLOOKUP(G27,'Part number'!$B$2:$C$13,2,0)","v":2},null,null,null,null,"PS3_9_VFD1","PS3_9",5,{"$f":"VLOOKUP(R27,'Part number'!$C$1:$D$13,2,FALSE)","v":"35S-6D4-P111"}]
[null,null,null,null,null,"UL3_1_VFD1","35S-6D2-P101","11.200.1.53","PDP01","DPM2_UL2_4_P10",{"$f":"VLOOKUP(G28,'Part number'!$B$2:$C$13,2,0)","v":2},null,null,null,null,"PS4_1_VFD1","PS4_1",2,{"$f":"VLOOKUP(R28,'Part number'!$C$1:$D$13,2,FALSE)","v":"35S-6D2-P101"}]
[null,null,null,null,null,"UL3_2_VFD1","35S-6D5-P111","11.200.1.54","PDP01","DPM2_UL2_4_P11",{"$f":"VLOOKUP(G29,'Part number'!$B$2:$C$13,2,0)","v":7.5},null,null,null,null,"PS4_10_VFD1","PS4_10",10,{"$f":"VLOOKUP(R29,'Part number'!$C$1:$D$13,2,FALSE)","v":"35S-6D6-P111"}]
[null,null,null,null,null,"UL3_3_VFD1","35S-6D2-P101","11.200.1.55","PDP01","DPM2_UL2_4_P12",{"$f":"VLOOKUP(G30,'Part number'!$B$2:$C$13,2,0)","v":2},null,null,null,null,"PS4_11_VFD1","PS4_11",5,{"$f":"VLOOKUP(R30,'Part number'!$C$1:$D$13,2,FALSE)","v":"35S-6D4-P111"}]
[null,null,null,null,null,"UL3_4_VFD1","35S-6D2-P101","11.200.1.56","PDP01","DPM2_UL2_4_P13",{"$f":"VLOOKUP(G31,'Part number'!$B$2:$C$13,2,0)","v":2},null,null,null,null,"PS4_12_VFD1","PS4_12",3,{"$f":"VLOOKUP(R31,'Part number'!$C$1:$D$13,2,FALSE)","v":"35S-6D3-P101"}]
[null,null,null,null,null,"UL3_5_VFD1","35S-6D3-P101","11.200.1.57","PDP01","DPM2_UL2_4_P14",{"$f":"VLOOKUP(G32,'Part number'!$B$2:$C$13,2,0)","v":3},null,null,null,null,"PS4_13_VFD1","PS4_13",3,{"$f":"VLOOKUP(R32,'Part number'!$C$1:$D$13,2,FALSE)","v":"35S-6D3-P101"}]
[null,null,null,null,null,"UL3_6_VFD1","35S-6D3-P101","11.200.1.58","PDP01","DPM2_UL2_4_P15",{"$f":"VLOOKUP(G33,'Part number'!$B$2:$C$13,2,0)","v":3},null,null,null,null,"PS4_14_VFD1","PS4_14",3,{"$f":"VLOOKUP(R33,'Part number'!$C$1:$D$13,2,FALSE)","v":"35S-6D3-P101"}]
[null,null,null,null,null,"UL3_7_VFD1","35S-6D3-P101","11.200.1.59","PDP01","DPM2_UL2_4_P16",{"$f":"VLOOKUP(G34,'Part number'!$B$2:$C$13,2,0)","v":3},null,null,null,null,"PS4_2_VFD1","PS4_2",3,{"$f":"VLOOKUP(R34,'Part number'!$C$1:$D$13,2,FALSE)","v":"35S-6D3-P101"}]
[null,null,null,null,null,"UL3_8_VFD1","35S-6D3-P101","11.200.1.60","PDP01","DPM2_UL2_4_P17",{"$f":"VLOOKUP(G35,'Part number'!$B$2:$C$13,2,0)","v":3},null,null,null,null,"PS4_3_VFD1","PS4_3",2,{"$f":"VLOOKUP(R35,'Part number'!$C$1:$D$13,2,FALSE)","v":"35S-6D2-P101"}]
[null,null,null,null,null,"UL3_9_VFD1","35S-6D2-P101","11.200.1.61","PDP01","DPM2_UL2_4_P18",{"$f":"VLOOKUP(G36,'Part number'!$B$2:$C$13,2,0)","v":2},null,null,null,null,"PS4_4_VFD1","PS4_4",3,{"$f":"VLOOKUP(R36,'Part number'!$C$1:$D$13,2,FALSE)","v":"35S-6D3-P101"}]
[null,null,null,null,null,"UL2_3_FIO1","5032-8IOLM12DR","11.200.1.62","PDP01","DPM2_UL2_4_P19",{"$f":"VLOOKUP(G37,'Part number'!$B$2:$C$13,2,0)","v":"FIO"},null,null,null,null,"PS4_5_VFD1","PS4_5",5,{"$f":"VLOOKUP(R37,'Part number'!$C$1:$D$13,2,FALSE)","v":"35S-6D4-P111"}]
[null,null,null,null,null,"UL3_2_FIO1","5032-8IOLM12DR","11.200.1.63","PDP01","DPM2_UL2_4_P20",{"$f":"VLOOKUP(G38,'Part number'!$B$2:$C$13,2,0)","v":"FIO"},null,null,null,null,"PS4_6_VFD1","PS4_6",7.5,{"$f":"VLOOKUP(R38,'Part number'!$C$1:$D$13,2,FALSE)","v":"35S-6D5-P111"}]
[null,null,null,"UL4_4_DPM1","11.200.1.4","UL4_1_EX1",{"$f":"VLOOKUP(F39,$P$3:$S$176,4,FALSE)","v":"CALJAN"},"11.200.1.64","PDP01","DPM3_UL4_4_P1",{"$f":"VLOOKUP(G39,'Part number'!$B$2:$C$13,2,0)","v":"EXTENDO"},null,null,null,null,"PS4_7_VFD1","PS4_7",7.5,{"$f":"VLOOKUP(R39,'Part number'!$C$1:$D$13,2,FALSE)","v":"35S-6D5-P111"}]
[null,null,null,null,null,"UL4_3_VFD1","35S-6D4-P111","11.200.1.65","PDP01","DPM3_UL4_4_P2",{"$f":"VLOOKUP(G40,'Part number'!$B$2:$C$13,2,0)","v":5},null,null,null,null,"PS4_7_DPM1","PS4_7_DPM1","DPM",{"$f":"VLOOKUP(R40,'Part number'!$C$1:$D$13,2,FALSE)","v":{"$error":"#N/A"}}]
[null,null,null,null,null,"UL4_4_VFD1","35S-6D4-P111","11.200.1.66","PDP01","DPM3_UL4_4_P3",{"$f":"VLOOKUP(G41,'Part number'!$B$2:$C$13,2,0)","v":5},null,null,null,null,{"$f":"_xlfn.CONCAT(Q41,\"_VFD1\")","v":"PS4_8_VFD1"},"PS4_8",5,{"$f":"VLOOKUP(R41,'Part number'!$C$1:$D$13,2,FALSE)","v":"35S-6D4-P111"}]
[null,null,null,null,null,"UL4_5_VFD1","35S-6D3-P101","11.200.1.67","PDP01","DPM3_UL4_4_P4",{"$f":"VLOOKUP(G42,'Part number'!$B$2:$C$13,2,0)","v":3},null,null,null,null,"PS4_9_VFD1","PS4_9",3,{"$f":"VLOOKUP(R42,'Part number'!$C$1:$D$13,2,FALSE)","v":"35S-6D3-P101"}]
[null,null,null,null,null,"UL4_6_VFD1","35S-6D3-P101","11.200.1.68","PDP01","DPM3_UL4_4_P5",{"$f":"VLOOKUP(G43,'Part number'!$B$2:$C$13,2,0)","v":3},null,null,null,null,"UL10_1_VFD1","UL10_1",2,{"$f":"VLOOKUP(R43,'Part number'!$C$1:$D$13,2,FALSE)","v":"35S-6D2-P101"}]
[null,null,null,null,null,"UL4_7_VFD1","35S-6D3-P101","11.200.1.69","PDP01","DPM3_UL4_4_P6",{"$f":"VLOOKUP(G44,'Part number'!$B$2:$C$13,2,0)","v":3},null,null,null,null,"UL10_10_VFD1","UL10_10",2,{"$f":"VLOOKUP(R44,'Part number'!$C$1:$D$13,2,FALSE)","v":"35S-6D2-P101"}]
[null,null,null,null,null,"UL4_8_VFD1","35S-6D3-P101","11.200.1.70","PDP01","DPM3_UL4_4_P7",{"$f":"VLOOKUP(G45,'Part number'!$B$2:$C$13,2,0)","v":3},null,null,null,null,"UL10_2_VFD1","UL10_2",7.5,{"$f":"VLOOKUP(R45,'Part number'!$C$1:$D$13,2,FALSE)","v":"35S-6D5-P111"}]
[null,null,null,null,null,"UL4_9_VFD1","35S-6D4-P111","11.200.1.71","PDP01","DPM3_UL4_4_P8",{"$f":"VLOOKUP(G46,'Part number'!$B$2:$C$13,2,0)","v":5},null,null,null,null,"UL10_3_VFD1","UL10_3",2,{"$f":"VLOOKUP(R46,'Part number'!$C$1:$D$13,2,FALSE)","v":"35S-6D2-P101"}]
[null,null,null,null,null,"UL4_10A_VFD1","35S-6D3-P101","11.200.1.72","PDP01","DPM3_UL4_4_P9",{"$f":"VLOOKUP(G47,'Part number'!$B$2:$C$13,2,0)","v":3},null,null,null,null,"UL10_3_DPM1","UL10_3_DPM1","DPM",{"$f":"VLOOKUP(R47,'Part number'!$C$1:$D$13,2,FALSE)","v":{"$error":"#N/A"}}]
[null,null,null,null,null,"UL4_10B_VFD1","35S-6D3-P101","11.200.1.73","PDP01","DPM3_UL4_4_P10",{"$f":"VLOOKUP(G48,'Part number'!$B$2:$C$13,2,0)","v":3},null,null,null,null,{"$f":"_xlfn.CONCAT(Q48,\"_VFD1\")","v":"UL10_4_VFD1"},"UL10_4",3,{"$f":"VLOOKUP(R48,'Part number'!$C$1:$D$13,2,FALSE)","v":"35S-6D3-P101"}]
[null,null,null,null,null,"UL4_11_VFD1","35S-6D2-P101","11.200.1.74","PDP01","DPM3_UL4_4_P11",{"$f":"VLOOKUP(G49,'Part number'!$B$2:$C$13,2,0)","v":2},null,null,null,null,"UL10_5_VFD1","UL10_5",3,{"$f":"VLOOKUP(R49,'Part number'!$C$1:$D$13,2,FALSE)","v":"35S-6D3-P101"}]
[null,null,null,null,null,"UL4_12_VFD1","35S-6D2-P101","11.200.1.75","PDP01","DPM3_UL4_4_P12",{"$f":"VLOOKUP(G50,'Part number'!$B$2:$C$13,2,0)","v":2},null,null,null,null,"UL10_6_VFD1","UL10_6",3,{"$f":"VLOOKUP(R50,'Part number'!$C$1:$D$13,2,FALSE)","v":"35S-6D3-P101"}]
[null,null,null,null,null,"UL4_13_VFD1","35S-6D4-P111","11.200.1.76","PDP01","DPM3_UL4_4_P13",{"$f":"VLOOKUP(G51,'Part number'!$B$2:$C$13,2,0)","v":5},null,null,null,null,"UL10_7_VFD1","UL10_7",3,{"$f":"VLOOKUP(R51,'Part number'!$C$1:$D$13,2,FALSE)","v":"35S-6D3-P101"}]
[null,null,null,null,null,"UL4_3_FIO1","5032-8IOLM12DR","11.200.1.77","PDP01","DPM3_UL4_4_P14",{"$f":"VLOOKUP(G52,'Part number'!$B$2:$C$13,2,0)","v":"FIO"},null,null,null,null,"UL10_8_VFD1","UL10_8",3,{"$f":"VLOOKUP(R52,'Part number'!$C$1:$D$13,2,FALSE)","v":"35S-6D3-P101"}]
[null,null,null,null,null,"UL4_13_FIO1","5032-8IOLM12DR","11.200.1.217",null,null,null,"ADDED 5/26",null,null,null,"UL10_9_VFD1","UL10_9",3,{"$f":"VLOOKUP(R53,'Part number'!$C$1:$D$13,2,FALSE)","v":"35S-6D3-P101"}]
[null,null,null,"UL5_4_DPM1","11.200.1.5","UL5_1_EX1",{"$f":"VLOOKUP(F54,$P$3:$S$176,4,FALSE)","v":"CALJAN"},"11.200.1.78","PDP01","DPM4_UL5_4_P1",{"$f":"VLOOKUP(G54,'Part number'!$B$2:$C$13,2,0)","v":"EXTENDO"},null,null,null,null,{"$f":"_xlfn.CONCAT(Q54,\"_EX1\")","v":"UL1_1_EX1"},"UL1_1","EXTENDO",{"$f":"VLOOKUP(R54,'Part number'!$C$1:$D$13,2,FALSE)","v":"CALJAN"}]
[null,null,null,null,null,"UL5_3_VFD1","35S-6D4-P111","11.200.1.79","PDP01","DPM4_UL5_4_P2",{"$f":"VLOOKUP(G55,'Part number'!$B$2:$C$13,2,0)","v":5},null,null,null,null,{"$f":"_xlfn.CONCAT(Q55,\"_VFD1\")","v":"UL1_10A_VFD1"},"UL1_10A",3,{"$f":"VLOOKUP(R55,'Part number'!$C$1:$D$13,2,FALSE)","v":"35S-6D3-P101"}]
[null,null,null,null,null,"UL5_4_VFD1","35S-6D4-P111","11.200.1.80","PDP01","DPM4_UL5_4_P3",{"$f":"VLOOKUP(G56,'Part number'!$B$2:$C$13,2,0)","v":5},null,null,null,null,{"$f":"_xlfn.CONCAT(Q56,\"_VFD1\")","v":"UL1_10B_VFD1"},"UL1_10B",3,{"$f":"VLOOKUP(R56,'Part number'!$C$1:$D$13,2,FALSE)","v":"35S-6D3-P101"}]
[null,null,null,null,null,"UL5_5_VFD1","35S-6D2-P101","11.200.1.81","PDP01","DPM4_UL5_4_P4",{"$f":"VLOOKUP(G57,'Part number'!$B$2:$C$13,2,0)","v":2},null,null,null,null,{"$f":"_xlfn.CONCAT(Q57,\"_EX1\")","v":"UL11_1_EX1"},"UL11_1","EXTENDO",{"$f":"VLOOKUP(R57,'Part number'!$C$1:$D$13,2,FALSE)","v":"CALJAN"}]
[null,null,null,null,null,"UL5_6_VFD1","35S-6D3-P101","11.200.1.82","PDP01","DPM4_UL5_4_P5",{"$f":"VLOOKUP(G58,'Part number'!$B$2:$C$13,2,0)","v":3},null,null,null,null,{"$f":"_xlfn.CONCAT(Q58,\"_VFD1\")","v":"UL1_11_VFD1"},"UL1_11",2,{"$f":"VLOOKUP(R58,'Part number'!$C$1:$D$13,2,FALSE)","v":"35S-6D2-P101"}]
[null,null,null,null,null,"UL5_7_VFD1","35S-6D3-P101","11.200.1.83","PDP01","DPM4_UL5_4_P6",{"$f":"VLOOKUP(G59,'Part number'!$B$2:$C$13,2,0)","v":3},null,null,null,null,"UL11_10A_VFD1","UL11_10A",3,{"$f":"VLOOKUP(R59,'Part number'!$C$1:$D$13,2,FALSE)","v":"35S-6D3-P101"}]
[null,null,null,null,null,"UL5_8_VFD1","35S-6D3-P101","11.200.1.84","PDP01","DPM4_UL5_4_P7",{"$f":"VLOOKUP(G60,'Part number'!$B$2:$C$13,2,0)","v":3},null,null,null,null,"UL11_10B_VFD1","UL11_10B",3,{"$f":"VLOOKUP(R60,'Part number'!$C$1:$D$13,2,FALSE)","v":"35S-6D3-P101"}]
[null,null,null,null,null,"UL5_9_VFD1","35S-6D3-P101","11.200.1.85","PDP01","DPM4_UL5_4_P8",{"$f":"VLOOKUP(G61,'Part number'!$B$2:$C$13,2,0)","v":3},null,null,null,null,"UL11_11_VFD1","UL11_11",2,{"$f":"VLOOKUP(R61,'Part number'!$C$1:$D$13,2,FALSE)","v":"35S-6D2-P101"}]
[null,null,null,null,null,"UL5_10_VFD1","35S-6D2-P101","11.200.1.86","PDP01","DPM4_UL5_4_P9",{"$f":"VLOOKUP(G62,'Part number'!$B$2:$C$13,2,0)","v":2},null,null,null,null,"UL11_12_VFD1","UL11_12",2,{"$f":"VLOOKUP(R62,'Part number'!$C$1:$D$13,2,FALSE)","v":"35S-6D2-P101"}]
[null,null,null,null,null,"UL6_1_VFD1","35S-6D2-P101","11.200.1.87","PDP01","DPM4_UL5_4_P10",{"$f":"VLOOKUP(G63,'Part number'!$B$2:$C$13,2,0)","v":2},null,null,null,null,"UL11_13_VFD1","UL11_13",5,{"$f":"VLOOKUP(R63,'Part number'!$C$1:$D$13,2,FALSE)","v":"35S-6D4-P111"}]
[null,null,null,null,null,"UL6_2_VFD1","35S-6D5-P111","11.200.1.88","PDP01","DPM4_UL5_4_P11",{"$f":"VLOOKUP(G64,'Part number'!$B$2:$C$13,2,0)","v":7.5},null,null,null,null,"UL1_12_VFD1","UL1_12",2,{"$f":"VLOOKUP(R64,'Part number'!$C$1:$D$13,2,FALSE)","v":"35S-6D2-P101"}]
[null,null,null,null,null,"UL6_3_VFD1","35S-6D2-P101","11.200.1.89","PDP01","DPM4_UL5_4_P12",{"$f":"VLOOKUP(G65,'Part number'!$B$2:$C$13,2,0)","v":2},null,null,null,null,"UL11_3_VFD1","UL11_3",5,{"$f":"VLOOKUP(R65,'Part number'!$C$1:$D$13,2,FALSE)","v":"35S-6D4-P111"}]
[null,null,null,null,null,"UL6_4_VFD1","35S-6D2-P101","11.200.1.90","PDP01","DPM4_UL5_4_P13",{"$f":"VLOOKUP(G66,'Part number'!$B$2:$C$13,2,0)","v":2},null,null,null,null,"UL1_13_VFD1","UL1_13",5,{"$f":"VLOOKUP(R66,'Part number'!$C$1:$D$13,2,FALSE)","v":"35S-6D4-P111"}]
[null,null,null,null,null,"UL6_5_VFD1","35S-6D3-P101","11.200.1.91","PDP01","DPM4_UL5_4_P14",{"$f":"VLOOKUP(G67,'Part number'!$B$2:$C$13,2,0)","v":3},null,null,null,null,"UL11_4_VFD1","UL11_4",5,{"$f":"VLOOKUP(R67,'Part number'!$C$1:$D$13,2,FALSE)","v":"35S-6D4-P111"}]
[null,null,null,null,null,"UL6_6_VFD1","35S-6D3-P101","11.200.1.92","PDP01","DPM4_UL5_4_P15",{"$f":"VLOOKUP(G68,'Part number'!$B$2:$C$13,2,0)","v":3},null,null,null,null,"UL11_4_DPM1","UL11_4_DPM1","DPM",{"$f":"VLOOKUP(R68,'Part number'!$C$1:$D$13,2,FALSE)","v":{"$error":"#N/A"}}]
[null,null,null,null,null,"UL6_7_VFD1","35S-6D3-P101","11.200.1.93","PDP01","DPM4_UL5_4_P16",{"$f":"VLOOKUP(G69,'Part number'!$B$2:$C$13,2,0)","v":3},null,null,null,null,{"$f":"_xlfn.CONCAT(Q69,\"_VFD1\")","v":"UL11_5_VFD1"},"UL11_5",3,{"$f":"VLOOKUP(R69,'Part number'!$C$1:$D$13,2,FALSE)","v":"35S-6D3-P101"}]
[null,null,null,null,null,"UL6_8_VFD1","35S-6D3-P101","11.200.1.94","PDP01","DPM4_UL5_4_P17",{"$f":"VLOOKUP(G70,'Part number'!$B$2:$C$13,2,0)","v":3},null,null,null,null,{"$f":"_xlfn.CONCAT(Q70,\"_VFD1\")","v":"UL11_6_VFD1"},"UL11_6",3,{"$f":"VLOOKUP(R70,'Part number'!$C$1:$D$13,2,FALSE)","v":"35S-6D3-P101"}]
[null,null,null,null,null,"UL6_9_VFD1","35S-6D2-P101","11.200.1.95","PDP01","DPM4_UL5_4_P18",{"$f":"VLOOKUP(G71,'Part number'!$B$2:$C$13,2,0)","v":2},null,null,null,null,{"$f":"_xlfn.CONCAT(Q71,\"_VFD1\")","v":"UL11_7_VFD1"},"UL11_7",3,{"$f":"VLOOKUP(R71,'Part number'!$C$1:$D$13,2,FALSE)","v":"35S-6D3-P101"}]
[null,null,null,null,null,"UL5_3_FIO1","5032-8IOLM12DR","11.200.1.96","PDP01","DPM4_UL5_4_P19",{"$f":"VLOOKUP(G72,'Part number'!$B$2:$C$13,2,0)","v":"FIO"},null,null,null,null,{"$f":"_xlfn.CONCAT(Q72,\"_VFD1\")","v":"UL11_8_VFD1"},"UL11_8",3,{"$f":"VLOOKUP(R72,'Part number'!$C$1:$D$13,2,FALSE)","v":"35S-6D3-P101"}]
[null,null,null,null,null,"UL6_2_FIO1","5032-8IOLM12DR","11.200.1.97","PDP01","DPM4_UL5_4_P20",{"$f":"VLOOKUP(G73,'Part number'!$B$2:$C$13,2,0)","v":"FIO"},null,null,null,null,{"$f":"_xlfn.CONCAT(Q73,\"_VFD1\")","v":"UL11_9_VFD1"},"UL11_9",5,{"$f":"VLOOKUP(R73,'Part number'!$C$1:$D$13,2,FALSE)","v":"35S-6D4-P111"}]
[null,null,null,"UL7_4_DPM1","11.200.1.6","UL7_1_EX1",{"$f":"VLOOKUP(F74,$P$3:$S$176,4,FALSE)","v":"CALJAN"},"11.200.1.98","PDP02","DPM5_UL7_4_P1",{"$f":"VLOOKUP(G74,'Part number'!$B$2:$C$13,2,0)","v":"EXTENDO"},null,null,null,null,{"$f":"_xlfn.CONCAT(Q74,\"_EX1\")","v":"UL12_1_EX1"},"UL12_1","EXTENDO",{"$f":"VLOOKUP(R74,'Part number'!$C$1:$D$13,2,FALSE)","v":"CALJAN"}]
[null,null,null,null,null,"UL7_3_VFD1","35S-6D4-P111","11.200.1.99","PDP02","DPM5_UL7_4_P2",{"$f":"VLOOKUP(G75,'Part number'!$B$2:$C$13,2,0)","v":5},null,null,null,null,{"$f":"_xlfn.CONCAT(Q75,\"_VFD1\")","v":"UL12_10_VFD1"},"UL12_10",2,{"$f":"VLOOKUP(R75,'Part number'!$C$1:$D$13,2,FALSE)","v":"35S-6D2-P101"}]
[null,null,null,null,null,"UL7_4_VFD1","35S-6D4-P111","11.200.1.100","PDP02","DPM5_UL7_4_P3",{"$f":"VLOOKUP(G76,'Part number'!$B$2:$C$13,2,0)","v":5},null,null,null,null,"UL12_3_VFD1","UL12_3",5,{"$f":"VLOOKUP(R76,'Part number'!$C$1:$D$13,2,FALSE)","v":"35S-6D4-P111"}]
[null,null,null,null,null,"UL7_5_VFD1","35S-6D3-P101","11.200.1.101","PDP02","DPM5_UL7_4_P4",{"$f":"VLOOKUP(G77,'Part number'!$B$2:$C$13,2,0)","v":3},null,null,null,null,"UL12_4_VFD1","UL12_4",5,{"$f":"VLOOKUP(R77,'Part number'!$C$1:$D$13,2,FALSE)","v":"35S-6D4-P111"}]
[null,null,null,null,null,"UL7_6_VFD1","35S-6D3-P101","11.200.1.102","PDP02","DPM5_UL7_4_P5",{"$f":"VLOOKUP(G78,'Part number'!$B$2:$C$13,2,0)","v":3},null,null,null,null,"UL12_5_VFD1","UL12_5",2,{"$f":"VLOOKUP(R78,'Part number'!$C$1:$D$13,2,FALSE)","v":"35S-6D2-P101"}]
[null,null,null,null,null,"UL7_7_VFD1","35S-6D3-P101","11.200.1.103","PDP02","DPM5_UL7_4_P6",{"$f":"VLOOKUP(G79,'Part number'!$B$2:$C$13,2,0)","v":3},null,null,null,null,"UL12_6_VFD1","UL12_6",3,{"$f":"VLOOKUP(R79,'Part number'!$C$1:$D$13,2,FALSE)","v":"35S-6D3-P101"}]
[null,null,null,null,null,"UL7_8_VFD1","35S-6D3-P101","11.200.1.104","PDP02","DPM5_UL7_4_P7",{"$f":"VLOOKUP(G80,'Part number'!$B$2:$C$13,2,0)","v":3},null,null,null,null,"UL12_7_VFD1","UL12_7",3,{"$f":"VLOOKUP(R80,'Part number'!$C$1:$D$13,2,FALSE)","v":"35S-6D3-P101"}]
[null,null,null,null,null,"UL7_9_VFD1","35S-6D4-P111","11.200.1.105","PDP02","DPM5_UL7_4_P8",{"$f":"VLOOKUP(G81,'Part number'!$B$2:$C$13,2,0)","v":5},null,null,null,null,"UL12_8_VFD1","UL12_8",3,{"$f":"VLOOKUP(R81,'Part number'!$C$1:$D$13,2,FALSE)","v":"35S-6D3-P101"}]
[null,null,null,null,null,"UL7_10A_VFD1","35S-6D3-P101","11.200.1.106","PDP02","DPM5_UL7_4_P9",{"$f":"VLOOKUP(G82,'Part number'!$B$2:$C$13,2,0)","v":3},null,null,null,null,"UL12_9_VFD1","UL12_9",3,{"$f":"VLOOKUP(R82,'Part number'!$C$1:$D$13,2,FALSE)","v":"35S-6D3-P101"}]
[null,null,null,null,null,"UL7_10B_VFD1","35S-6D3-P101","11.200.1.107","PDP02","DPM5_UL7_4_P10",{"$f":"VLOOKUP(G83,'Part number'!$B$2:$C$13,2,0)","v":3},null,null,null,null,"UL1_3_VFD1","UL1_3",5,{"$f":"VLOOKUP(R83,'Part number'!$C$1:$D$13,2,FALSE)","v":"35S-6D4-P111"}]
[null,null,null,null,null,"UL7_11_VFD1","35S-6D2-P101","11.200.1.108","PDP02","DPM5_UL7_4_P11",{"$f":"VLOOKUP(G84,'Part number'!$B$2:$C$13,2,0)","v":2},null,null,null,null,"UL1_4_VFD1","UL1_4",5,{"$f":"VLOOKUP(R84,'Part number'!$C$1:$D$13,2,FALSE)","v":"35S-6D4-P111"}]
[null,null,null,null,null,"UL7_12_VFD1","35S-6D2-P101","11.200.1.109","PDP02","DPM5_UL7_4_P12",{"$f":"VLOOKUP(G85,'Part number'!$B$2:$C$13,2,0)","v":2},null,null,null,null,"UL1_4_DPM1_VFD1","UL1_4_DPM1","DPM",{"$f":"VLOOKUP(R85,'Part number'!$C$1:$D$13,2,FALSE)","v":{"$error":"#N/A"}}]
[null,null,null,null,null,"UL7_13_VFD1","35S-6D4-P111","11.200.1.110","PDP02","DPM5_UL7_4_P13",{"$f":"VLOOKUP(G86,'Part number'!$B$2:$C$13,2,0)","v":5},null,null,null,null,"UL1_5_VFD1","UL1_5",3,{"$f":"VLOOKUP(R86,'Part number'!$C$1:$D$13,2,FALSE)","v":"35S-6D3-P101"}]
[null,null,null,null,null,"UL7_3_FIO1","5032-8IOLM12DR","11.200.1.111","PDP02","DPM5_UL7_4_P14",{"$f":"VLOOKUP(G87,'Part number'!$B$2:$C$13,2,0)","v":"FIO"},null,null,null,null,"UL1_6_VFD1","UL1_6",3,{"$f":"VLOOKUP(R87,'Part number'!$C$1:$D$13,2,FALSE)","v":"35S-6D3-P101"}]
[null,null,null,null,null,"PDP1_FIO1","5032-8IOLM12DR","11.200.1.210",null,null,null,"PDP1&2 PMM","UPDATED",null,null,"UL1_7_VFD1","UL1_7",3,{"$f":"VLOOKUP(R88,'Part number'!$C$1:$D$13,2,FALSE)","v":"35S-6D3-P101"}]
[null,null,null,null,null,"PDP1_PMM1","1420-V2-ENT","11.200.1.211",null,null,null,null,null,null,null,"UL1_8_VFD1","UL1_8",3,{"$f":"VLOOKUP(R89,'Part number'!$C$1:$D$13,2,FALSE)","v":"35S-6D3-P101"}]
[null,null,null,null,null,"PDP2_FIO1","5032-8IOLM12DR","11.200.1.212",null,null,null,null,null,null,null,"UL1_9_VFD1","UL1_9",5,{"$f":"VLOOKUP(R90,'Part number'!$C$1:$D$13,2,FALSE)","v":"35S-6D4-P111"}]
[null,null,null,null,null,"PDP2_PMM1","1420-V2-ENT","11.200.1.213",null,null,null,null,null,null,null,{"$f":"_xlfn.CONCAT(Q91,\"_EX1\")","v":"UL2_1_EX1"},"UL2_1","EXTENDO",{"$f":"VLOOKUP(R91,'Part number'!$C$1:$D$13,2,FALSE)","v":"CALJAN"}]
[null,null,null,null,null,"UL7_13_FIO1","5032-8IOLM12DR","11.200.1.218",null,null,null,"ADDED 5/26",null,null,null,{"$f":"_xlfn.CONCAT(Q92,\"_VFD1\")","v":"UL2_10_VFD1"},"UL2_10",2,{"$f":"VLOOKUP(R92,'Part number'!$C$1:$D$13,2,FALSE)","v":"35S-6D2-P101"}]
[null,null,null,"UL8_3_DPM1","11.200.1.7","UL8_1_VFD1",{"$f":"VLOOKUP(F93,$P$3:$S$176,4,FALSE)","v":"35S-6D2-P101"},"11.200.1.112","PDP02","DPM6_UL8_3_P1",{"$f":"VLOOKUP(G93,'Part number'!$B$2:$C$13,2,0)","v":2},null,null,null,null,{"$f":"_xlfn.CONCAT(Q93,\"_VFD1\")","v":"UL2_3_VFD1"},"UL2_3",5,{"$f":"VLOOKUP(R93,'Part number'!$C$1:$D$13,2,FALSE)","v":"35S-6D4-P111"}]
[null,null,null,null,null,"UL8_2_VFD1","35S-6D5-P111","11.200.1.113","PDP02","DPM6_UL8_3_P2",{"$f":"VLOOKUP(G94,'Part number'!$B$2:$C$13,2,0)","v":7.5},null,null,null,null,{"$f":"_xlfn.CONCAT(Q94,\"_VFD1\")","v":"UL2_4_VFD1"},"UL2_4",5,{"$f":"VLOOKUP(R94,'Part number'!$C$1:$D$13,2,FALSE)","v":"35S-6D4-P111"}]
[null,null,null,null,null,"UL8_3_VFD1","35S-6D2-P101","11.200.1.114","PDP02","DPM6_UL8_3_P3",{"$f":"VLOOKUP(G95,'Part number'!$B$2:$C$13,2,0)","v":2},null,null,null,null,"UL2_4_DPM1","UL2_4_DPM1","DPM",{"$f":"VLOOKUP(R95,'Part number'!$C$1:$D$13,2,FALSE)","v":{"$error":"#N/A"}}]
[null,null,null,null,null,"UL8_4_VFD1","35S-6D2-P101","11.200.1.115","PDP02","DPM6_UL8_3_P4",{"$f":"VLOOKUP(G96,'Part number'!$B$2:$C$13,2,0)","v":2},null,null,null,null,{"$f":"_xlfn.CONCAT(Q96,\"_VFD1\")","v":"UL2_5_VFD1"},"UL2_5",2,{"$f":"VLOOKUP(R96,'Part number'!$C$1:$D$13,2,FALSE)","v":"35S-6D2-P101"}]
[null,null,null,null,null,"UL8_5_VFD1","35S-6D3-P101","11.200.1.116","PDP02","DPM6_UL8_3_P5",{"$f":"VLOOKUP(G97,'Part number'!$B$2:$C$13,2,0)","v":3},null,null,null,null,"UL2_6_VFD1","UL2_6",3,{"$f":"VLOOKUP(R97,'Part number'!$C$1:$D$13,2,FALSE)","v":"35S-6D3-P101"}]
[null,null,null,null,null,"UL8_6_VFD1","35S-6D3-P101","11.200.1.117","PDP02","DPM6_UL8_3_P6",{"$f":"VLOOKUP(G98,'Part number'!$B$2:$C$13,2,0)","v":3},null,null,null,null,"UL2_7_VFD1","UL2_7",3,{"$f":"VLOOKUP(R98,'Part number'!$C$1:$D$13,2,FALSE)","v":"35S-6D3-P101"}]
[null,null,null,null,null,"UL8_7_VFD1","35S-6D3-P101","11.200.1.118","PDP02","DPM6_UL8_3_P7",{"$f":"VLOOKUP(G99,'Part number'!$B$2:$C$13,2,0)","v":3},null,null,null,null,"UL2_8_VFD1","UL2_8",3,{"$f":"VLOOKUP(R99,'Part number'!$C$1:$D$13,2,FALSE)","v":"35S-6D3-P101"}]
[null,null,null,null,null,"UL8_8_VFD1","35S-6D3-P101","11.200.1.119","PDP02","DPM6_UL8_3_P8",{"$f":"VLOOKUP(G100,'Part number'!$B$2:$C$13,2,0)","v":3},null,null,null,null,"UL2_9_VFD1","UL2_9",3,{"$f":"VLOOKUP(R100,'Part number'!$C$1:$D$13,2,FALSE)","v":"35S-6D3-P101"}]
[null,null,null,null,null,"UL8_9_VFD1","35S-6D2-P101","11.200.1.120","PDP02","DPM6_UL8_3_P9",{"$f":"VLOOKUP(G101,'Part number'!$B$2:$C$13,2,0)","v":2},null,null,null,null,"UL3_1_VFD1","UL3_1",2,{"$f":"VLOOKUP(R101,'Part number'!$C$1:$D$13,2,FALSE)","v":"35S-6D2-P101"}]
[null,null,null,null,null,"UL9_1_EX1","CALJAN","11.200.1.121","PDP02","DPM6_UL8_3_P10",{"$f":"VLOOKUP(G102,'Part number'!$B$2:$C$13,2,0)","v":"EXTENDO"},null,null,null,null,"UL3_2_VFD1","UL3_2",7.5,{"$f":"VLOOKUP(R102,'Part number'!$C$1:$D$13,2,FALSE)","v":"35S-6D5-P111"}]
[null,null,null,null,null,"UL9_3_VFD1","35S-6D4-P111","11.200.1.122","PDP02","DPM6_UL8_3_P11",{"$f":"VLOOKUP(G103,'Part number'!$B$2:$C$13,2,0)","v":5},null,null,null,null,"UL3_3_VFD1","UL3_3",2,{"$f":"VLOOKUP(R103,'Part number'!$C$1:$D$13,2,FALSE)","v":"35S-6D2-P101"}]
[null,null,null,null,null,"UL9_4_VFD1","35S-6D4-P111","11.200.1.123","PDP02","DPM6_UL8_3_P12",{"$f":"VLOOKUP(G104,'Part number'!$B$2:$C$13,2,0)","v":5},null,null,null,null,"UL3_4_VFD1","UL3_4",2,{"$f":"VLOOKUP(R104,'Part number'!$C$1:$D$13,2,FALSE)","v":"35S-6D2-P101"}]
[null,null,null,null,null,"UL9_5_VFD1","35S-6D2-P101","11.200.1.124","PDP02","DPM6_UL8_3_P13",{"$f":"VLOOKUP(G105,'Part number'!$B$2:$C$13,2,0)","v":2},null,null,null,null,"UL3_5_VFD1","UL3_5",3,{"$f":"VLOOKUP(R105,'Part number'!$C$1:$D$13,2,FALSE)","v":"35S-6D3-P101"}]
[null,null,null,null,null,"UL9_6_VFD1","35S-6D3-P101","11.200.1.125","PDP02","DPM6_UL8_3_P14",{"$f":"VLOOKUP(G106,'Part number'!$B$2:$C$13,2,0)","v":3},null,null,null,null,"UL3_6_VFD1","UL3_6",3,{"$f":"VLOOKUP(R106,'Part number'!$C$1:$D$13,2,FALSE)","v":"35S-6D3-P101"}]
[null,null,null,null,null,"UL9_7_VFD1","35S-6D3-P101","11.200.1.126","PDP02","DPM6_UL8_3_P15",{"$f":"VLOOKUP(G107,'Part number'!$B$2:$C$13,2,0)","v":3},null,null,null,null,"UL3_7_VFD1","UL3_7",3,{"$f":"VLOOKUP(R107,'Part number'!$C$1:$D$13,2,FALSE)","v":"35S-6D3-P101"}]
[null,null,null,null,null,"UL9_8_VFD1","35S-6D3-P101","11.200.1.127","PDP02","DPM6_UL8_3_P16",{"$f":"VLOOKUP(G108,'Part number'!$B$2:$C$13,2,0)","v":3},null,null,null,null,"UL3_8_VFD1","UL3_8",3,{"$f":"VLOOKUP(R108,'Part number'!$C$1:$D$13,2,FALSE)","v":"35S-6D3-P101"}]
[null,null,null,null,null,"UL9_9_VFD1","35S-6D3-P101","11.200.1.128","PDP02","DPM6_UL8_3_P17",{"$f":"VLOOKUP(G109,'Part number'!$B$2:$C$13,2,0)","v":3},null,null,null,null,"UL3_9_VFD1","UL3_9",2,{"$f":"VLOOKUP(R109,'Part number'!$C$1:$D$13,2,FALSE)","v":"35S-6D2-P101"}]
[null,null,null,null,null,"UL9_10_VFD1","35S-6D3-P101","11.200.1.129","PDP02","DPM6_UL8_3_P18",{"$f":"VLOOKUP(G110,'Part number'!$B$2:$C$13,2,0)","v":3},null,null,null,null,{"$f":"_xlfn.CONCAT(Q110,\"_EX1\")","v":"UL4_1_EX1"},"UL4_1","EXTENDO",{"$f":"VLOOKUP(R110,'Part number'!$C$1:$D$13,2,FALSE)","v":"CALJAN"}]
[null,null,null,null,null,"UL9_11_VFD1","35S-6D2-P101","11.200.1.130","PDP02","DPM6_UL8_3_P19",{"$f":"VLOOKUP(G111,'Part number'!$B$2:$C$13,2,0)","v":2},null,null,null,null,{"$f":"_xlfn.CONCAT(Q111,\"_VFD1\")","v":"UL4_10A_VFD1"},"UL4_10A",3,{"$f":"VLOOKUP(R111,'Part number'!$C$1:$D$13,2,FALSE)","v":"35S-6D3-P101"}]
[null,null,null,null,null,"UL8_2_FIO1","5032-8IOLM12DR","11.200.1.131","PDP02","DPM6_UL8_3_P20",{"$f":"VLOOKUP(G112,'Part number'!$B$2:$C$13,2,0)","v":"FIO"},null,null,null,null,"UL4_10B_VFD1","UL4_10B",3,{"$f":"VLOOKUP(R112,'Part number'!$C$1:$D$13,2,FALSE)","v":"35S-6D3-P101"}]
[null,null,null,null,null,"UL9_3_FIO1","5032-8IOLM12DR","11.200.1.132","PDP02","DPM6_UL8_3_P21",{"$f":"VLOOKUP(G113,'Part number'!$B$2:$C$13,2,0)","v":"FIO"},null,null,null,null,"UL4_11_VFD1","UL4_11",2,{"$f":"VLOOKUP(R113,'Part number'!$C$1:$D$13,2,FALSE)","v":"35S-6D2-P101"}]
[null,null,null,"UL10_3_DPM1","11.200.1.8","UL10_1_VFD1",{"$f":"VLOOKUP(F114,$P$3:$S$176,4,FALSE)","v":"35S-6D2-P101"},"11.200.1.133","PDP02","DPM7_UL10_3_P1",{"$f":"VLOOKUP(G114,'Part number'!$B$2:$C$13,2,0)","v":2},null,null,null,null,"UL4_12_VFD1","UL4_12",2,{"$f":"VLOOKUP(R114,'Part number'!$C$1:$D$13,2,FALSE)","v":"35S-6D2-P101"}]
[null,null,null,null,null,"UL10_2_VFD1","35S-6D5-P111","11.200.1.134","PDP02","DPM7_UL10_3_P2",{"$f":"VLOOKUP(G115,'Part number'!$B$2:$C$13,2,0)","v":7.5},null,null,null,null,"UL4_13_VFD1","UL4_13",5,{"$f":"VLOOKUP(R115,'Part number'!$C$1:$D$13,2,FALSE)","v":"35S-6D4-P111"}]
[null,null,null,null,null,"UL10_3_VFD1","35S-6D2-P101","11.200.1.135","PDP02","DPM7_UL10_3_P3",{"$f":"VLOOKUP(G116,'Part number'!$B$2:$C$13,2,0)","v":2},null,null,null,null,"UL4_3_VFD1","UL4_3",5,{"$f":"VLOOKUP(R116,'Part number'!$C$1:$D$13,2,FALSE)","v":"35S-6D4-P111"}]
[null,null,null,null,null,"UL10_4_VFD1","35S-6D3-P101","11.200.1.136","PDP02","DPM7_UL10_3_P4",{"$f":"VLOOKUP(G117,'Part number'!$B$2:$C$13,2,0)","v":3},null,null,null,null,"UL4_4_VFD1","UL4_4",5,{"$f":"VLOOKUP(R117,'Part number'!$C$1:$D$13,2,FALSE)","v":"35S-6D4-P111"}]
[null,null,null,null,null,"UL10_5_VFD1","35S-6D3-P101","11.200.1.137","PDP02","DPM7_UL10_3_P5",{"$f":"VLOOKUP(G118,'Part number'!$B$2:$C$13,2,0)","v":3},null,null,null,null,"UL4_4_DPM1","UL4_4_DPM1","DPM",{"$f":"VLOOKUP(R118,'Part number'!$C$1:$D$13,2,FALSE)","v":{"$error":"#N/A"}}]
[null,null,null,null,null,"UL10_6_VFD1","35S-6D3-P101","11.200.1.138","PDP02","DPM7_UL10_3_P6",{"$f":"VLOOKUP(G119,'Part number'!$B$2:$C$13,2,0)","v":3},null,null,null,null,{"$f":"_xlfn.CONCAT(Q119,\"_VFD1\")","v":"UL4_5_VFD1"},"UL4_5",3,{"$f":"VLOOKUP(R119,'Part number'!$C$1:$D$13,2,FALSE)","v":"35S-6D3-P101"}]
[null,null,null,null,null,"UL10_7_VFD1","35S-6D3-P101","11.200.1.139","PDP02","DPM7_UL10_3_P7",{"$f":"VLOOKUP(G120,'Part number'!$B$2:$C$13,2,0)","v":3},null,null,null,null,{"$f":"_xlfn.CONCAT(Q120,\"_VFD1\")","v":"UL4_6_VFD1"},"UL4_6",3,{"$f":"VLOOKUP(R120,'Part number'!$C$1:$D$13,2,FALSE)","v":"35S-6D3-P101"}]
[null,null,null,null,null,"UL10_8_VFD1","35S-6D3-P101","11.200.1.140","PDP02","DPM7_UL10_3_P8",{"$f":"VLOOKUP(G121,'Part number'!$B$2:$C$13,2,0)","v":3},null,null,null,null,{"$f":"_xlfn.CONCAT(Q121,\"_VFD1\")","v":"UL4_7_VFD1"},"UL4_7",3,{"$f":"VLOOKUP(R121,'Part number'!$C$1:$D$13,2,FALSE)","v":"35S-6D3-P101"}]
[null,null,null,null,null,"UL10_9_VFD1","35S-6D3-P101","11.200.1.141","PDP02","DPM7_UL10_3_P9",{"$f":"VLOOKUP(G122,'Part number'!$B$2:$C$13,2,0)","v":3},null,null,null,null,{"$f":"_xlfn.CONCAT(Q122,\"_VFD1\")","v":"UL4_8_VFD1"},"UL4_8",3,{"$f":"VLOOKUP(R122,'Part number'!$C$1:$D$13,2,FALSE)","v":"35S-6D3-P101"}]
[null,null,null,null,null,"UL10_10_VFD1","35S-6D2-P101","11.200.1.142","PDP02","DPM7_UL10_3_P10",{"$f":"VLOOKUP(G123,'Part number'!$B$2:$C$13,2,0)","v":2},null,null,null,null,{"$f":"_xlfn.CONCAT(Q123,\"_VFD1\")","v":"UL4_9_VFD1"},"UL4_9",5,{"$f":"VLOOKUP(R123,'Part number'!$C$1:$D$13,2,FALSE)","v":"35S-6D4-P111"}]
[null,null,null,null,null,"UL10_2_FIO1","5032-8IOLM12DR","11.200.1.143","PDP02","DPM7_UL10_3_P11",{"$f":"VLOOKUP(G124,'Part number'!$B$2:$C$13,2,0)","v":"FIO"},null,null,null,null,{"$f":"_xlfn.CONCAT(Q124,\"_EX1\")","v":"UL5_1_EX1"},"UL5_1","EXTENDO",{"$f":"VLOOKUP(R124,'Part number'!$C$1:$D$13,2,FALSE)","v":"CALJAN"}]
[null,null,null,null,null,"UL12_1_EX1",{"$f":"VLOOKUP(F125,$P$3:$S$176,4,FALSE)","v":"CALJAN"},"11.200.1.159","PDP02","DPM7_UL10_3_P1",{"$f":"VLOOKUP(G125,'Part number'!$B$2:$C$13,2,0)","v":"EXTENDO"},null,null,null,null,{"$f":"_xlfn.CONCAT(Q125,\"_VFD1\")","v":"UL5_10_VFD1"},"UL5_10",2,{"$f":"VLOOKUP(R125,'Part number'!$C$1:$D$13,2,FALSE)","v":"35S-6D2-P101"}]
[null,null,null,null,null,"UL12_3_VFD1","35S-6D4-P111","11.200.1.160","PDP02","DPM7_UL10_3_P2",{"$f":"VLOOKUP(G126,'Part number'!$B$2:$C$13,2,0)","v":5},"verified",null,null,null,{"$f":"_xlfn.CONCAT(Q126,\"_VFD1\")","v":"UL5_3_VFD1"},"UL5_3",5,{"$f":"VLOOKUP(R126,'Part number'!$C$1:$D$13,2,FALSE)","v":"35S-6D4-P111"}]
[null,null,null,null,null,"UL12_4_VFD1","35S-6D4-P111","11.200.1.161","PDP02","DPM7_UL10_3_P3",{"$f":"VLOOKUP(G127,'Part number'!$B$2:$C$13,2,0)","v":5},"verified",null,null,null,{"$f":"_xlfn.CONCAT(Q127,\"_VFD1\")","v":"UL5_4_VFD1"},"UL5_4",5,{"$f":"VLOOKUP(R127,'Part number'!$C$1:$D$13,2,FALSE)","v":"35S-6D4-P111"}]
[null,null,null,null,null,"UL12_5_VFD1","35S-6D2-P101","11.200.1.162","PDP02","DPM7_UL10_3_P4",{"$f":"VLOOKUP(G128,'Part number'!$B$2:$C$13,2,0)","v":2},"verified",null,null,null,"UL5_4_DPM1","UL5_4_DPM1","DPM",{"$f":"VLOOKUP(R128,'Part number'!$C$1:$D$13,2,FALSE)","v":{"$error":"#N/A"}}]
[null,null,null,null,null,"UL12_6_VFD1","35S-6D3-P101","11.200.1.163","PDP02","DPM7_UL10_3_P5",{"$f":"VLOOKUP(G129,'Part number'!$B$2:$C$13,2,0)","v":3},"verified",null,null,null,{"$f":"_xlfn.CONCAT(Q129,\"_VFD1\")","v":"UL5_5_VFD1"},"UL5_5",2,{"$f":"VLOOKUP(R129,'Part number'!$C$1:$D$13,2,FALSE)","v":"35S-6D2-P101"}]
[null,null,null,null,null,"UL12_7_VFD1","35S-6D3-P101","11.200.1.164","PDP02","DPM7_UL10_3_P6",{"$f":"VLOOKUP(G130,'Part number'!$B$2:$C$13,2,0)","v":3},"verified",null,null,null,"UL5_6_VFD1","UL5_6",3,{"$f":"VLOOKUP(R130,'Part number'!$C$1:$D$13,2,FALSE)","v":"35S-6D3-P101"}]
[null,null,null,null,null,"UL12_8_VFD1","35S-6D3-P101","11.200.1.165","PDP02","DPM7_UL10_3_P7",{"$f":"VLOOKUP(G131,'Part number'!$B$2:$C$13,2,0)","v":3},"verified",null,null,null,"UL5_7_VFD1","UL5_7",3,{"$f":"VLOOKUP(R131,'Part number'!$C$1:$D$13,2,FALSE)","v":"35S-6D3-P101"}]
[null,null,null,null,null,"UL12_9_VFD1","35S-6D3-P101","11.200.1.166","PDP02","DPM7_UL10_3_P8",{"$f":"VLOOKUP(G132,'Part number'!$B$2:$C$13,2,0)","v":3},"verified",null,null,null,"UL5_8_VFD1","UL5_8",3,{"$f":"VLOOKUP(R132,'Part number'!$C$1:$D$13,2,FALSE)","v":"35S-6D3-P101"}]
[null,null,null,null,null,"UL12_10_VFD1","35S-6D2-P101","11.200.1.167","PDP02","DPM7_UL10_3_P9",{"$f":"VLOOKUP(G133,'Part number'!$B$2:$C$13,2,0)","v":2},"verified",null,null,null,"UL5_9_VFD1","UL5_9",3,{"$f":"VLOOKUP(R133,'Part number'!$C$1:$D$13,2,FALSE)","v":"35S-6D3-P101"}]
[null,null,null,null,null,"UL12_3_FIO1","5032-8IOLM12DR","11.200.1.168","PDP02","DPM7_UL10_3_P10",{"$f":"VLOOKUP(G134,'Part number'!$B$2:$C$13,2,0)","v":"FIO"},"verified",null,null,null,"UL6_1_VFD1","UL6_1",2,{"$f":"VLOOKUP(R134,'Part number'!$C$1:$D$13,2,FALSE)","v":"35S-6D2-P101"}]
[null,null,null,"UL11_10_DPM1","11.200.1.9","UL11_1_EX1",{"$f":"VLOOKUP(F135,$P$3:$S$176,4,FALSE)","v":"CALJAN"},"11.200.1.144","PDP02","DPM8_UL11_4_P1",{"$f":"VLOOKUP(G135,'Part number'!$B$2:$C$13,2,0)","v":"EXTENDO"},null,null,"UL11-1",null,"UL6_2_VFD1","UL6_2",7.5,{"$f":"VLOOKUP(R135,'Part number'!$C$1:$D$13,2,FALSE)","v":"35S-6D5-P111"}]
[null,null,null,null,null,"UL11_3_VFD1","35S-6D4-P111","11.200.1.145","PDP02","DPM8_UL11_4_P2",{"$f":"VLOOKUP(G136,'Part number'!$B$2:$C$13,2,0)","v":5},null,null,"UL11-2",null,"UL6_3_VFD1","UL6_3",2,{"$f":"VLOOKUP(R136,'Part number'!$C$1:$D$13,2,FALSE)","v":"35S-6D2-P101"}]
[null,null,null,null,null,"UL11_4_VFD1","35S-6D4-P111","11.200.1.146","PDP02","DPM8_UL11_4_P3",{"$f":"VLOOKUP(G137,'Part number'!$B$2:$C$13,2,0)","v":5},null,null,"UL11-3",null,"UL6_4_VFD1","UL6_4",2,{"$f":"VLOOKUP(R137,'Part number'!$C$1:$D$13,2,FALSE)","v":"35S-6D2-P101"}]
[null,null,null,null,null,"UL11_5_VFD1","35S-6D3-P101","11.200.1.147","PDP02","DPM8_UL11_4_P4",{"$f":"VLOOKUP(G138,'Part number'!$B$2:$C$13,2,0)","v":3},null,null,"UL11-4",null,"UL6_5_VFD1","UL6_5",3,{"$f":"VLOOKUP(R138,'Part number'!$C$1:$D$13,2,FALSE)","v":"35S-6D3-P101"}]
[null,null,null,null,null,"UL11_6_VFD1","35S-6D3-P101","11.200.1.148","PDP02","DPM8_UL11_4_P5",{"$f":"VLOOKUP(G139,'Part number'!$B$2:$C$13,2,0)","v":3},null,null,"UL11-5",null,"UL6_6_VFD1","UL6_6",3,{"$f":"VLOOKUP(R139,'Part number'!$C$1:$D$13,2,FALSE)","v":"35S-6D3-P101"}]
[null,null,null,null,null,"UL11_7_VFD1","35S-6D3-P101","11.200.1.149","PDP02","DPM8_UL11_4_P6",{"$f":"VLOOKUP(G140,'Part number'!$B$2:$C$13,2,0)","v":3},null,null,"UL11-6",null,"UL6_7_VFD1","UL6_7",3,{"$f":"VLOOKUP(R140,'Part number'!$C$1:$D$13,2,FALSE)","v":"35S-6D3-P101"}]
[null,null,"changed name from UL11_4 to UL11_10",null,null,"UL11_8_VFD1","35S-6D3-P101","11.200.1.150","PDP02","DPM8_UL11_4_P7",{"$f":"VLOOKUP(G141,'Part number'!$B$2:$C$13,2,0)","v":3},null,null,"UL11-7",null,"UL6_8_VFD1","UL6_8",3,{"$f":"VLOOKUP(R141,'Part number'!$C$1:$D$13,2,FALSE)","v":"35S-6D3-P101"}]
[null,null,null,null,null,"UL11_9_VFD1","35S-6D4-P111","11.200.1.151","PDP02","DPM8_UL11_4_P8",{"$f":"VLOOKUP(G142,'Part number'!$B$2:$C$13,2,0)","v":5},null,null,"UL11-8",null,"UL6_9_VFD1","UL6_9",2,{"$f":"VLOOKUP(R142,'Part number'!$C$1:$D$13,2,FALSE)","v":"35S-6D2-P101"}]
[null,null,null,null,null,"UL11_10A_VFD1","35S-6D3-P101","11.200.1.152","PDP02","DPM8_UL11_4_P9",{"$f":"VLOOKUP(G143,'Part number'!$B$2:$C$13,2,0)","v":3},null,null,"UL11-9",null,{"$f":"_xlfn.CONCAT(Q143,\"_EX1\")","v":"UL7_1_EX1"},"UL7_1","EXTENDO",{"$f":"VLOOKUP(R143,'Part number'!$C$1:$D$13,2,FALSE)","v":"CALJAN"}]
[null,null,null,null,null,"UL11_10B_VFD1","35S-6D3-P101","11.200.1.153","PDP02","DPM8_UL11_4_P10",{"$f":"VLOOKUP(G144,'Part number'!$B$2:$C$13,2,0)","v":3},null,null,"UL11-10A",null,{"$f":"_xlfn.CONCAT(Q144,\"_VFD1\")","v":"UL7_10A_VFD1"},"UL7_10A",3,{"$f":"VLOOKUP(R144,'Part number'!$C$1:$D$13,2,FALSE)","v":"35S-6D3-P101"}]
[null,null,null,null,null,"UL11_11_VFD1","35S-6D2-P101","11.200.1.154","PDP02","DPM8_UL11_4_P11",{"$f":"VLOOKUP(G145,'Part number'!$B$2:$C$13,2,0)","v":2},null,null,"UL11-10B",null,"UL7_10B_VFD1","UL7_10B",3,{"$f":"VLOOKUP(R145,'Part number'!$C$1:$D$13,2,FALSE)","v":"35S-6D3-P101"}]
[null,null,null,null,null,"UL11_12_VFD1","35S-6D2-P101","11.200.1.155","PDP02","DPM8_UL11_4_P12",{"$f":"VLOOKUP(G146,'Part number'!$B$2:$C$13,2,0)","v":2},null,null,"UL11-11",null,"UL7_11_VFD1","UL7_11",2,{"$f":"VLOOKUP(R146,'Part number'!$C$1:$D$13,2,FALSE)","v":"35S-6D2-P101"}]
[null,null,null,null,null,"UL11_13_VFD1","35S-6D4-P111","11.200.1.156","PDP02","DPM8_UL11_4_P13",{"$f":"VLOOKUP(G147,'Part number'!$B$2:$C$13,2,0)","v":5},null,null,"UL11-12",null,"UL7_12_VFD1","UL7_12",2,{"$f":"VLOOKUP(R147,'Part number'!$C$1:$D$13,2,FALSE)","v":"35S-6D2-P101"}]
[null,null,null,null,null,"UL11_3_FIO1","5032-8IOLM12DR","11.200.1.158","PDP02","DPM8_UL11_4_P15",{"$f":"VLOOKUP(G148,'Part number'!$B$2:$C$13,2,0)","v":"FIO"},null,null,"UL11-13",null,"UL7_13_VFD1","UL7_13",5,{"$f":"VLOOKUP(R148,'Part number'!$C$1:$D$13,2,FALSE)","v":"35S-6D4-P111"}]
[null,null,null,null,null,"UL11_13_FIO1","5032-8IOLM12DR","11.200.1.219",null,null,null,"ADDED 5/26",null,null,null,"UL7_3_VFD1","UL7_3",5,{"$f":"VLOOKUP(R149,'Part number'!$C$1:$D$13,2,FALSE)","v":"35S-6D4-P111"}]
[null,null,null,"PS1_4_DPM1","11.200.1.10","PS1_1_VFD1",{"$f":"VLOOKUP(F150,$P$3:$S$176,4,FALSE)","v":"35S-6D2-P101"},"11.200.1.169","PDP06","DPM9_PS1_4_P1",{"$f":"VLOOKUP(G150,'Part number'!$B$2:$C$13,2,0)","v":2},null,null,null,null,"UL7_4_VFD1","UL7_4",5,{"$f":"VLOOKUP(R150,'Part number'!$C$1:$D$13,2,FALSE)","v":"35S-6D4-P111"}]
[null,null,null,null,null,"PS1_2_VFD1","35S-6D2-P101","11.200.1.170","PDP06","DPM9_PS1_4_P2",{"$f":"VLOOKUP(G151,'Part number'!$B$2:$C$13,2,0)","v":2},null,null,null,null,"UL7_4_DPM1","UL7_4_DPM1","DPM",{"$f":"VLOOKUP(R151,'Part number'!$C$1:$D$13,2,FALSE)","v":{"$error":"#N/A"}}]
[null,null,null,null,null,"PS1_3_VFD1","35S-6D2-P101","11.200.1.171","PDP06","DPM9_PS1_4_P3",{"$f":"VLOOKUP(G152,'Part number'!$B$2:$C$13,2,0)","v":2},null,null,null,null,{"$f":"_xlfn.CONCAT(Q152,\"_VFD1\")","v":"UL7_5_VFD1"},"UL7_5",3,{"$f":"VLOOKUP(R152,'Part number'!$C$1:$D$13,2,FALSE)","v":"35S-6D3-P101"}]
[null,null,null,null,null,"PS1_4_VFD1","35S-6D5-P111","11.200.1.172","PDP06","DPM9_PS1_4_P4",{"$f":"VLOOKUP(G153,'Part number'!$B$2:$C$13,2,0)","v":7.5},null,null,null,null,"UL7_6_VFD1","UL7_6",3,{"$f":"VLOOKUP(R153,'Part number'!$C$1:$D$13,2,FALSE)","v":"35S-6D3-P101"}]
[null,null,null,null,null,"PS1_5_VFD1","35S-6D4-P111","11.200.1.173","PDP06","DPM9_PS1_4_P5",{"$f":"VLOOKUP(G154,'Part number'!$B$2:$C$13,2,0)","v":5},null,null,null,null,"UL7_7_VFD1","UL7_7",3,{"$f":"VLOOKUP(R154,'Part number'!$C$1:$D$13,2,FALSE)","v":"35S-6D3-P101"}]
[null,null,null,null,null,"PS2_1_VFD1","35S-6D2-P101","11.200.1.174","PDP06","DPM9_PS1_4_P6",{"$f":"VLOOKUP(G155,'Part number'!$B$2:$C$13,2,0)","v":2},null,null,null,null,"UL7_8_VFD1","UL7_8",3,{"$f":"VLOOKUP(R155,'Part number'!$C$1:$D$13,2,FALSE)","v":"35S-6D3-P101"}]
[null,null,null,null,null,"PS2_2_VFD1","35S-6D3-P101","11.200.1.175","PDP06","DPM9_PS1_4_P7",{"$f":"VLOOKUP(G156,'Part number'!$B$2:$C$13,2,0)","v":3},null,null,null,null,"UL7_9_VFD1","UL7_9",5,{"$f":"VLOOKUP(R156,'Part number'!$C$1:$D$13,2,FALSE)","v":"35S-6D4-P111"}]
[null,null,null,null,null,"PS2_3_VFD1","35S-6D4-P111","11.200.1.176","PDP06","DPM9_PS1_4_P8",{"$f":"VLOOKUP(G157,'Part number'!$B$2:$C$13,2,0)","v":5},null,null,null,null,"UL8_1_VFD1","UL8_1",2,{"$f":"VLOOKUP(R157,'Part number'!$C$1:$D$13,2,FALSE)","v":"35S-6D2-P101"}]
[null,null,null,null,null,"PS2_4_VFD1","35S-6D2-P101","11.200.1.177","PDP06","DPM9_PS1_4_P9",{"$f":"VLOOKUP(G158,'Part number'!$B$2:$C$13,2,0)","v":2},null,null,null,null,"UL8_2_VFD1","UL8_2",7.5,{"$f":"VLOOKUP(R158,'Part number'!$C$1:$D$13,2,FALSE)","v":"35S-6D5-P111"}]
[null,null,null,null,null,"PS2_5_VFD1","35S-6D5-P111","11.200.1.178","PDP06","DPM9_PS1_4_P10",{"$f":"VLOOKUP(G159,'Part number'!$B$2:$C$13,2,0)","v":7.5},null,null,null,null,"UL8_3_VFD1","UL8_3",2,{"$f":"VLOOKUP(R159,'Part number'!$C$1:$D$13,2,FALSE)","v":"35S-6D2-P101"}]
[null,null,null,null,null,"PS2_6_VFD1","35S-6D3-P101","11.200.1.179","PDP06","DPM9_PS1_4_P11",{"$f":"VLOOKUP(G160,'Part number'!$B$2:$C$13,2,0)","v":3},null,null,null,null,"UL8_3_DPM1","UL8_3_DPM1","DPM",{"$f":"VLOOKUP(R160,'Part number'!$C$1:$D$13,2,FALSE)","v":{"$error":"#N/A"}}]
[null,null,null,null,null,"PDP6_FIO1","5032-8IOLM12DR","11.200.1.214",null,null,null,"PDP6 PMM",null,null,null,{"$f":"_xlfn.CONCAT(Q161,\"_VFD1\")","v":"UL8_4_VFD1"},"UL8_4",2,{"$f":"VLOOKUP(R161,'Part number'!$C$1:$D$13,2,FALSE)","v":"35S-6D2-P101"}]
[null,null,null,null,null,"PDP6_PMM1","1420-V2-ENT","11.200.1.215",null,null,null,"ADDED 5/26",null,null,null,"UL8_5_VFD1","UL8_5",3,{"$f":"VLOOKUP(R162,'Part number'!$C$1:$D$13,2,FALSE)","v":"35S-6D3-P101"}]
[null,null,null,"PS3_3_DPM1","11.200.1.11","PS3_1_VFD1",{"$f":"VLOOKUP(F163,$P$3:$S$176,4,FALSE)","v":"35S-6D2-P101"},"11.200.1.180","PDP06","DPM10_PS3_6_P1",{"$f":"VLOOKUP(G163,'Part number'!$B$2:$C$13,2,0)","v":2},null,null,null,null,"UL8_6_VFD1","UL8_6",3,{"$f":"VLOOKUP(R163,'Part number'!$C$1:$D$13,2,FALSE)","v":"35S-6D3-P101"}]
[null,null,null,null,null,"PS3_2_VFD1","35S-6D3-P101","11.200.1.181","PDP06","DPM10_PS3_6_P2",{"$f":"VLOOKUP(G164,'Part number'!$B$2:$C$13,2,0)","v":3},null,null,null,null,"UL8_7_VFD1","UL8_7",3,{"$f":"VLOOKUP(R164,'Part number'!$C$1:$D$13,2,FALSE)","v":"35S-6D3-P101"}]
[null,null,null,null,null,"PS3_3_VFD1","35S-6D3-P101","11.200.1.182","PDP06","DPM10_PS3_6_P3",{"$f":"VLOOKUP(G165,'Part number'!$B$2:$C$13,2,0)","v":3},null,null,null,null,"UL8_8_VFD1","UL8_8",3,{"$f":"VLOOKUP(R165,'Part number'!$C$1:$D$13,2,FALSE)","v":"35S-6D3-P101"}]
[null,null,null,null,null,"PS3_4_VFD1","35S-6D2-P101","11.200.1.183","PDP06","DPM10_PS3_6_P4",{"$f":"VLOOKUP(G166,'Part number'!$B$2:$C$13,2,0)","v":2},null,null,null,null,"UL8_9_VFD1","UL8_9",2,{"$f":"VLOOKUP(R166,'Part number'!$C$1:$D$13,2,FALSE)","v":"35S-6D2-P101"}]
[null,null,null,null,null,"PS3_5_VFD1","35S-6D4-P111","11.200.1.184","PDP06","DPM10_PS3_6_P5",{"$f":"VLOOKUP(G167,'Part number'!$B$2:$C$13,2,0)","v":5},null,null,null,null,{"$f":"_xlfn.CONCAT(Q167,\"_EX1\")","v":"UL9_1_EX1"},"UL9_1","EXTENDO",{"$f":"VLOOKUP(R167,'Part number'!$C$1:$D$13,2,FALSE)","v":"CALJAN"}]
[null,null,"changed name from PS3_6 to PS3_3 5/26",null,null,"PS3_6_VFD1","35S-6D4-P111","11.200.1.185","PDP06","DPM10_PS3_6_P6",{"$f":"VLOOKUP(G168,'Part number'!$B$2:$C$13,2,0)","v":5},null,null,null,null,{"$f":"_xlfn.CONCAT(Q168,\"_VFD1\")","v":"UL9_10_VFD1"},"UL9_10",3,{"$f":"VLOOKUP(R168,'Part number'!$C$1:$D$13,2,FALSE)","v":"35S-6D3-P101"}]
[null,null,null,null,null,"PS3_7_VFD1","35S-6D6-P111","11.200.1.186","PDP06","DPM10_PS3_6_P7",{"$f":"VLOOKUP(G169,'Part number'!$B$2:$C$13,2,0)","v":10},null,null,null,null,"UL9_11_VFD1","UL9_11",2,{"$f":"VLOOKUP(R169,'Part number'!$C$1:$D$13,2,FALSE)","v":"35S-6D2-P101"}]
[null,null,null,null,null,"PS3_8_VFD1","35S-6D3-P101","11.200.1.187","PDP06","DPM10_PS3_6_P8",{"$f":"VLOOKUP(G170,'Part number'!$B$2:$C$13,2,0)","v":3},null,null,null,null,"UL9_3_VFD1","UL9_3",5,{"$f":"VLOOKUP(R170,'Part number'!$C$1:$D$13,2,FALSE)","v":"35S-6D4-P111"}]
[null,null,null,null,null,"PS3_9_VFD1","35S-6D4-P111","11.200.1.188","PDP06","DPM10_PS3_6_P9",{"$f":"VLOOKUP(G171,'Part number'!$B$2:$C$13,2,0)","v":5},null,null,null,null,"UL9_4_VFD1","UL9_4",5,{"$f":"VLOOKUP(R171,'Part number'!$C$1:$D$13,2,FALSE)","v":"35S-6D4-P111"}]
[null,null,null,null,null,"PS3_10_VFD1","35S-6D4-P111","11.200.1.189","PDP06","DPM10_PS3_6_P10",{"$f":"VLOOKUP(G172,'Part number'!$B$2:$C$13,2,0)","v":5},null,null,null,null,"UL9_5_VFD1","UL9_5",2,{"$f":"VLOOKUP(R172,'Part number'!$C$1:$D$13,2,FALSE)","v":"35S-6D2-P101"}]
[null,null,null,null,null,"PS3_11_VFD1","35S-6D3-P101","11.200.1.190","PDP06","DPM10_PS3_6_P11",{"$f":"VLOOKUP(G173,'Part number'!$B$2:$C$13,2,0)","v":3},null,null,null,null,"UL9_6_VFD1","UL9_6",3,{"$f":"VLOOKUP(R173,'Part number'!$C$1:$D$13,2,FALSE)","v":"35S-6D3-P101"}]
[null,null,null,null,null,"PS3_12_VFD1","35S-6D3-P101","11.200.1.191","PDP06","DPM10_PS3_6_P12",{"$f":"VLOOKUP(G174,'Part number'!$B$2:$C$13,2,0)","v":3},null,null,null,null,"UL9_7_VFD1","UL9_7",3,{"$f":"VLOOKUP(R174,'Part number'!$C$1:$D$13,2,FALSE)","v":"35S-6D3-P101"}]
[null,null,null,"PS4_7_DPM1","11.200.1.12","PS4_1_VFD1","35S-6D2-P101","11.200.1.192","PDP06","DPM11_PS4_7_P1",{"$f":"VLOOKUP(G175,'Part number'!$B$2:$C$13,2,0)","v":2},null,null,null,null,"UL9_8_VFD1","UL9_8",3,{"$f":"VLOOKUP(R175,'Part number'!$C$1:$D$13,2,FALSE)","v":"35S-6D3-P101"}]
[null,null,null,null,null,"PS4_2_VFD1","35S-6D3-P101","11.200.1.193","PDP06","DPM11_PS4_7_P2",{"$f":"VLOOKUP(G176,'Part number'!$B$2:$C$13,2,0)","v":3},null,null,null,null,"UL9_9_VFD1","UL9_9",3,{"$f":"VLOOKUP(R176,'Part number'!$C$1:$D$13,2,FALSE)","v":"35S-6D3-P101"}]
[null,null,null,null,null,"PS4_3_VFD1","35S-6D2-P101","11.200.1.194","PDP06","DPM11_PS4_7_P3",{"$f":"VLOOKUP(G177,'Part number'!$B$2:$C$13,2,0)","v":2}]
[null,null,null,null,null,"PS4_4_VFD1","35S-6D3-P101","11.200.1.195","PDP06","DPM11_PS4_7_P4",{"$f":"VLOOKUP(G178,'Part number'!$B$2:$C$13,2,0)","v":3}]
[null,null,null,null,null,"PS4_5_VFD1","35S-6D4-P111","11.200.1.196","PDP06","DPM11_PS4_7_P5",{"$f":"VLOOKUP(G179,'Part number'!$B$2:$C$13,2,0)","v":5}]
[null,null,null,null,null,"PS4_6_VFD1","35S-6D5-P111","11.200.1.197","PDP06","DPM11_PS4_7_P6",{"$f":"VLOOKUP(G180,'Part number'!$B$2:$C$13,2,0)","v":7.5}]
[null,null,null,null,null,"PS4_7_VFD1","35S-6D5-P111","11.200.1.198","PDP06","DPM11_PS4_7_P7",{"$f":"VLOOKUP(G181,'Part number'!$B$2:$C$13,2,0)","v":7.5}]
[null,null,null,null,null,"PS4_8_VFD1","35S-6D4-P111","11.200.1.199","PDP06","DPM11_PS4_7_P8",{"$f":"VLOOKUP(G182,'Part number'!$B$2:$C$13,2,0)","v":5}]
[null,null,null,null,null,"PS4_9_VFD1","35S-6D3-P101","11.200.1.200","PDP06","DPM11_PS4_7_P9",{"$f":"VLOOKUP(G183,'Part number'!$B$2:$C$13,2,0)","v":3}]
[null,null,null,null,null,"PS4_10_VFD1","35S-6D6-P111","11.200.1.201","PDP06","DPM11_PS4_7_P10",{"$f":"VLOOKUP(G184,'Part number'!$B$2:$C$13,2,0)","v":10}]
[null,null,null,null,null,"PS4_11_VFD1","35S-6D4-P111","11.200.1.202","PDP06","DPM11_PS4_7_P11",{"$f":"VLOOKUP(G185,'Part number'!$B$2:$C$13,2,0)","v":5}]
[null,null,null,null,null,"PS4_12_VFD1","35S-6D3-P101","11.200.1.203","PDP06","DPM11_PS4_7_P12",{"$f":"VLOOKUP(G186,'Part number'!$B$2:$C$13,2,0)","v":3}]
[null,null,null,null,null,"PS4_13_VFD1","35S-6D3-P101","11.200.1.204","PDP06","DPM11_PS4_7_P13",{"$f":"VLOOKUP(G187,'Part number'!$B$2:$C$13,2,0)","v":3}]
[null,null,null,null,null,"PS4_14_VFD1","35S-6D3-P101","11.200.1.205","PDP06","DPM11_PS4_7_P14",{"$f":"VLOOKUP(G188,'Part number'!$B$2:$C$13,2,0)","v":3}]

{"sheet":"NETWORK","index":5,"n_rows":186,"n_cols":5,"rows_kept":186,"cut":false,"hidden":false,"merged":[]}
["DPM","DPM_IP","Name","PartNumber","IP"]
["UL1_4_DPM1","11.200.1.2","UL1_1_EX1","CALJAN","11.200.1.30"]
["UL1_4_DPM1","11.200.1.2","UL1_3_VFD1","35S-6D4-P111","11.200.1.31"]
["UL1_4_DPM1","11.200.1.2","UL1_4_VFD1","35S-6D4-P111","11.200.1.32"]
["UL1_4_DPM1","11.200.1.2","UL1_5_VFD1","35S-6D3-P101","11.200.1.33"]
["UL1_4_DPM1","11.200.1.2","UL1_6_VFD1","35S-6D3-P101","11.200.1.34"]
["UL1_4_DPM1","11.200.1.2","UL1_7_VFD1","35S-6D3-P101","11.200.1.35"]
["UL1_4_DPM1","11.200.1.2","UL1_8_VFD1","35S-6D3-P101","11.200.1.36"]
["UL1_4_DPM1","11.200.1.2","UL1_9_VFD1","35S-6D4-P111","11.200.1.37"]
["UL1_4_DPM1","11.200.1.2","UL1_10A_VFD1","35S-6D3-P101","11.200.1.38"]
["UL1_4_DPM1","11.200.1.2","UL1_10B_VFD1","35S-6D3-P101","11.200.1.39"]
["UL1_4_DPM1","11.200.1.2","UL1_11_VFD1","35S-6D2-P101","11.200.1.40"]
["UL1_4_DPM1","11.200.1.2","UL1_12_VFD1","35S-6D2-P101","11.200.1.41"]
["UL1_4_DPM1","11.200.1.2","UL1_13_VFD1","35S-6D4-P111","11.200.1.42"]
["UL1_4_DPM1","11.200.1.2","UL1_3_FIO1","5032-8IOLM12DR","11.200.1.43"]
["UL1_4_DPM1","11.200.1.2","UL1_13_FIO1","5032-8IOLM12DR","11.200.1.216"]
["UL2_4_DPM1","11.200.1.3","UL2_1_EX1","CALJAN","11.200.1.44"]
["UL2_4_DPM1","11.200.1.3","UL2_3_VFD1","35S-6D4-P111","11.200.1.45"]
["UL2_4_DPM1","11.200.1.3","UL2_4_VFD1","35S-6D4-P111","11.200.1.46"]
["UL2_4_DPM1","11.200.1.3","UL2_5_VFD1","35S-6D2-P101","11.200.1.47"]
["UL2_4_DPM1","11.200.1.3","UL2_6_VFD1","35S-6D3-P101","11.200.1.48"]
["UL2_4_DPM1","11.200.1.3","UL2_7_VFD1","35S-6D3-P101","11.200.1.49"]
["UL2_4_DPM1","11.200.1.3","UL2_8_VFD1","35S-6D3-P101","11.200.1.50"]
["UL2_4_DPM1","11.200.1.3","UL2_9_VFD1","35S-6D3-P101","11.200.1.51"]
["UL2_4_DPM1","11.200.1.3","UL2_10_VFD1","35S-6D2-P101","11.200.1.52"]
["UL2_4_DPM1","11.200.1.3","UL3_1_VFD1","35S-6D2-P101","11.200.1.53"]
["UL2_4_DPM1","11.200.1.3","UL3_2_VFD1","35S-6D5-P111","11.200.1.54"]
["UL2_4_DPM1","11.200.1.3","UL3_3_VFD1","35S-6D2-P101","11.200.1.55"]
["UL2_4_DPM1","11.200.1.3","UL3_4_VFD1","35S-6D2-P101","11.200.1.56"]
["UL2_4_DPM1","11.200.1.3","UL3_5_VFD1","35S-6D3-P101","11.200.1.57"]
["UL2_4_DPM1","11.200.1.3","UL3_6_VFD1","35S-6D3-P101","11.200.1.58"]
["UL2_4_DPM1","11.200.1.3","UL3_7_VFD1","35S-6D3-P101","11.200.1.59"]
["UL2_4_DPM1","11.200.1.3","UL3_8_VFD1","35S-6D3-P101","11.200.1.60"]
["UL2_4_DPM1","11.200.1.3","UL3_9_VFD1","35S-6D2-P101","11.200.1.61"]
["UL2_4_DPM1","11.200.1.3","UL2_3_FIO1","5032-8IOLM12DR","11.200.1.62"]
["UL2_4_DPM1","11.200.1.3","UL3_2_FIO1","5032-8IOLM12DR","11.200.1.63"]
["UL4_4_DPM1","11.200.1.4","UL4_1_EX1","CALJAN","11.200.1.64"]
["UL4_4_DPM1","11.200.1.4","UL4_3_VFD1","35S-6D4-P111","11.200.1.65"]
["UL4_4_DPM1","11.200.1.4","UL4_4_VFD1","35S-6D4-P111","11.200.1.66"]
["UL4_4_DPM1","11.200.1.4","UL4_5_VFD1","35S-6D3-P101","11.200.1.67"]
["UL4_4_DPM1","11.200.1.4","UL4_6_VFD1","35S-6D3-P101","11.200.1.68"]
["UL4_4_DPM1","11.200.1.4","UL4_7_VFD1","35S-6D3-P101","11.200.1.69"]
["UL4_4_DPM1","11.200.1.4","UL4_8_VFD1","35S-6D3-P101","11.200.1.70"]
["UL4_4_DPM1","11.200.1.4","UL4_9_VFD1","35S-6D4-P111","11.200.1.71"]
["UL4_4_DPM1","11.200.1.4","UL4_10A_VFD1","35S-6D3-P101","11.200.1.72"]
["UL4_4_DPM1","11.200.1.4","UL4_10B_VFD1","35S-6D3-P101","11.200.1.73"]
["UL4_4_DPM1","11.200.1.4","UL4_11_VFD1","35S-6D2-P101","11.200.1.74"]
["UL4_4_DPM1","11.200.1.4","UL4_12_VFD1","35S-6D2-P101","11.200.1.75"]
["UL4_4_DPM1","11.200.1.4","UL4_13_VFD1","35S-6D4-P111","11.200.1.76"]
["UL4_4_DPM1","11.200.1.4","UL4_3_FIO1","5032-8IOLM12DR","11.200.1.77"]
["UL4_4_DPM1","11.200.1.4","UL4_13_FIO1","5032-8IOLM12DR","11.200.1.217"]
["UL5_4_DPM1","11.200.1.5","UL5_1_EX1","CALJAN","11.200.1.78"]
["UL5_4_DPM1","11.200.1.5","UL5_3_VFD1","35S-6D4-P111","11.200.1.79"]
["UL5_4_DPM1","11.200.1.5","UL5_4_VFD1","35S-6D4-P111","11.200.1.80"]
["UL5_4_DPM1","11.200.1.5","UL5_5_VFD1","35S-6D2-P101","11.200.1.81"]
["UL5_4_DPM1","11.200.1.5","UL5_6_VFD1","35S-6D3-P101","11.200.1.82"]
["UL5_4_DPM1","11.200.1.5","UL5_7_VFD1","35S-6D3-P101","11.200.1.83"]
["UL5_4_DPM1","11.200.1.5","UL5_8_VFD1","35S-6D3-P101","11.200.1.84"]
["UL5_4_DPM1","11.200.1.5","UL5_9_VFD1","35S-6D3-P101","11.200.1.85"]
["UL5_4_DPM1","11.200.1.5","UL5_10_VFD1","35S-6D2-P101","11.200.1.86"]
["UL5_4_DPM1","11.200.1.5","UL6_1_VFD1","35S-6D2-P101","11.200.1.87"]
["UL5_4_DPM1","11.200.1.5","UL6_2_VFD1","35S-6D5-P111","11.200.1.88"]
["UL5_4_DPM1","11.200.1.5","UL6_3_VFD1","35S-6D2-P101","11.200.1.89"]
["UL5_4_DPM1","11.200.1.5","UL6_4_VFD1","35S-6D2-P101","11.200.1.90"]
["UL5_4_DPM1","11.200.1.5","UL6_5_VFD1","35S-6D3-P101","11.200.1.91"]
["UL5_4_DPM1","11.200.1.5","UL6_6_VFD1","35S-6D3-P101","11.200.1.92"]
["UL5_4_DPM1","11.200.1.5","UL6_7_VFD1","35S-6D3-P101","11.200.1.93"]
["UL5_4_DPM1","11.200.1.5","UL6_8_VFD1","35S-6D3-P101","11.200.1.94"]
["UL5_4_DPM1","11.200.1.5","UL6_9_VFD1","35S-6D2-P101","11.200.1.95"]
["UL5_4_DPM1","11.200.1.5","UL5_3_FIO1","5032-8IOLM12DR","11.200.1.96"]
["UL5_4_DPM1","11.200.1.5","UL6_2_FIO1","5032-8IOLM12DR","11.200.1.97"]
["UL7_4_DPM1","11.200.1.6","UL7_1_EX1","CALJAN","11.200.1.98"]
["UL7_4_DPM1","11.200.1.6","UL7_3_VFD1","35S-6D4-P111","11.200.1.99"]
["UL7_4_DPM1","11.200.1.6","UL7_4_VFD1","35S-6D4-P111","11.200.1.100"]
["UL7_4_DPM1","11.200.1.6","UL7_5_VFD1","35S-6D3-P101","11.200.1.101"]
["UL7_4_DPM1","11.200.1.6","UL7_6_VFD1","35S-6D3-P101","11.200.1.102"]
["UL7_4_DPM1","11.200.1.6","UL7_7_VFD1","35S-6D3-P101","11.200.1.103"]
["UL7_4_DPM1","11.200.1.6","UL7_8_VFD1","35S-6D3-P101","11.200.1.104"]
["UL7_4_DPM1","11.200.1.6","UL7_9_VFD1","35S-6D4-P111","11.200.1.105"]
["UL7_4_DPM1","11.200.1.6","UL7_10A_VFD1","35S-6D3-P101","11.200.1.106"]
["UL7_4_DPM1","11.200.1.6","UL7_10B_VFD1","35S-6D3-P101","11.200.1.107"]
["UL7_4_DPM1","11.200.1.6","UL7_11_VFD1","35S-6D2-P101","11.200.1.108"]
["UL7_4_DPM1","11.200.1.6","UL7_12_VFD1","35S-6D2-P101","11.200.1.109"]
["UL7_4_DPM1","11.200.1.6","UL7_13_VFD1","35S-6D4-P111","11.200.1.110"]
["UL7_4_DPM1","11.200.1.6","UL7_3_FIO1","5032-8IOLM12DR","11.200.1.111"]
["UL7_4_DPM1","11.200.1.6","PDP1_FIO1","5032-8IOLM12DR","11.200.1.210"]
["UL7_4_DPM1","11.200.1.6","PDP1_PMM1","1420-V2-ENT","11.200.1.211"]
["UL7_4_DPM1","11.200.1.6","PDP2_FIO1","5032-8IOLM12DR","11.200.1.212"]
["UL7_4_DPM1","11.200.1.6","PDP2_PMM1","1420-V2-ENT","11.200.1.213"]
["UL7_4_DPM1","11.200.1.6","UL7_13_FIO1","5032-8IOLM12DR","11.200.1.218"]
["UL8_3_DPM1","11.200.1.7","UL8_1_VFD1","35S-6D2-P101","11.200.1.112"]
["UL8_3_DPM1","11.200.1.7","UL8_2_VFD1","35S-6D5-P111","11.200.1.113"]
["UL8_3_DPM1","11.200.1.7","UL8_3_VFD1","35S-6D2-P101","11.200.1.114"]
["UL8_3_DPM1","11.200.1.7","UL8_4_VFD1","35S-6D2-P101","11.200.1.115"]
["UL8_3_DPM1","11.200.1.7","UL8_5_VFD1","35S-6D3-P101","11.200.1.116"]
["UL8_3_DPM1","11.200.1.7","UL8_6_VFD1","35S-6D3-P101","11.200.1.117"]
["UL8_3_DPM1","11.200.1.7","UL8_7_VFD1","35S-6D3-P101","11.200.1.118"]
["UL8_3_DPM1","11.200.1.7","UL8_8_VFD1","35S-6D3-P101","11.200.1.119"]
["UL8_3_DPM1","11.200.1.7","UL8_9_VFD1","35S-6D2-P101","11.200.1.120"]
["UL8_3_DPM1","11.200.1.7","UL9_1_EX1","CALJAN","11.200.1.121"]
["UL8_3_DPM1","11.200.1.7","UL9_3_VFD1","35S-6D4-P111","11.200.1.122"]
["UL8_3_DPM1","11.200.1.7","UL9_4_VFD1","35S-6D4-P111","11.200.1.123"]
["UL8_3_DPM1","11.200.1.7","UL9_5_VFD1","35S-6D2-P101","11.200.1.124"]
["UL8_3_DPM1","11.200.1.7","UL9_6_VFD1","35S-6D3-P101","11.200.1.125"]
["UL8_3_DPM1","11.200.1.7","UL9_7_VFD1","35S-6D3-P101","11.200.1.126"]
["UL8_3_DPM1","11.200.1.7","UL9_8_VFD1","35S-6D3-P101","11.200.1.127"]
["UL8_3_DPM1","11.200.1.7","UL9_9_VFD1","35S-6D3-P101","11.200.1.128"]
["UL8_3_DPM1","11.200.1.7","UL9_10_VFD1","35S-6D3-P101","11.200.1.129"]
["UL8_3_DPM1","11.200.1.7","UL9_11_VFD1","35S-6D2-P101","11.200.1.130"]
["UL8_3_DPM1","11.200.1.7","UL8_2_FIO1","5032-8IOLM12DR","11.200.1.131"]
["UL8_3_DPM1","11.200.1.7","UL9_3_FIO1","5032-8IOLM12DR","11.200.1.132"]
["UL10_3_DPM1","11.200.1.8","UL10_1_VFD1","35S-6D2-P101","11.200.1.133"]
["UL10_3_DPM1","11.200.1.8","UL10_2_VFD1","35S-6D5-P111","11.200.1.134"]
["UL10_3_DPM1","11.200.1.8","UL10_3_VFD1","35S-6D2-P101","11.200.1.135"]
["UL10_3_DPM1","11.200.1.8","UL10_4_VFD1","35S-6D3-P101","11.200.1.136"]
["UL10_3_DPM1","11.200.1.8","UL10_5_VFD1","35S-6D3-P101","11.200.1.137"]
["UL10_3_DPM1","11.200.1.8","UL10_6_VFD1","35S-6D3-P101","11.200.1.138"]
["UL10_3_DPM1","11.200.1.8","UL10_7_VFD1","35S-6D3-P101","11.200.1.139"]
["UL10_3_DPM1","11.200.1.8","UL10_8_VFD1","35S-6D3-P101","11.200.1.140"]
["UL10_3_DPM1","11.200.1.8","UL10_9_VFD1","35S-6D3-P101","11.200.1.141"]
["UL10_3_DPM1","11.200.1.8","UL10_10_VFD1","35S-6D2-P101","11.200.1.142"]
["UL10_3_DPM1","11.200.1.8","UL10_2_FIO1","5032-8IOLM12DR","11.200.1.143"]
["UL10_3_DPM1","11.200.1.8","UL12_1_EX1","CALJAN","11.200.1.159"]
["UL10_3_DPM1","11.200.1.8","UL12_3_VFD1","35S-6D4-P111","11.200.1.160"]
["UL10_3_DPM1","11.200.1.8","UL12_4_VFD1","35S-6D4-P111","11.200.1.161"]
["UL10_3_DPM1","11.200.1.8","UL12_5_VFD1","35S-6D2-P101","11.200.1.162"]
["UL10_3_DPM1","11.200.1.8","UL12_6_VFD1","35S-6D3-P101","11.200.1.163"]
["UL10_3_DPM1","11.200.1.8","UL12_7_VFD1","35S-6D3-P101","11.200.1.164"]
["UL10_3_DPM1","11.200.1.8","UL12_8_VFD1","35S-6D3-P101","11.200.1.165"]
["UL10_3_DPM1","11.200.1.8","UL12_9_VFD1","35S-6D3-P101","11.200.1.166"]
["UL10_3_DPM1","11.200.1.8","UL12_10_VFD1","35S-6D2-P101","11.200.1.167"]
["UL10_3_DPM1","11.200.1.8","UL12_3_FIO1","5032-8IOLM12DR","11.200.1.168"]
["UL11_10_DPM1","11.200.1.9","UL11_1_EX1","CALJAN","11.200.1.144"]
["UL11_10_DPM1","11.200.1.9","UL11_3_VFD1","35S-6D4-P111","11.200.1.145"]
["UL11_10_DPM1","11.200.1.9","UL11_4_VFD1","35S-6D4-P111","11.200.1.146"]
["UL11_10_DPM1","11.200.1.9","UL11_5_VFD1","35S-6D3-P101","11.200.1.147"]
["UL11_10_DPM1","11.200.1.9","UL11_6_VFD1","35S-6D3-P101","11.200.1.148"]
["UL11_10_DPM1","11.200.1.9","UL11_7_VFD1","35S-6D3-P101","11.200.1.149"]
["UL11_10_DPM1","11.200.1.9","UL11_8_VFD1","35S-6D3-P101","11.200.1.150"]
["UL11_10_DPM1","11.200.1.9","UL11_9_VFD1","35S-6D4-P111","11.200.1.151"]
["UL11_10_DPM1","11.200.1.9","UL11_10A_VFD1","35S-6D3-P101","11.200.1.152"]
["UL11_10_DPM1","11.200.1.9","UL11_10B_VFD1","35S-6D3-P101","11.200.1.153"]
["UL11_10_DPM1","11.200.1.9","UL11_11_VFD1","35S-6D2-P101","11.200.1.154"]
["UL11_10_DPM1","11.200.1.9","UL11_12_VFD1","35S-6D2-P101","11.200.1.155"]
["UL11_10_DPM1","11.200.1.9","UL11_13_VFD1","35S-6D4-P111","11.200.1.156"]
["UL11_10_DPM1","11.200.1.9","UL11_3_FIO1","5032-8IOLM12DR","11.200.1.158"]
["UL11_10_DPM1","11.200.1.9","UL11_13_FIO1","5032-8IOLM12DR","11.200.1.219"]
["PS1_4_DPM1","11.200.1.10","PS1_1_VFD1","35S-6D2-P101","11.200.1.169"]
["PS1_4_DPM1","11.200.1.10","PS1_2_VFD1","35S-6D2-P101","11.200.1.170"]
["PS1_4_DPM1","11.200.1.10","PS1_3_VFD1","35S-6D2-P101","11.200.1.171"]
["PS1_4_DPM1","11.200.1.10","PS1_4_VFD1","35S-6D5-P111","11.200.1.172"]
["PS1_4_DPM1","11.200.1.10","PS1_5_VFD1","35S-6D4-P111","11.200.1.173"]
["PS1_4_DPM1","11.200.1.10","PS2_1_VFD1","35S-6D2-P101","11.200.1.174"]
["PS1_4_DPM1","11.200.1.10","PS2_2_VFD1","35S-6D3-P101","11.200.1.175"]
["PS1_4_DPM1","11.200.1.10","PS2_3_VFD1","35S-6D4-P111","11.200.1.176"]
["PS1_4_DPM1","11.200.1.10","PS2_4_VFD1","35S-6D2-P101","11.200.1.177"]
["PS1_4_DPM1","11.200.1.10","PS2_5_VFD1","35S-6D5-P111","11.200.1.178"]
["PS1_4_DPM1","11.200.1.10","PS2_6_VFD1","35S-6D3-P101","11.200.1.179"]
["PS1_4_DPM1","11.200.1.10","PDP6_FIO1","5032-8IOLM12DR","11.200.1.214"]
["PS1_4_DPM1","11.200.1.10","PDP6_PMM1","1420-V2-ENT","11.200.1.215"]
["PS3_3_DPM1","11.200.1.11","PS3_1_VFD1","35S-6D2-P101","11.200.1.180"]
["PS3_3_DPM1","11.200.1.11","PS3_2_VFD1","35S-6D3-P101","11.200.1.181"]
["PS3_3_DPM1","11.200.1.11","PS3_3_VFD1","35S-6D3-P101","11.200.1.182"]
["PS3_3_DPM1","11.200.1.11","PS3_4_VFD1","35S-6D2-P101","11.200.1.183"]
["PS3_3_DPM1","11.200.1.11","PS3_5_VFD1","35S-6D4-P111","11.200.1.184"]
["PS3_3_DPM1","11.200.1.11","PS3_6_VFD1","35S-6D4-P111","11.200.1.185"]
["PS3_3_DPM1","11.200.1.11","PS3_7_VFD1","35S-6D6-P111","11.200.1.186"]
["PS3_3_DPM1","11.200.1.11","PS3_8_VFD1","35S-6D3-P101","11.200.1.187"]
["PS3_3_DPM1","11.200.1.11","PS3_9_VFD1","35S-6D4-P111","11.200.1.188"]
["PS3_3_DPM1","11.200.1.11","PS3_10_VFD1","35S-6D4-P111","11.200.1.189"]
["PS3_3_DPM1","11.200.1.11","PS3_11_VFD1","35S-6D3-P101","11.200.1.190"]
["PS3_3_DPM1","11.200.1.11","PS3_12_VFD1","35S-6D3-P101","11.200.1.191"]
["PS4_7_DPM1","11.200.1.12","PS4_1_VFD1","35S-6D2-P101","11.200.1.192"]
["PS4_7_DPM1","11.200.1.12","PS4_2_VFD1","35S-6D3-P101","11.200.1.193"]
["PS4_7_DPM1","11.200.1.12","PS4_3_VFD1","35S-6D2-P101","11.200.1.194"]
["PS4_7_DPM1","11.200.1.12","PS4_4_VFD1","35S-6D3-P101","11.200.1.195"]
["PS4_7_DPM1","11.200.1.12","PS4_5_VFD1","35S-6D4-P111","11.200.1.196"]
["PS4_7_DPM1","11.200.1.12","PS4_6_VFD1","35S-6D5-P111","11.200.1.197"]
["PS4_7_DPM1","11.200.1.12","PS4_7_VFD1","35S-6D5-P111","11.200.1.198"]
["PS4_7_DPM1","11.200.1.12","PS4_8_VFD1","35S-6D4-P111","11.200.1.199"]
["PS4_7_DPM1","11.200.1.12","PS4_9_VFD1","35S-6D3-P101","11.200.1.200"]
["PS4_7_DPM1","11.200.1.12","PS4_10_VFD1","35S-6D6-P111","11.200.1.201"]
["PS4_7_DPM1","11.200.1.12","PS4_11_VFD1","35S-6D4-P111","11.200.1.202"]
["PS4_7_DPM1","11.200.1.12","PS4_12_VFD1","35S-6D3-P101","11.200.1.203"]
["PS4_7_DPM1","11.200.1.12","PS4_13_VFD1","35S-6D3-P101","11.200.1.204"]
["PS4_7_DPM1","11.200.1.12","PS4_14_VFD1","35S-6D3-P101","11.200.1.205"]

{"sheet":"Part number","index":6,"n_rows":13,"n_cols":4,"rows_kept":13,"cut":false,"hidden":false,"merged":[]}
[null,"PART NUMBER","HP","PART NUMBER"]
[null,"35S-6D2-P101",2,"35S-6D2-P101"]
[null,"35S-6D3-P101",3,"35S-6D3-P101"]
[null,"35S-6D4-P111",5,"35S-6D4-P111"]
[null,"35S-6D5-P111",7.5,"35S-6D5-P111"]
[null,"35S-6D6-P111",10,"35S-6D6-P111"]
[null,"25B-D024N104",15,"25B-D024N104"]
[null,"25B-D030N104",20,"25B-D030N104"]
[null,"25B-D043N114 ",30,"25B-D043N114 "]
[null,"CALJAN","EXTENDO","CALJAN"]
[null,"PIONEER","TIPPER","PIONEER"]
[null,"ZMX-3DE2500HF-Q7-AMZCHD","ZMX","ZMX-3DE2500HF-Q7-AMZCHD"]
[null,"5032-8IOLM12DR","FIO","5032-8IOLM12DR"]

{"sheet":"MCM01_DESC","index":7,"n_rows":1909,"n_cols":11,"rows_kept":1909,"cut":false,"hidden":false,"merged":[[26,8,30,8],[1,8,5,8],[6,8,10,8],[11,8,15,8],[16,8,20,8],[21,8,25,8],[86,8,90,8],[31,8,35,8],[36,8,40,8],[41,8,45,8],[46,8,50,8],[51,8,55,8],[56,8,60,8],[61,8,65,8],[66,8,70,8],[71,8,75,8],[76,8,80,8],[81,8,85,8],[146,8,150,8],[91,8,95,8],[96,8,100,8],[101,8,105,8],[106,8,110,8],[111,8,115,8],[116,8,120,8],[121,8,125,8],[126,8,130,8],[131,8,135,8],[136,8,140,8],[141,8,145,8],[206,8,210,8],[151,8,155,8],[156,8,160,8],[161,8,165,8],[166,8,170,8],[171,8,175,8],[176,8,180,8],[181,8,185,8],[186,8,190,8],[191,8,195,8],[196,8,200,8],[201,8,205,8]]}
["TAGNAME","ADDR","TERM","TERMDESC","DESCA","DESCB",null,"CONTROLLERS"]
["PS1_01_VFD1","PS1_01_VFD1_I0","I0",null,"PS1_1_VFD1_DISC","DISCONNECT AUX",null,"PS1_01_VFD1",600]
["PS1_01_VFD1","PS1_01_VFD1_I1","I1",null,"SPARE",null,null,"PS1_02_VFD1"]
["PS1_01_VFD1","PS1_01_VFD1_I2","I2",null,"SPARE",null,null,"PS1_03_VFD1"]
["PS1_01_VFD1","PS1_01_VFD1_I3","I3",null,"SPARE",null,null,"PS1_04_VFD1"]
["PS1_01_VFD1","PS1_01_VFD1_IO0","IO0",null,"PS1_1_S1_PB","START PUSHBUTTON"]
["PS1_01_VFD1","PS1_01_VFD1_IO1","IO1",null,"PS1_1_S1_PB_LT","START PUSHBUTTON LIGHT",null,"PS1_05_VFD1",601]
["PS1_01_VFD1","PS1_01_VFD1_SI0","SI0",null,"PS1_1_EPC1","E-STOP PULLCORD",null,"PS2_01_VFD1"]
["PS1_01_VFD1","PS1_01_VFD1_SI1","SI1",null,"PS1_1_EPC1_2","E-STOP PULLCORD",null,"PS2_02_VFD1"]
["PS1_01_VFD1","PS1_01_VFD1_SI2","SI2",null,"PS1_1_EPC2","E-STOP PULLCORD",null,"PS2_03_VFD1"]
["PS1_01_VFD1","PS1_01_VFD1_SI3","SI3",null,"PS1_1_EPC2_2","E-STOP PULLCORD"]
["PS1_01_VFD1","PS1_01_VFD1_SO0","SO0",null,"SPARE",null,null,"PS2_04_VFD1",602]
["PS1_02_VFD1","PS1_02_VFD1_I0","I0",null,"PS1_2_VFD1_DISC","DISCONNECT AUX",null,"PS2_05_VFD1"]
["PS1_02_VFD1","PS1_02_VFD1_I1","I1",null,"SPARE",null,null,"PS2_06_VFD1"]
["PS1_02_VFD1","PS1_02_VFD1_I2","I2",null,"PS1_2_TPE1","TRACKING PHOTOEYE",null,"PS3_01_VFD1"]
["PS1_02_VFD1","PS1_02_VFD1_I3","I3",null,"PS1_2_TPE2","TRACKING PHOTOEYE"]
["PS1_02_VFD1","PS1_02_VFD1_IO0","IO0",null,"PS1_1_BCN1_R","RED BEACON LIGHT",null,"PS3_02_VFD1",603]
["PS1_02_VFD1","PS1_02_VFD1_IO1","IO1",null,"PS1_1_BCN2_R","RED BEACON LIGHT",null,"PS3_03_VFD1"]
["PS1_02_VFD1","PS1_02_VFD1_SI0","SI0",null,"SPARE",null,null,"PS3_04_VFD1"]
["PS1_02_VFD1","PS1_02_VFD1_SI1","SI1",null,"SPARE",null,null,"PS3_05_VFD1"]
["PS1_02_VFD1","PS1_02_VFD1_SI2","SI2",null,"SPARE"]
["PS1_02_VFD1","PS1_02_VFD1_SI3","SI3",null,"SPARE",null,null,"PS3_06_VFD1",604]
["PS1_02_VFD1","PS1_02_VFD1_SO0","SO0",null,"SPARE",null,null,"PS3_07_VFD1"]
["PS1_03_VFD1","PS1_03_VFD1_I0","I0",null,"PS1_3_VFD1_DISC","DISCONNECT AUX",null,"PS3_08_VFD1"]
["PS1_03_VFD1","PS1_03_VFD1_I1","I1",null,"SPARE",null,null,"PS3_09_VFD1"]
["PS1_03_VFD1","PS1_03_VFD1_I2","I2",null,"SPARE"]
["PS1_03_VFD1","PS1_03_VFD1_I3","I3",null,"SPARE",null,null,"PS3_10_VFD1",605]
["PS1_03_VFD1","PS1_03_VFD1_IO0","IO0",null,"PS1_1_S2_PB","START PUSHBUTTON",null,"PS3_11_VFD1"]
["PS1_03_VFD1","PS1_03_VFD1_IO1","IO1",null,"PS1_1_S2_PB_LT","START PUSHBUTTON LIGHT",null,"PS3_12_VFD1"]
["PS1_03_VFD1","PS1_03_VFD1_SI0","SI0",null,"SPARE",null,null,"PS4_01_VFD1"]
["PS1_03_VFD1","PS1_03_VFD1_SI1","SI1",null,"SPARE"]
["PS1_03_VFD1","PS1_03_VFD1_SI2","SI2",null,"SPARE",null,null,"PS4_02_VFD1",606]
["PS1_03_VFD1","PS1_03_VFD1_SI3","SI3",null,"SPARE",null,null,"PS4_03_VFD1"]
["PS1_03_VFD1","PS1_03_VFD1_SO0","SO0",null,"SPARE",null,null,"PS4_04_VFD1"]
["PS1_04_VFD1","PS1_04_VFD1_I0","I0",null,"PS1_4_VFD1_DISC","DISCONNECT AUX",null,"PS4_05_VFD1"]
["PS1_04_VFD1","PS1_04_VFD1_I1","I1",null,"SPARE"]
["PS1_04_VFD1","PS1_04_VFD1_I2","I2",null,"PS1_4_TPE1","TRACKING PHOTOEYE",null,"PS4_06_VFD1",607]
["PS1_04_VFD1","PS1_04_VFD1_I3","I3",null,"PS1_4_TPE2","TRACKING PHOTOEYE",null,"PS4_07_VFD1"]
["PS1_04_VFD1","PS1_04_VFD1_IO0","IO0",null,"PS1_5_S1_PB","START PUSHBUTTON",null,"PS4_08_VFD1"]
["PS1_04_VFD1","PS1_04_VFD1_IO1","IO1",null,"PS1_5_S1_PB_LT","START PUSHBUTTON LIGHT",null,"PS4_09_VFD1"]
["PS1_04_VFD1","PS1_04_VFD1_SI0","SI0",null,"SPARE"]
["PS1_04_VFD1","PS1_04_VFD1_SI1","SI1",null,"SPARE",null,null,"PS4_10_VFD1",608]
["PS1_04_VFD1","PS1_04_VFD1_SI2","SI2",null,"SPARE",null,null,"PS4_11_VFD1"]
["PS1_04_VFD1","PS1_04_VFD1_SI3","SI3",null,"SPARE",null,null,"PS4_12_VFD1"]
["PS1_04_VFD1","PS1_04_VFD1_SO0","SO0",null,"PS1_5_BCN2_R","RED BEACON LIGHT",null,"PS4_13_VFD1"]
["PS1_05_VFD1","PS1_05_VFD1_I0","I0",null,"PS1_5_VFD1_DISC","DISCONNECT AUX"]
["PS1_05_VFD1","PS1_05_VFD1_I1","I1",null,"SPARE",null,null,"PS4_14_VFD1",609,null,"PS4_02_VFD1"]
["PS1_05_VFD1","PS1_05_VFD1_I2","I2",null,"PS1_5_TPE1","TRACKING PHOTOEYE",null,"UL1_03_FIO1",null,null,"PS4_03_VFD1"]
["PS1_05_VFD1","PS1_05_VFD1_I3","I3",null,"SPARE",null,null,"UL1_03_VFD1",null,null,"PS4_04_VFD1"]
["PS1_05_VFD1","PS1_05_VFD1_IO0","IO0",null,"PS1_5_S2_PB","START PUSHBUTTON",null,"UL1_04_VFD1",null,null,"PS4_05_VFD1"]
["PS1_05_VFD1","PS1_05_VFD1_IO1","IO1",null,"PS1_5_S2_PB_LT","START PUSHBUTTON LIGHT"]
["PS1_05_VFD1","PS1_05_VFD1_SI0","SI0",null,"PS1_5_EPC1","E-STOP PULLCORD",null,"UL1_05_VFD1",610,null,"PS4_02_VFD1"]
["PS1_05_VFD1","PS1_05_VFD1_SI1","SI1",null,"PS1_5_EPC1_2","E-STOP PULLCORD",null,"UL1_06_VFD1",null,null,"PS4_03_VFD1"]
["PS1_05_VFD1","PS1_05_VFD1_SI2","SI2",null,"PS1_5_EPC2","E-STOP PULLCORD",null,"UL1_07_VFD1",null,null,"PS4_04_VFD1"]
["PS1_05_VFD1","PS1_05_VFD1_SI3","SI3",null,"PS1_5_EPC2_2","E-STOP PULLCORD",null,"UL1_08_VFD1",null,null,"PS4_05_VFD1"]
["PS1_05_VFD1","PS1_05_VFD1_SO0","SO0",null,"PS1_5_BCN1_R","RED BEACON LIGHT"]
["PS2_01_VFD1","PS2_01_VFD1_I0","I0",null,"PS2_1_VFD1_DISC","DISCONNECT AUX",null,"UL1_09_VFD1",611,null,"PS4_02_VFD1"]
["PS2_01_VFD1","PS2_01_VFD1_I1","I1",null,"SPARE",null,null,"UL1_10A_VFD1",null,null,"PS4_03_VFD1"]
["PS2_01_VFD1","PS2_01_VFD1_I2","I2",null,"SPARE",null,null,"UL1_10B_VFD1",null,null,"PS4_04_VFD1"]
["PS2_01_VFD1","PS2_01_VFD1_I3","I3",null,"SPARE",null,null,"UL1_11_VFD1",null,null,"PS4_05_VFD1"]
["PS2_01_VFD1","PS2_01_VFD1_IO0","IO0",null,"PS2_1_S1_PB","START PUSHBUTTON"]
["PS2_01_VFD1","PS2_01_VFD1_IO1","IO1",null,"PS2_1_S1_PB_LT","START PUSHBUTTON LIGHT",null,"UL1_12_VFD1",612,null,"PS4_02_VFD1"]
["PS2_01_VFD1","PS2_01_VFD1_SI0","SI0",null,"PS2_1_EPC1","E-STOP PULLCORD",null,"UL1_13_VFD1",null,null,"PS4_03_VFD1"]
["PS2_01_VFD1","PS2_01_VFD1_SI1","SI1",null,"PS2_1_EPC1_2","E-STOP PULLCORD",null,"UL10_01_VFD1",null,null,"PS4_04_VFD1"]
["PS2_01_VFD1","PS2_01_VFD1_SI2","SI2",null,"PS2_1_EPC2","E-STOP PULLCORD",null,"UL10_02_FIO1",null,null,"PS4_05_VFD1"]
["PS2_01_VFD1","PS2_01_VFD1_SI3","SI3",null,"PS2_1_EPC2_2","E-STOP PULLCORD"]
["PS2_01_VFD1","PS2_01_VFD1_SO0","SO0",null,"SPARE",null,null,"UL10_02_VFD1",613,null,"PS4_02_VFD1"]
["PS2_02_VFD1","PS2_02_VFD1_I0","I0",null,"PS2_2_VFD1_DISC","DISCONNECT AUX",null,"UL10_03_VFD1",null,null,"PS4_03_VFD1"]
["PS2_02_VFD1","PS2_02_VFD1_I1","I1",null,"SPARE",null,null,"UL10_04_VFD1",null,null,"PS4_04_VFD1"]
["PS2_02_VFD1","PS2_02_VFD1_I2","I2",null,"PS2_2_TPE1","TRACKING PHOTOEYE",null,"UL10_05_VFD1",null,null,"PS4_05_VFD1"]
["PS2_02_VFD1","PS2_02_VFD1_I3","I3",null,"PS2_2_TPE2","TRACKING PHOTOEYE"]
["PS2_02_VFD1","PS2_02_VFD1_IO0","IO0",null,"PS2_1_BCN1_R","RED BEACON LIGHT",null,"UL10_06_VFD1",614,null,"PS4_02_VFD1"]
["PS2_02_VFD1","PS2_02_VFD1_IO1","IO1",null,"PS2_1_BCN2_R","RED BEACON LIGHT",null,"UL10_07_VFD1",null,null,"PS4_03_VFD1"]
["PS2_02_VFD1","PS2_02_VFD1_SI0","SI0",null,"SPARE",null,null,"UL10_08_VFD1",null,null,"PS4_04_VFD1"]
["PS2_02_VFD1","PS2_02_VFD1_SI1","SI1",null,"SPARE",null,null,"UL10_09_VFD1",null,null,"PS4_05_VFD1"]
["PS2_02_VFD1","PS2_02_VFD1_SI2","SI2",null,"SPARE"]
["PS2_02_VFD1","PS2_02_VFD1_SI3","SI3",null,"SPARE",null,null,"UL10_10_VFD1",615,null,"PS4_02_VFD1"]
["PS2_02_VFD1","PS2_02_VFD1_SO0","SO0",null,"SPARE",null,null,"UL11_03_FIO1",null,null,"PS4_03_VFD1"]
["PS2_03_VFD1","PS2_03_VFD1_I0","I0",null,"PS2_3_VFD1_DISC","DISCONNECT AUX",null,"UL11_03_VFD1",null,null,"PS4_04_VFD1"]
["PS2_03_VFD1","PS2_03_VFD1_I1","I1",null,"SPARE",null,null,"UL11_04_VFD1",null,null,"PS4_05_VFD1"]
["PS2_03_VFD1","PS2_03_VFD1_I2","I2",null,"PS2_3_TPE2","TRACKING PHOTOEYE"]
["PS2_03_VFD1","PS2_03_VFD1_I3","I3",null,"SPARE",null,null,"UL11_05_VFD1",616,null,"PS4_02_VFD1"]
["PS2_03_VFD1","PS2_03_VFD1_IO0","IO0",null,"PS2_1_S2_PB","START PUSHBUTTON",null,"UL11_06_VFD1",null,null,"PS4_03_VFD1"]
["PS2_03_VFD1","PS2_03_VFD1_IO1","IO1",null,"PS2_1_S2_PB_LT","START PUSHBUTTON LIGHT",null,"UL11_07_VFD1",null,null,"PS4_04_VFD1"]
["PS2_03_VFD1","PS2_03_VFD1_SI0","SI0",null,"SPARE",null,null,"UL11_08_VFD1",null,null,"PS4_05_VFD1"]
["PS2_03_VFD1","PS2_03_VFD1_SI1","SI1",null,"SPARE"]
["PS2_03_VFD1","PS2_03_VFD1_SI2","SI2",null,"SPARE",null,null,"UL11_09_VFD1",617,null,"PS4_02_VFD1"]
["PS2_03_VFD1","PS2_03_VFD1_SI3","SI3",null,"SPARE",null,null,"UL11_10_VFD1",null,null,"PS4_03_VFD1"]
["PS2_03_VFD1","PS2_03_VFD1_SO0","SO0",null,"PS2_3_BCN1_A","AMBER BEACON LIGHT",null,"UL11_11A_VFD1",null,null,"PS4_04_VFD1"]
["PS2_04_VFD1","PS2_04_VFD1_I0","I0",null,"PS2_4_VFD1_DISC","DISCONNECT AUX",null,"UL11_11B_VFD1",null,null,"PS4_05_VFD1"]
["PS2_04_VFD1","PS2_04_VFD1_I1","I1",null,"SPARE"]
["PS2_04_VFD1","PS2_04_VFD1_I2","I2",null,"SPARE",null,null,"UL11_12_VFD1",618,null,"PS4_02_VFD1"]
["PS2_04_VFD1","PS2_04_VFD1_I3","I3",null,"SPARE",null,null,"UL11_13_VFD1",null,null,"PS4_03_VFD1"]
["PS2_04_VFD1","PS2_04_VFD1_IO0","IO0",null,"PS2_3_JR1_PB","JAM RESET PUSHBUTTON",null,"UL11_14_VFD1",null,null,"PS4_04_VFD1"]
["PS2_04_VFD1","PS2_04_VFD1_IO1","IO1",null,"PS2_3_JR1_PB_LT","JAM RESET PUSHBUTTON LIGHT",null,"UL12_03_FIO1",null,null,"PS4_05_VFD1"]
["PS2_04_VFD1","PS2_04_VFD1_SI0","SI0",null,"SPARE"]
["PS2_04_VFD1","PS2_04_VFD1_SI1","SI1",null,"SPARE",null,null,"UL12_03_VFD1",619,null,"PS4_02_VFD1"]
["PS2_04_VFD1","PS2_04_VFD1_SI2","SI2",null,"SPARE",null,null,"UL12_04_VFD1",null,null,"PS4_03_VFD1"]
["PS2_04_VFD1","PS2_04_VFD1_SI3","SI3",null,"SPARE",null,null,"UL12_05_VFD1",null,null,"PS4_04_VFD1"]
["PS2_04_VFD1","PS2_04_VFD1_SO0","SO0",null,"SPARE",null,null,"UL12_06_VFD1",null,null,"PS4_05_VFD1"]
["PS2_05_VFD1","PS2_05_VFD1_I0","I0",null,"PS2_5_VFD1_DISC","DISCONNECT AUX"]
["PS2_05_VFD1","PS2_05_VFD1_I1","I1",null,"SPARE",null,null,"UL12_07_VFD1",620,null,"PS4_02_VFD1"]
["PS2_05_VFD1","PS2_05_VFD1_I2","I2",null,"PS2_5_TPE1","TRACKING PHOTOEYE",null,"UL12_08_VFD1",null,null,"PS4_03_VFD1"]
["PS2_05_VFD1","PS2_05_VFD1_I3","I3",null,"PS2_5_TPE2","TRACKING PHOTOEYE",null,"UL12_09_VFD1",null,null,"PS4_04_VFD1"]
["PS2_05_VFD1","PS2_05_VFD1_IO0","IO0",null,"PS2_6_S2_PB","START PUSHBUTTON",null,"UL12_10_VFD1",null,null,"PS4_05_VFD1"]
["PS2_05_VFD1","PS2_05_VFD1_IO1","IO1",null,"PS2_6_S2_PB_LT","START PUSHBUTTON LIGHT"]
["PS2_05_VFD1","PS2_05_VFD1_SI0","SI0",null,"SPARE",null,null,"UL2_03_FIO1",621,null,"PS4_02_VFD1"]
["PS2_05_VFD1","PS2_05_VFD1_SI1","SI1",null,"SPARE",null,null,"UL2_03_VFD1",null,null,"PS4_03_VFD1"]
["PS2_05_VFD1","PS2_05_VFD1_SI2","SI2",null,"SPARE",null,null,"UL2_04_VFD1",null,null,"PS4_04_VFD1"]
["PS2_05_VFD1","PS2_05_VFD1_SI3","SI3",null,"SPARE",null,null,"UL2_05_VFD1",null,null,"PS4_05_VFD1"]
["PS2_05_VFD1","PS2_05_VFD1_SO0","SO0",null,"PS2_6_BCN2_R","RED BEACON LIGHT"]
["PS2_06_VFD1","PS2_06_VFD1_I0","I0",null,"PS2_6_VFD1_DISC","DISCONNECT AUX",null,"UL2_06_VFD1",622,null,"PS4_02_VFD1"]
["PS2_06_VFD1","PS2_06_VFD1_I1","I1",null,"SPARE",null,null,"UL2_07_VFD1",null,null,"PS4_03_VFD1"]
["PS2_06_VFD1","PS2_06_VFD1_I2","I2",null,"PS2_6_TPE1","TRACKING PHOTOEYE",null,"UL2_08_VFD1",null,null,"PS4_04_VFD1"]
["PS2_06_VFD1","PS2_06_VFD1_I3","I3",null,"SPARE",null,null,"UL2_09_VFD1",null,null,"PS4_05_VFD1"]
["PS2_06_VFD1","PS2_06_VFD1_IO0","IO0",null,"PS2_6_S1_PB","START PUSHBUTTON"]
["PS2_06_VFD1","PS2_06_VFD1_IO1","IO1",null,"PS2_6_S1_PB_LT","START PUSHBUTTON LIGHT",null,"UL2_10_VFD1",623,null,"PS4_02_VFD1"]
["PS2_06_VFD1","PS2_06_VFD1_SI0","SI0",null,"PS2_6_EPC1","E-STOP PULLCORD",null,"UL3_01_VFD1",null,null,"PS4_03_VFD1"]
["PS2_06_VFD1","PS2_06_VFD1_SI1","SI1",null,"PS2_6_EPC1_2","E-STOP PULLCORD",null,"UL3_02_FIO1",null,null,"PS4_04_VFD1"]
["PS2_06_VFD1","PS2_06_VFD1_SI2","SI2",null,"PS2_6_EPC2","E-STOP PULLCORD",null,"UL3_02_VFD1",null,null,"PS4_05_VFD1"]
["PS2_06_VFD1","PS2_06_VFD1_SI3","SI3",null,"PS2_6_EPC2_2","E-STOP PULLCORD"]
["PS2_06_VFD1","PS2_06_VFD1_SO0","SO0",null,"PS2_6_BCN1_R","RED BEACON LIGHT",null,"UL3_03_VFD1",624,null,"PS4_02_VFD1"]
["PS3_01_VFD1","PS3_01_VFD1_I0","I0",null,"PS3_1_VFD1_DISC","DISCONNECT AUX",null,"UL3_04_VFD1",null,null,"PS4_03_VFD1"]
["PS3_01_VFD1","PS3_01_VFD1_I1","I1",null,"SPARE",null,null,"UL3_05_VFD1",null,null,"PS4_04_VFD1"]
["PS3_01_VFD1","PS3_01_VFD1_I2","I2",null,"PS3_1_TPE1","TRACKING PHOTOEYE",null,"UL3_06_VFD1",null,null,"PS4_05_VFD1"]
["PS3_01_VFD1","PS3_01_VFD1_I3","I3",null,"SPARE"]
["PS3_01_VFD1","PS3_01_VFD1_IO0","IO0",null,"PS3_1_BCN2_A","AMBER BEACON LIGHT",null,"UL3_07_VFD1",625,null,"PS4_02_VFD1"]
["PS3_01_VFD1","PS3_01_VFD1_IO1","IO1",null,"PS3_1_BCN2_R","RED BEACON LIGHT",null,"UL3_08_VFD1",null,null,"PS4_03_VFD1"]
["PS3_01_VFD1","PS3_01_VFD1_SI0","SI0",null,"PS3_1_EPC1","E-STOP PULLCORD",null,"UL3_09_VFD1",null,null,"PS4_04_VFD1"]
["PS3_01_VFD1","PS3_01_VFD1_SI1","SI1",null,"PS3_1_EPC1_2","E-STOP PULLCORD",null,"UL4_03_FIO1",null,null,"PS4_05_VFD1"]
["PS3_01_VFD1","PS3_01_VFD1_SI2","SI2",null,"PS3_1_EPC2","E-STOP PULLCORD"]
["PS3_01_VFD1","PS3_01_VFD1_SI3","SI3",null,"PS3_1_EPC2_2","E-STOP PULLCORD",null,"UL4_03_VFD1",626,null,"PS4_02_VFD1"]
["PS3_01_VFD1","PS3_01_VFD1_SO0","SO0",null,"PS3_1_BCN1_R","RED BEACON LIGHT",null,"UL4_04_VFD1",null,null,"PS4_03_VFD1"]
["PS3_02_VFD1","PS3_02_VFD1_I0","I0",null,"PS3_2_VFD1_DISC","DISCONNECT AUX",null,"UL4_05_VFD1",null,null,"PS4_04_VFD1"]
["PS3_02_VFD1","PS3_02_VFD1_I1","I1",null,"SPARE",null,null,"UL4_06_VFD1",null,null,"PS4_05_VFD1"]
["PS3_02_VFD1","PS3_02_VFD1_I2","I2",null,"PS3_2_TPE1","TRACKING PHOTOEYE"]
["PS3_02_VFD1","PS3_02_VFD1_I3","I3",null,"SPARE",null,null,"UL4_07_VFD1",627,null,"PS4_02_VFD1"]
["PS3_02_VFD1","PS3_02_VFD1_IO0","IO0",null,"PS3_1_S1_PB","START PUSHBUTTON",null,"UL4_08_VFD1",null,null,"PS4_03_VFD1"]
["PS3_02_VFD1","PS3_02_VFD1_IO1","IO1",null,"PS3_1_S1_PB_LT","START PUSHBUTTON LIGHT",null,"UL4_09_VFD1",null,null,"PS4_04_VFD1"]
["PS3_02_VFD1","PS3_02_VFD1_SI0","SI0",null,"SPARE",null,null,"UL4_10A_VFD1",null,null,"PS4_05_VFD1"]
["PS3_02_VFD1","PS3_02_VFD1_SI1","SI1",null,"SPARE"]
["PS3_02_VFD1","PS3_02_VFD1_SI2","SI2",null,"SPARE",null,null,"UL4_10B_VFD1",628,null,"PS4_02_VFD1"]
["PS3_02_VFD1","PS3_02_VFD1_SI3","SI3",null,"SPARE",null,null,"UL4_11_VFD1",null,null,"PS4_03_VFD1"]
["PS3_02_VFD1","PS3_02_VFD1_SO0","SO0",null,"SPARE",null,null,"UL4_12_VFD1",null,null,"PS4_04_VFD1"]
["PS3_03_VFD1","PS3_03_VFD1_I0","I0",null,"PS3_3_VFD1_DISC","DISCONNECT AUX",null,"UL4_13_VFD1",null,null,"PS4_05_VFD1"]
["PS3_03_VFD1","PS3_03_VFD1_I1","I1",null,"SPARE"]
["PS3_03_VFD1","PS3_03_VFD1_I2","I2",null,"PS3_3_TPE2","TRACKING PHOTOEYE",null,"UL5_03_FIO1",629,null,"PS4_02_VFD1"]
["PS3_03_VFD1","PS3_03_VFD1_I3","I3",null,"SPARE",null,null,"UL5_03_VFD1",null,null,"PS4_03_VFD1"]
["PS3_03_VFD1","PS3_03_VFD1_IO0","IO0",null,"PS3_1_S2_PB","START PUSHBUTTON",null,"UL5_04_VFD1",null,null,"PS4_04_VFD1"]
["PS3_03_VFD1","PS3_03_VFD1_IO1","IO1",null,"PS3_1_S2_PB_LT","START PUSHBUTTON LIGHT",null,"UL5_05_VFD1",null,null,"PS4_05_VFD1"]
["PS3_03_VFD1","PS3_03_VFD1_SI0","SI0",null,"SPARE"]
["PS3_03_VFD1","PS3_03_VFD1_SI1","SI1",null,"SPARE",null,null,"UL5_06_VFD1",630,null,"PS4_02_VFD1"]
["PS3_03_VFD1","PS3_03_VFD1_SI2","SI2",null,"SPARE",null,null,"UL5_07_VFD1",null,null,"PS4_03_VFD1"]
["PS3_03_VFD1","PS3_03_VFD1_SI3","SI3",null,"SPARE",null,null,"UL5_08_VFD1",null,null,"PS4_04_VFD1"]
["PS3_03_VFD1","PS3_03_VFD1_SO0","SO0",null,"PS3_3_BCN1_A","AMBER BEACON LIGHT",null,"UL5_09_VFD1",null,null,"PS4_05_VFD1"]
["PS3_04_VFD1","PS3_04_VFD1_I0","I0",null,"PS3_4_VFD1_DISC","DISCONNECT AUX"]
["PS3_04_VFD1","PS3_04_VFD1_I1","I1",null,"SPARE",null,null,"UL5_10_VFD1",631,null,"PS4_02_VFD1"]
["PS3_04_VFD1","PS3_04_VFD1_I2","I2",null,"SPARE",null,null,"UL6_01_VFD1",null,null,"PS4_03_VFD1"]
["PS3_04_VFD1","PS3_04_VFD1_I3","I3",null,"SPARE",null,null,"UL6_02_FIO1",null,null,"PS4_04_VFD1"]
["PS3_04_VFD1","PS3_04_VFD1_IO0","IO0",null,"PS3_3_JR1_PB","JAM RESET PUSHBUTTON",null,"UL6_02_VFD1",null,null,"PS4_05_VFD1"]
["PS3_04_VFD1","PS3_04_VFD1_IO1","IO1",null,"PS3_3_JR1_PB_LT","JAM RESET PUSHBUTTON LIGHT"]
["PS3_04_VFD1","PS3_04_VFD1_SI0","SI0",null,"SPARE",null,null,"UL6_03_VFD1",632,null,"PS4_02_VFD1"]
["PS3_04_VFD1","PS3_04_VFD1_SI1","SI1",null,"SPARE",null,null,"UL6_04_VFD1",null,null,"PS4_03_VFD1"]
["PS3_04_VFD1","PS3_04_VFD1_SI2","SI2",null,"SPARE",null,null,"UL6_05_VFD1",null,null,"PS4_04_VFD1"]
["PS3_04_VFD1","PS3_04_VFD1_SI3","SI3",null,"SPARE",null,null,"UL6_06_VFD1",null,null,"PS4_05_VFD1"]
["PS3_04_VFD1","PS3_04_VFD1_SO0","SO0",null,"SPARE"]
["PS3_05_VFD1","PS3_05_VFD1_I0","I0",null,"PS3_5_VFD1_DISC","DISCONNECT AUX",null,"UL6_07_VFD1",633,null,"PS4_02_VFD1"]
["PS3_05_VFD1","PS3_05_VFD1_I1","I1",null,"SPARE",null,null,"UL6_08_VFD1",null,null,"PS4_03_VFD1"]
["PS3_05_VFD1","PS3_05_VFD1_I2","I2",null,"PS3_5_TPE1","TRACKING PHOTOEYE",null,"UL6_09_VFD1",null,null,"PS4_04_VFD1"]
["PS3_05_VFD1","PS3_05_VFD1_I3","I3",null,"PS3_5_TPE2","TRACKING PHOTOEYE",null,"UL7_03_FIO1",null,null,"PS4_05_VFD1"]
["PS3_05_VFD1","PS3_05_VFD1_IO0","IO0",null,"SPARE"]
["PS3_05_VFD1","PS3_05_VFD1_IO1","IO1",null,"SPARE",null,null,"UL7_03_VFD1",634,null,"PS4_02_VFD1"]
["PS3_05_VFD1","PS3_05_VFD1_SI0","SI0",null,"SPARE",null,null,"UL7_04_VFD1",null,null,"PS4_03_VFD1"]
["PS3_05_VFD1","PS3_05_VFD1_SI1","SI1",null,"SPARE",null,null,"UL7_05_VFD1",null,null,"PS4_04_VFD1"]
["PS3_05_VFD1","PS3_05_VFD1_SI2","SI2",null,"SPARE",null,null,"UL7_06_VFD1",null,null,"PS4_05_VFD1"]
["PS3_05_VFD1","PS3_05_VFD1_SI3","SI3",null,"SPARE"]
["PS3_05_VFD1","PS3_05_VFD1_SO0","SO0",null,"SPARE",null,null,"UL7_07_VFD1",635,null,"PS4_02_VFD1"]
["PS3_06_VFD1","PS3_06_VFD1_I0","I0",null,"PS3_6_VFD1_DISC","DISCONNECT AUX",null,"UL7_08_VFD1",null,null,"PS4_03_VFD1"]
["PS3_06_VFD1","PS3_06_VFD1_I1","I1",null,"SPARE",null,null,"UL7_09_VFD1",null,null,"PS4_04_VFD1"]
["PS3_06_VFD1","PS3_06_VFD1_I2","I2",null,"PS3_6_TPE1","TRACKING PHOTOEYE",null,"UL7_10A_VFD1",null,null,"PS4_05_VFD1"]
["PS3_06_VFD1","PS3_06_VFD1_I3","I3",null,"SPARE"]
["PS3_06_VFD1","PS3_06_VFD1_IO0","IO0",null,"SPARE",null,null,"UL7_10B_VFD1",636,null,"PS4_02_VFD1"]
["PS3_06_VFD1","PS3_06_VFD1_IO1","IO1",null,"SPARE",null,null,"UL7_11_VFD1",null,null,"PS4_03_VFD1"]
["PS3_06_VFD1","PS3_06_VFD1_SI0","SI0",null,"SPARE",null,null,"UL7_12_VFD1",null,null,"PS4_04_VFD1"]
["PS3_06_VFD1","PS3_06_VFD1_SI1","SI1",null,"SPARE",null,null,"UL7_13_VFD1",null,null,"PS4_05_VFD1"]
["PS3_06_VFD1","PS3_06_VFD1_SI2","SI2",null,"SPARE"]
["PS3_06_VFD1","PS3_06_VFD1_SI3","SI3",null,"SPARE",null,null,"UL8_01_VFD1",637,null,"PS4_02_VFD1"]
["PS3_06_VFD1","PS3_06_VFD1_SO0","SO0",null,"SPARE",null,null,"UL8_02_FIO1",null,null,"PS4_03_VFD1"]
["PS3_07_VFD1","PS3_07_VFD1_I0","I0",null,"PS3_7_VFD1_DISC","DISCONNECT AUX",null,"UL8_02_VFD1",null,null,"PS4_04_VFD1"]
["PS3_07_VFD1","PS3_07_VFD1_I1","I1",null,"SPARE",null,null,"UL8_03_VFD1",null,null,"PS4_05_VFD1"]
["PS3_07_VFD1","PS3_07_VFD1_I2","I2",null,"PS3_7_TPE1","TRACKING PHOTOEYE"]
["PS3_07_VFD1","PS3_07_VFD1_I3","I3",null,"SPARE",null,null,"UL8_04_VFD1",638,null,"PS4_02_VFD1"]
["PS3_07_VFD1","PS3_07_VFD1_IO0","IO0",null,"PS3_7_JR1_PB","JAM RESET PUSHBUTTON",null,"UL8_05_VFD1",null,null,"PS4_03_VFD1"]
["PS3_07_VFD1","PS3_07_VFD1_IO1","IO1",null,"PS3_7_JR1_PB_LT","JAM RESET PUSHBUTTON LIGHT",null,"UL8_06_VFD1",null,null,"PS4_04_VFD1"]
["PS3_07_VFD1","PS3_07_VFD1_SI0","SI0",null,"SPARE",null,null,"UL8_07_VFD1",null,null,"PS4_05_VFD1"]
["PS3_07_VFD1","PS3_07_VFD1_SI1","SI1",null,"SPARE"]
["PS3_07_VFD1","PS3_07_VFD1_SI2","SI2",null,"SPARE",null,null,"UL8_08_VFD1",639,null,"PS4_02_VFD1"]
["PS3_07_VFD1","PS3_07_VFD1_SI3","SI3",null,"SPARE",null,null,"UL8_09_VFD1",null,null,"PS4_03_VFD1"]
["PS3_07_VFD1","PS3_07_VFD1_SO0","SO0",null,"PS3_7_BCN1_A","AMBER BEACON LIGHT",null,"UL9_03_FIO1",null,null,"PS4_04_VFD1"]
["PS3_08_VFD1","PS3_08_VFD1_I0","I0",null,"PS3_8_VFD1_DISC","DISCONNECT AUX",null,"UL9_03_VFD1",null,null,"PS4_05_VFD1"]
["PS3_08_VFD1","PS3_08_VFD1_I1","I1",null,"SPARE"]
["PS3_08_VFD1","PS3_08_VFD1_I2","I2",null,"SPARE",null,null,"UL9_04_VFD1",640,null,"PS4_02_VFD1"]
["PS3_08_VFD1","PS3_08_VFD1_I3","I3",null,"SPARE",null,null,"UL9_05_VFD1",null,null,"PS4_03_VFD1"]
["PS3_08_VFD1","PS3_08_VFD1_IO0","IO0",null,"SPARE",null,null,"UL9_06_VFD1",null,null,"PS4_04_VFD1"]
["PS3_08_VFD1","PS3_08_VFD1_IO1","IO1",null,"SPARE",null,null,"UL9_07_VFD1",null,null,"PS4_05_VFD1"]
["PS3_08_VFD1","PS3_08_VFD1_SI0","SI0",null,"SPARE"]
["PS3_08_VFD1","PS3_08_VFD1_SI1","SI1",null,"SPARE",null,null,"UL9_08_VFD1",641,null,"PS4_02_VFD1"]
["PS3_08_VFD1","PS3_08_VFD1_SI2","SI2",null,"SPARE",null,null,"UL9_09_VFD1",null,null,"PS4_03_VFD1"]
["PS3_08_VFD1","PS3_08_VFD1_SI3","SI3",null,"SPARE",null,null,"UL9_10_VFD1",null,null,"PS4_04_VFD1"]
["PS3_08_VFD1","PS3_08_VFD1_SO0","SO0",null,"SPARE",null,null,"UL9_11_VFD1",null,null,"PS4_05_VFD1"]
["PS3_09_VFD1","PS3_09_VFD1_I0","I0",null,"PS3_9_VFD1_DISC","DISCONNECT AUX"]
["PS3_09_VFD1","PS3_09_VFD1_I1","I1",null,"SPARE"]
["PS3_09_VFD1","PS3_09_VFD1_I2","I2",null,"PS3_9_TPE1","TRACKING PHOTOEYE"]
["PS3_09_VFD1","PS3_09_VFD1_I3","I3",null,"PS3_9_TPE2","TRACKING PHOTOEYE"]
["PS3_09_VFD1","PS3_09_VFD1_IO0","IO0",null,"SPARE"]
["PS3_09_VFD1","PS3_09_VFD1_IO1","IO1",null,"SPARE"]
["PS3_09_VFD1","PS3_09_VFD1_SI0","SI0",null,"SPARE"]
["PS3_09_VFD1","PS3_09_VFD1_SI1","SI1",null,"SPARE"]
["PS3_09_VFD1","PS3_09_VFD1_SI2","SI2",null,"SPARE"]
["PS3_09_VFD1","PS3_09_VFD1_SI3","SI3",null,"SPARE"]
["PS3_09_VFD1","PS3_09_VFD1_SO0","SO0",null,"SPARE"]
["PS3_10_VFD1","PS3_10_VFD1_I0","I0",null,"PS3_10_VFD1_DISC","DISCONNECT AUX"]
["PS3_10_VFD1","PS3_10_VFD1_I1","I1",null,"SPARE"]
["PS3_10_VFD1","PS3_10_VFD1_I2","I2",null,"PS3_10_TPE1","TRACKING PHOTOEYE"]
["PS3_10_VFD1","PS3_10_VFD1_I3","I3",null,"SPARE"]
["PS3_10_VFD1","PS3_10_VFD1_IO0","IO0",null,"PS3_12_S2_PB","START PUSHBUTTON"]
["PS3_10_VFD1","PS3_10_VFD1_IO1","IO1",null,"PS3_12_S2_PB_LT","START PUSHBUTTON LIGHT"]
["PS3_10_VFD1","PS3_10_VFD1_SI0","SI0",null,"SPARE"]
["PS3_10_VFD1","PS3_10_VFD1_SI1","SI1",null,"SPARE"]
["PS3_10_VFD1","PS3_10_VFD1_SI2","SI2",null,"SPARE"]
["PS3_10_VFD1","PS3_10_VFD1_SI3","SI3",null,"SPARE"]
["PS3_10_VFD1","PS3_10_VFD1_SO0","SO0",null,"SPARE"]
["PS3_11_VFD1","PS3_11_VFD1_I0","I0",null,"PS3_11_VFD1_DISC","DISCONNECT AUX"]
["PS3_11_VFD1","PS3_11_VFD1_I1","I1",null,"SPARE"]
["PS3_11_VFD1","PS3_11_VFD1_I2","I2",null,"SPARE"]
["PS3_11_VFD1","PS3_11_VFD1_I3","I3",null,"SPARE"]
["PS3_11_VFD1","PS3_11_VFD1_IO0","IO0",null,"PS3_12_S1_PB","START PUSHBUTTON"]
["PS3_11_VFD1","PS3_11_VFD1_IO1","IO1",null,"PS3_12_S1_PB_LT","START PUSHBUTTON LIGHT"]
["PS3_11_VFD1","PS3_11_VFD1_SI0","SI0",null,"SPARE"]
["PS3_11_VFD1","PS3_11_VFD1_SI1","SI1",null,"SPARE"]
["PS3_11_VFD1","PS3_11_VFD1_SI2","SI2",null,"SPARE"]
["PS3_11_VFD1","PS3_11_VFD1_SI3","SI3",null,"SPARE"]
["PS3_11_VFD1","PS3_11_VFD1_SO0","SO0",null,"SPARE"]
["PS3_12_VFD1","PS3_12_VFD1_I0","I0",null,"PS3_12_VFD1_DISC","DISCONNECT AUX"]
["PS3_12_VFD1","PS3_12_VFD1_I1","I1",null,"SPARE"]
["PS3_12_VFD1","PS3_12_VFD1_I2","I2",null,"PS3_12_TPE1","TRACKING PHOTOEYE"]
["PS3_12_VFD1","PS3_12_VFD1_I3","I3",null,"PS3_12_TPE2","TRACKING PHOTOEYE"]
["PS3_12_VFD1","PS3_12_VFD1_IO0","IO0",null,"PS3_12_BCN2_A","AMBER BEACON LIGHT"]
["PS3_12_VFD1","PS3_12_VFD1_IO1","IO1",null,"PS3_12_BCN2_R","RED BEACON LIGHT"]
["PS3_12_VFD1","PS3_12_VFD1_SI0","SI0",null,"PS3_12_EPC1","E-STOP PULLCORD"]
["PS3_12_VFD1","PS3_12_VFD1_SI1","SI1",null,"PS3_12_EPC1_2","E-STOP PULLCORD"]
["PS3_12_VFD1","PS3_12_VFD1_SI2","SI2",null,"PS3_12_EPC2","E-STOP PULLCORD"]
["PS3_12_VFD1","PS3_12_VFD1_SI3","SI3",null,"PS3_12_EPC2_2","E-STOP PULLCORD"]
["PS3_12_VFD1","PS3_12_VFD1_SO0","SO0",null,"PS3_12_BCN1_R","RED BEACON LIGHT"]
["PS4_01_VFD1","PS4_01_VFD1_I0","I0",null,"PS4_1_VFD1_DISC","DISCONNECT AUX"]
["PS4_01_VFD1","PS4_01_VFD1_I1","I1",null,"SPARE"]
["PS4_01_VFD1","PS4_01_VFD1_I2","I2",null,"SPARE"]
["PS4_01_VFD1","PS4_01_VFD1_I3","I3",null,"SPARE"]
["PS4_01_VFD1","PS4_01_VFD1_IO0","IO0",null,"PS4_1_BCN1_R","RED BEACON LIGHT"]
["PS4_01_VFD1","PS4_01_VFD1_IO1","IO1",null,"PS4_1_BCN2_R","RED BEACON LIGHT"]
["PS4_01_VFD1","PS4_01_VFD1_SI0","SI0",null,"PS4_1_EPC1","E-STOP PULLCORD"]
["PS4_01_VFD1","PS4_01_VFD1_SI1","SI1",null,"PS4_1_EPC1_2","E-STOP PULLCORD"]
["PS4_01_VFD1","PS4_01_VFD1_SI2","SI2",null,"PS4_1_EPC2","E-STOP PULLCORD"]
["PS4_01_VFD1","PS4_01_VFD1_SI3","SI3",null,"PS4_1_EPC2_2","E-STOP PULLCORD"]
["PS4_01_VFD1","PS4_01_VFD1_SO0","SO0",null,"SPARE"]
["PS4_02_VFD1","PS4_02_VFD1_I0","I0",null,"PS4_2_VFD1_DISC","DISCONNECT AUX"]
["PS4_02_VFD1","PS4_02_VFD1_I1","I1",null,"SPARE"]
["PS4_02_VFD1","PS4_02_VFD1_I2","I2",null,"PS4_2_TPE1","TRACKING PHOTOEYE"]
["PS4_02_VFD1","PS4_02_VFD1_I3","I3",null,"PS4_2_TPE2","TRACKING PHOTOEYE"]
["PS4_02_VFD1","PS4_02_VFD1_IO0","IO0",null,"PS4_1_S1_PB","START PUSHBUTTON"]
["PS4_02_VFD1","PS4_02_VFD1_IO1","IO1",null,"PS4_1_S1_PB_LT","START PUSHBUTTON LIGHT"]
["PS4_02_VFD1","PS4_02_VFD1_SI0","SI0",null,"SPARE"]
["PS4_02_VFD1","PS4_02_VFD1_SI1","SI1",null,"SPARE"]
["PS4_02_VFD1","PS4_02_VFD1_SI2","SI2",null,"SPARE"]
["PS4_02_VFD1","PS4_02_VFD1_SI3","SI3",null,"SPARE"]
["PS4_02_VFD1","PS4_02_VFD1_SO0","SO0",null,"PS4_2_BCN1_A","AMBER BEACON LIGHT"]
["PS4_03_VFD1","PS4_03_VFD1_I0","I0",null,"PS4_3_VFD1_DISC","DISCONNECT AUX"]
["PS4_03_VFD1","PS4_03_VFD1_I1","I1",null,"SPARE"]
["PS4_03_VFD1","PS4_03_VFD1_I2","I2",null,"SPARE"]
["PS4_03_VFD1","PS4_03_VFD1_I3","I3",null,"SPARE"]
["PS4_03_VFD1","PS4_03_VFD1_IO0","IO0",null,"PS4_1_S2_PB","START PUSHBUTTON"]
["PS4_03_VFD1","PS4_03_VFD1_IO1","IO1",null,"PS4_1_S2_PB_LT","START PUSHBUTTON LIGHT"]
["PS4_03_VFD1","PS4_03_VFD1_SI0","SI0",null,"SPARE"]
["PS4_03_VFD1","PS4_03_VFD1_SI1","SI1",null,"SPARE"]
["PS4_03_VFD1","PS4_03_VFD1_SI2","SI2",null,"SPARE"]
["PS4_03_VFD1","PS4_03_VFD1_SI3","SI3",null,"SPARE"]
["PS4_03_VFD1","PS4_03_VFD1_SO0","SO0",null,"SPARE"]
["PS4_04_VFD1","PS4_04_VFD1_I0","I0",null,"PS4_4_VFD1_DISC","DISCONNECT AUX"]
["PS4_04_VFD1","PS4_04_VFD1_I1","I1",null,"SPARE"]
["PS4_04_VFD1","PS4_04_VFD1_I2","I2",null,"PS4_4_TPE1","TRACKING PHOTOEYE"]
["PS4_04_VFD1","PS4_04_VFD1_I3","I3",null,"PS4_4_TPE2","TRACKING PHOTOEYE"]
["PS4_04_VFD1","PS4_04_VFD1_IO0","IO0",null,"PS4_2_JR1_PB","JAM RESET PUSHBUTTON"]
["PS4_04_VFD1","PS4_04_VFD1_IO1","IO1",null,"PS4_2_JR1_PB_LT","JAM RESET PUSHBUTTON LIGHT"]
["PS4_04_VFD1","PS4_04_VFD1_SI0","SI0",null,"SPARE"]
["PS4_04_VFD1","PS4_04_VFD1_SI1","SI1",null,"SPARE"]
["PS4_04_VFD1","PS4_04_VFD1_SI2","SI2",null,"SPARE"]
["PS4_04_VFD1","PS4_04_VFD1_SI3","SI3",null,"SPARE"]
["PS4_04_VFD1","PS4_04_VFD1_SO0","SO0",null,"SPARE"]
["PS4_05_VFD1","PS4_05_VFD1_I0","I0",null,"PS4_5_VFD1_DISC","DISCONNECT AUX"]
["PS4_05_VFD1","PS4_05_VFD1_I1","I1",null,"SPARE"]
["PS4_05_VFD1","PS4_05_VFD1_I2","I2",null,"PS4_5_TPE1","TRACKING PHOTOEYE"]
["PS4_05_VFD1","PS4_05_VFD1_I3","I3",null,"SPARE"]
["PS4_05_VFD1","PS4_05_VFD1_IO0","IO0",null,"SPARE"]
["PS4_05_VFD1","PS4_05_VFD1_IO1","IO1",null,"SPARE"]
["PS4_05_VFD1","PS4_05_VFD1_SI0","SI0",null,"SPARE"]
["PS4_05_VFD1","PS4_05_VFD1_SI1","SI1",null,"SPARE"]
["PS4_05_VFD1","PS4_05_VFD1_SI2","SI2",null,"SPARE"]
["PS4_05_VFD1","PS4_05_VFD1_SI3","SI3",null,"SPARE"]
["PS4_05_VFD1","PS4_05_VFD1_SO0","SO0",null,"SPARE"]
["PS4_06_VFD1","PS4_06_VFD1_I0","I0",null,"PS4_6_VFD1_DISC","DISCONNECT AUX"]
["PS4_06_VFD1","PS4_06_VFD1_I1","I1",null,"SPARE"]
["PS4_06_VFD1","PS4_06_VFD1_I2","I2",null,"PS4_6_TPE1","TRACKING PHOTOEYE"]
["PS4_06_VFD1","PS4_06_VFD1_I3","I3",null,"SPARE"]
["PS4_06_VFD1","PS4_06_VFD1_IO0","IO0",null,"SPARE"]
["PS4_06_VFD1","PS4_06_VFD1_IO1","IO1",null,"SPARE"]
["PS4_06_VFD1","PS4_06_VFD1_SI0","SI0",null,"SPARE"]
["PS4_06_VFD1","PS4_06_VFD1_SI1","SI1",null,"SPARE"]
["PS4_06_VFD1","PS4_06_VFD1_SI2","SI2",null,"SPARE"]
["PS4_06_VFD1","PS4_06_VFD1_SI3","SI3",null,"SPARE"]
["PS4_06_VFD1","PS4_06_VFD1_SO0","SO0",null,"SPARE"]
["PS4_07_VFD1","PS4_07_VFD1_I0","I0",null,"PS4_7_VFD1_DISC","DISCONNECT AUX"]
["PS4_07_VFD1","PS4_07_VFD1_I1","I1",null,"SPARE"]
["PS4_07_VFD1","PS4_07_VFD1_I2","I2",null,"PS4_7_TPE1","TRACKING PHOTOEYE"]
["PS4_07_VFD1","PS4_07_VFD1_I3","I3",null,"SPARE"]
["PS4_07_VFD1","PS4_07_VFD1_IO0","IO0",null,"SPARE"]
["PS4_07_VFD1","PS4_07_VFD1_IO1","IO1",null,"SPARE"]
["PS4_07_VFD1","PS4_07_VFD1_SI0","SI0",null,"SPARE"]
["PS4_07_VFD1","PS4_07_VFD1_SI1","SI1",null,"SPARE"]
["PS4_07_VFD1","PS4_07_VFD1_SI2","SI2",null,"SPARE"]
["PS4_07_VFD1","PS4_07_VFD1_SI3","SI3",null,"SPARE"]
["PS4_07_VFD1","PS4_07_VFD1_SO0","SO0",null,"SPARE"]
["PS4_08_VFD1","PS4_08_VFD1_I0","I0",null,"PS4_8_VFD1_DISC","DISCONNECT AUX"]
["PS4_08_VFD1","PS4_08_VFD1_I1","I1",null,"SPARE"]
["PS4_08_VFD1","PS4_08_VFD1_I2","I2",null,"PS4_8_TPE1","TRACKING PHOTOEYE"]
["PS4_08_VFD1","PS4_08_VFD1_I3","I3",null,"SPARE"]
["PS4_08_VFD1","PS4_08_VFD1_IO0","IO0",null,"PS4_8_JR1_PB","JAM RESET PUSHBUTTON"]
["PS4_08_VFD1","PS4_08_VFD1_IO1","IO1",null,"PS4_8_JR1_PB_LT","JAM RESET PUSHBUTTON LIGHT"]
["PS4_08_VFD1","PS4_08_VFD1_SI0","SI0",null,"SPARE"]
["PS4_08_VFD1","PS4_08_VFD1_SI1","SI1",null,"SPARE"]
["PS4_08_VFD1","PS4_08_VFD1_SI2","SI2",null,"SPARE"]
["PS4_08_VFD1","PS4_08_VFD1_SI3","SI3",null,"SPARE"]
["PS4_08_VFD1","PS4_08_VFD1_SO0","SO0",null,"PS4_8_BCN1_A","AMBER BEACON LIGHT"]
["PS4_09_VFD1","PS4_09_VFD1_I0","I0",null,"PS4_9_VFD1_DISC","DISCONNECT AUX"]
["PS4_09_VFD1","PS4_09_VFD1_I1","I1",null,"SPARE"]
["PS4_09_VFD1","PS4_09_VFD1_I2","I2",null,"SPARE"]
["PS4_09_VFD1","PS4_09_VFD1_I3","I3",null,"SPARE"]
["PS4_09_VFD1","PS4_09_VFD1_IO0","IO0",null,"SPARE"]
["PS4_09_VFD1","PS4_09_VFD1_IO1","IO1",null,"SPARE"]
["PS4_09_VFD1","PS4_09_VFD1_SI0","SI0",null,"SPARE"]
["PS4_09_VFD1","PS4_09_VFD1_SI1","SI1",null,"SPARE"]
["PS4_09_VFD1","PS4_09_VFD1_SI2","SI2",null,"SPARE"]
["PS4_09_VFD1","PS4_09_VFD1_SI3","SI3",null,"SPARE"]
["PS4_09_VFD1","PS4_09_VFD1_SO0","SO0",null,"SPARE"]
["PS4_10_VFD1","PS4_10_VFD1_I0","I0",null,"PS4_10_VFD1_DISC","DISCONNECT AUX"]
["PS4_10_VFD1","PS4_10_VFD1_I1","I1",null,"SPARE"]
["PS4_10_VFD1","PS4_10_VFD1_I2","I2",null,"PS4_10_TPE1","TRACKING PHOTOEYE"]
["PS4_10_VFD1","PS4_10_VFD1_I3","I3",null,"PS4_10_TPE2","TRACKING PHOTOEYE"]
["PS4_10_VFD1","PS4_10_VFD1_IO0","IO0",null,"SPARE"]
["PS4_10_VFD1","PS4_10_VFD1_IO1","IO1",null,"SPARE"]
["PS4_10_VFD1","PS4_10_VFD1_SI0","SI0",null,"SPARE"]
["PS4_10_VFD1","PS4_10_VFD1_SI1","SI1",null,"SPARE"]
["PS4_10_VFD1","PS4_10_VFD1_SI2","SI2",null,"SPARE"]
["PS4_10_VFD1","PS4_10_VFD1_SI3","SI3",null,"SPARE"]
["PS4_10_VFD1","PS4_10_VFD1_SO0","SO0",null,"SPARE"]
["PS4_11_VFD1","PS4_11_VFD1_I0","I0",null,"PS4_11_VFD1_DISC","DISCONNECT AUX"]
["PS4_11_VFD1","PS4_11_VFD1_I1","I1",null,"SPARE"]
["PS4_11_VFD1","PS4_11_VFD1_I2","I2",null,"PS4_11_TPE1","TRACKING PHOTOEYE"]
["PS4_11_VFD1","PS4_11_VFD1_I3","I3",null,"SPARE"]
["PS4_11_VFD1","PS4_11_VFD1_IO0","IO0",null,"PS4_14_S2_PB","START PUSHBUTTON"]
["PS4_11_VFD1","PS4_11_VFD1_IO1","IO1",null,"PS4_14_S2_PB_LT","START PUSHBUTTON LIGHT"]
["PS4_11_VFD1","PS4_11_VFD1_SI0","SI0",null,"SPARE"]
["PS4_11_VFD1","PS4_11_VFD1_SI1","SI1",null,"SPARE"]
["PS4_11_VFD1","PS4_11_VFD1_SI2","SI2",null,"SPARE"]
["PS4_11_VFD1","PS4_11_VFD1_SI3","SI3",null,"SPARE"]
["PS4_11_VFD1","PS4_11_VFD1_SO0","SO0",null,"SPARE"]
["PS4_12_VFD1","PS4_12_VFD1_I0","I0",null,"PS4_12_VFD1_DISC","DISCONNECT AUX"]
["PS4_12_VFD1","PS4_12_VFD1_I1","I1",null,"SPARE"]
["PS4_12_VFD1","PS4_12_VFD1_I2","I2",null,"PS4_12_TPE1","TRACKING PHOTOEYE"]
["PS4_12_VFD1","PS4_12_VFD1_I3","I3",null,"SPARE"]
["PS4_12_VFD1","PS4_12_VFD1_IO0","IO0",null,"PS4_14_S1_PB","START PUSHBUTTON"]
["PS4_12_VFD1","PS4_12_VFD1_IO1","IO1",null,"PS4_14_S1_PB_LT","START PUSHBUTTON LIGHT"]
["PS4_12_VFD1","PS4_12_VFD1_SI0","SI0",null,"SPARE"]
["PS4_12_VFD1","PS4_12_VFD1_SI1","SI1",null,"SPARE"]
["PS4_12_VFD1","PS4_12_VFD1_SI2","SI2",null,"SPARE"]
["PS4_12_VFD1","PS4_12_VFD1_SI3","SI3",null,"SPARE"]
["PS4_12_VFD1","PS4_12_VFD1_SO0","SO0",null,"SPARE"]
["PS4_13_VFD1","PS4_13_VFD1_I0","I0",null,"PS4_13_VFD1_DISC","DISCONNECT AUX"]
["PS4_13_VFD1","PS4_13_VFD1_I1","I1",null,"SPARE"]
["PS4_13_VFD1","PS4_13_VFD1_I2","I2",null,"SPARE"]
["PS4_13_VFD1","PS4_13_VFD1_I3","I3",null,"SPARE"]
["PS4_13_VFD1","PS4_13_VFD1_IO0","IO0",null,"PS4_13_JR1_PB","JAM RESET PUSHBUTTON"]
["PS4_13_VFD1","PS4_13_VFD1_IO1","IO1",null,"PS4_13_JR1_PB_LT","JAM RESET PUSHBUTTON LIGHT"]
["PS4_13_VFD1","PS4_13_VFD1_SI0","SI0",null,"SPARE"]
["PS4_13_VFD1","PS4_13_VFD1_SI1","SI1",null,"SPARE"]
["PS4_13_VFD1","PS4_13_VFD1_SI2","SI2",null,"SPARE"]
["PS4_13_VFD1","PS4_13_VFD1_SI3","SI3",null,"SPARE"]
["PS4_13_VFD1","PS4_13_VFD1_SO0","SO0",null,"PS4_13_BCN1_A","AMBER BEACON LIGHT"]
["PS4_14_VFD1","PS4_14_VFD1_I0","I0",null,"PS4_14_VFD1_DISC","DISCONNECT AUX"]
["PS4_14_VFD1","PS4_14_VFD1_I1","I1",null,"SPARE"]
["PS4_14_VFD1","PS4_14_VFD1_I2","I2",null,"PS4_14_TPE1","TRACKING PHOTOEYE"]
["PS4_14_VFD1","PS4_14_VFD1_I3","I3",null,"SPARE"]
["PS4_14_VFD1","PS4_14_VFD1_IO0","IO0",null,"PS4_14_BCN1_A","AMBER BEACON LIGHT"]
["PS4_14_VFD1","PS4_14_VFD1_IO1","IO1",null,"PS4_14_BCN1_R","RED BEACON LIGHT"]
["PS4_14_VFD1","PS4_14_VFD1_SI0","SI0",null,"PS4_14_EPC1","E-STOP PULLCORD"]
["PS4_14_VFD1","PS4_14_VFD1_SI1","SI1",null,"PS4_14_EPC1_2","E-STOP PULLCORD"]
["PS4_14_VFD1","PS4_14_VFD1_SI2","SI2",null,"PS4_14_EPC2","E-STOP PULLCORD"]
["PS4_14_VFD1","PS4_14_VFD1_SI3","SI3",null,"PS4_14_EPC2_2","E-STOP PULLCORD"]
["PS4_14_VFD1","PS4_14_VFD1_SO0","SO0",null,"PS4_14_BCN2_R","RED BEACON LIGHT"]
["UL1_03_FIO1","UL1_03_FIO1_IO00","IO00",null,"UL1_3_BCN1_R","RED BEACON LIGHT"]
["UL1_03_FIO1","UL1_03_FIO1_IO01","IO01",null,"SPARE"]
["UL1_03_FIO1","UL1_03_FIO1_IO02","IO02",null,"UL1_3_BCN2_R","RED BEACON LIGHT"]
["UL1_03_FIO1","UL1_03_FIO1_IO03","IO03",null,"SPARE"]
["UL1_03_FIO1","UL1_03_FIO1_IO04","IO04",null,"UL1_3_LPE1","LASEREYE"]
["UL1_03_FIO1","UL1_03_FIO1_IO05","IO05",null,"SPARE"]
["UL1_03_FIO1","UL1_03_FIO1_IO06","IO06",null,"UL1_3_LPE2","LASEREYE"]
["UL1_03_FIO1","UL1_03_FIO1_IO07","IO07",null,"SPARE"]
["UL1_03_FIO1","UL1_03_FIO1_IO08","IO08",null,"UL1_3_S1_PB","START PUSHBUTTON"]
["UL1_03_FIO1","UL1_03_FIO1_IO09","IO09",null,"UL1_3_S1_PB_LT","START PUSHBUTTON LIGHT"]
["UL1_03_FIO1","UL1_03_FIO1_IO10","IO10",null,"UL1_3_S2_PB","START PUSHBUTTON"]
["UL1_03_FIO1","UL1_03_FIO1_IO11","IO11",null,"UL1_3_S2_PB_LT","START PUSHBUTTON LIGHT"]
["UL1_03_FIO1","UL1_03_FIO1_IO12","IO12",null,"SPARE"]
["UL1_03_FIO1","UL1_03_FIO1_IO13","IO13",null,"SPARE"]
["UL1_03_FIO1","UL1_03_FIO1_IO14","IO14",null,"SPARE"]
["UL1_03_FIO1","UL1_03_FIO1_IO15","IO15",null,"SPARE"]
["UL1_03_VFD1","UL1_03_VFD1_I0","I0",null,"UL1_3_VFD1_DISC","DISCONNECT AUX"]
["UL1_03_VFD1","UL1_03_VFD1_I1","I1",null,"UL1_3_ENC1","ENCODER"]
["UL1_03_VFD1","UL1_03_VFD1_I2","I2",null,"UL1_3_TPE1","TRACKING PHOTOEYE"]
["UL1_03_VFD1","UL1_03_VFD1_I3","I3",null,"UL1_3_TPE2","TRACKING PHOTOEYE"]
["UL1_03_VFD1","UL1_03_VFD1_IO0","IO0",null,"SPARE"]
["UL1_03_VFD1","UL1_03_VFD1_IO1","IO1",null,"SPARE"]
["UL1_03_VFD1","UL1_03_VFD1_SI0","SI0",null,"UL1_3_EPC1","E-STOP PULLCORD"]
["UL1_03_VFD1","UL1_03_VFD1_SI1","SI1",null,"UL1_3_EPC1_2","E-STOP PULLCORD"]
["UL1_03_VFD1","UL1_03_VFD1_SI2","SI2",null,"UL1_3_EPC2","E-STOP PULLCORD"]
["UL1_03_VFD1","UL1_03_VFD1_SI3","SI3",null,"UL1_3_EPC2_2","E-STOP PULLCORD"]
["UL1_03_VFD1","UL1_03_VFD1_SO0","SO0",null,"SPARE"]
["UL1_04_VFD1","UL1_04_VFD1_I0","I0",null,"UL1_4_VFD1_DISC","DISCONNECT AUX"]
["UL1_04_VFD1","UL1_04_VFD1_I1","I1",null,"UL1_4_ENC1","ENCODER"]
["UL1_04_VFD1","UL1_04_VFD1_I2","I2",null,"UL1_4_TPE1","TRACKING PHOTOEYE"]
["UL1_04_VFD1","UL1_04_VFD1_I3","I3",null,"SPARE"]
["UL1_04_VFD1","UL1_04_VFD1_IO0","IO0",null,"UL1_4_S1_PB","START PUSHBUTTON"]
["UL1_04_VFD1","UL1_04_VFD1_IO1","IO1",null,"UL1_4_S1_PB_LT","START PUSHBUTTON LIGHT"]
["UL1_04_VFD1","UL1_04_VFD1_SI0","SI0",null,"UL1_4_EPC1","E-STOP PULLCORD"]
["UL1_04_VFD1","UL1_04_VFD1_SI1","SI1",null,"UL1_4_EPC1_2","E-STOP PULLCORD"]
["UL1_04_VFD1","UL1_04_VFD1_SI2","SI2",null,"UL1_4_EPC2","E-STOP PULLCORD"]
["UL1_04_VFD1","UL1_04_VFD1_SI3","SI3",null,"UL1_4_EPC2_2","E-STOP PULLCORD"]
["UL1_04_VFD1","UL1_04_VFD1_SO0","SO0",null,"SPARE"]
["UL1_05_VFD1","UL1_05_VFD1_I0","I0",null,"UL1_5_VFD1_DISC","DISCONNECT AUX"]
["UL1_05_VFD1","UL1_05_VFD1_I1","I1",null,"UL1_5_ENC1","ENCODER"]
["UL1_05_VFD1","UL1_05_VFD1_I2","I2",null,"UL1_5_TPE1","TRACKING PHOTOEYE"]
["UL1_05_VFD1","UL1_05_VFD1_I3","I3",null,"SPARE"]
["UL1_05_VFD1","UL1_05_VFD1_IO0","IO0",null,"UL1_4_S2_PB","START PUSHBUTTON"]
["UL1_05_VFD1","UL1_05_VFD1_IO1","IO1",null,"UL1_4_S2_PB_LT","START PUSHBUTTON LIGHT"]
["UL1_05_VFD1","UL1_05_VFD1_SI0","SI0",null,"SPARE"]
["UL1_05_VFD1","UL1_05_VFD1_SI1","SI1",null,"SPARE"]
["UL1_05_VFD1","UL1_05_VFD1_SI2","SI2",null,"SPARE"]
["UL1_05_VFD1","UL1_05_VFD1_SI3","SI3",null,"SPARE"]
["UL1_05_VFD1","UL1_05_VFD1_SO0","SO0",null,"SPARE"]
["UL1_06_VFD1","UL1_06_VFD1_I0","I0",null,"UL1_6_VFD1_DISC","DISCONNECT AUX"]
["UL1_06_VFD1","UL1_06_VFD1_I1","I1",null,"UL1_6_ENC1","ENCODER"]
["UL1_06_VFD1","UL1_06_VFD1_I2","I2",null,"UL1_6_TPE1","TRACKING PHOTOEYE"]
["UL1_06_VFD1","UL1_06_VFD1_I3","I3",null,"SPARE"]
["UL1_06_VFD1","UL1_06_VFD1_IO0","IO0",null,"UL1_4_BCN1_R","RED BEACON LIGHT"]
["UL1_06_VFD1","UL1_06_VFD1_IO1","IO1",null,"UL1_4_BCN2_R","RED BEACON LIGHT"]
["UL1_06_VFD1","UL1_06_VFD1_SI0","SI0",null,"SPARE"]
["UL1_06_VFD1","UL1_06_VFD1_SI1","SI1",null,"SPARE"]
["UL1_06_VFD1","UL1_06_VFD1_SI2","SI2",null,"SPARE"]
["UL1_06_VFD1","UL1_06_VFD1_SI3","SI3",null,"SPARE"]
["UL1_06_VFD1","UL1_06_VFD1_SO0","SO0",null,"SPARE"]
["UL1_07_VFD1","UL1_07_VFD1_I0","I0",null,"UL1_7_VFD1_DISC","DISCONNECT AUX"]
["UL1_07_VFD1","UL1_07_VFD1_I1","I1",null,"UL1_7_ENC1","ENCODER"]
["UL1_07_VFD1","UL1_07_VFD1_I2","I2",null,"UL1_7_TPE1","TRACKING PHOTOEYE"]
["UL1_07_VFD1","UL1_07_VFD1_I3","I3",null,"SPARE"]
["UL1_07_VFD1","UL1_07_VFD1_IO0","IO0",null,"UL1_9_S1_PB","START PUSHBUTTON"]
["UL1_07_VFD1","UL1_07_VFD1_IO1","IO1",null,"UL1_9_S1_PB_LT","START PUSHBUTTON LIGHT"]
["UL1_07_VFD1","UL1_07_VFD1_SI0","SI0",null,"SPARE"]
["UL1_07_VFD1","UL1_07_VFD1_SI1","SI1",null,"SPARE"]
["UL1_07_VFD1","UL1_07_VFD1_SI2","SI2",null,"SPARE"]
["UL1_07_VFD1","UL1_07_VFD1_SI3","SI3",null,"SPARE"]
["UL1_07_VFD1","UL1_07_VFD1_SO0","SO0",null,"SPARE"]
["UL1_08_VFD1","UL1_08_VFD1_I0","I0",null,"UL1_8_VFD1_DISC","DISCONNECT AUX"]
["UL1_08_VFD1","UL1_08_VFD1_I1","I1",null,"UL1_8_ENC1","ENCODER"]
["UL1_08_VFD1","UL1_08_VFD1_I2","I2",null,"UL1_8_TPE1","TRACKING PHOTOEYE"]
["UL1_08_VFD1","UL1_08_VFD1_I3","I3",null,"SPARE"]
["UL1_08_VFD1","UL1_08_VFD1_IO0","IO0",null,"UL1_9_JR1_PB","JAM RESET PUSHBUTTON"]
["UL1_08_VFD1","UL1_08_VFD1_IO1","IO1",null,"UL1_9_JR1_PB_LT","JAM RESET PUSHBUTTON LIGHT"]
["UL1_08_VFD1","UL1_08_VFD1_SI0","SI0",null,"SPARE"]
["UL1_08_VFD1","UL1_08_VFD1_SI1","SI1",null,"SPARE"]
["UL1_08_VFD1","UL1_08_VFD1_SI2","SI2",null,"SPARE"]
["UL1_08_VFD1","UL1_08_VFD1_SI3","SI3",null,"SPARE"]
["UL1_08_VFD1","UL1_08_VFD1_SO0","SO0",null,"SPARE"]
["UL1_09_VFD1","UL1_09_VFD1_I0","I0",null,"UL1_9_VFD1_DISC","DISCONNECT AUX"]
["UL1_09_VFD1","UL1_09_VFD1_I1","I1",null,"UL1_9_ENC1","ENCODER"]
["UL1_09_VFD1","UL1_09_VFD1_I2","I2",null,"UL1_9_TPE1","TRACKING PHOTOEYE"]
["UL1_09_VFD1","UL1_09_VFD1_I3","I3",null,"UL1_9_TPE2","TRACKING PHOTOEYE"]
["UL1_09_VFD1","UL1_09_VFD1_IO0","IO0",null,"UL1_9_BCN1_R","RED BEACON LIGHT"]
["UL1_09_VFD1","UL1_09_VFD1_IO1","IO1",null,"UL1_9_BCN1_A","AMBER BEACON LIGHT"]
["UL1_09_VFD1","UL1_09_VFD1_SI0","SI0",null,"UL1_9_EPC1","E-STOP PULLCORD"]
["UL1_09_VFD1","UL1_09_VFD1_SI1","SI1",null,"UL1_9_EPC1_2","E-STOP PULLCORD"]
["UL1_09_VFD1","UL1_09_VFD1_SI2","SI2",null,"UL1_9_EPC2","E-STOP PULLCORD"]
["UL1_09_VFD1","UL1_09_VFD1_SI3","SI3",null,"UL1_9_EPC2_2","E-STOP PULLCORD"]
["UL1_09_VFD1","UL1_09_VFD1_SO0","SO0",null,"UL1_9_BCN2_R","RED BEACON LIGHT"]
["UL1_10A_VFD1","UL1_10A_VFD1_I0","I0",null,"UL1_10A_VFD1_DISC","DISCONNECT AUX"]
["UL1_10A_VFD1","UL1_10A_VFD1_I1","I1",null,"UL1_9_TPE3","TRACKING PHOTOEYE"]
["UL1_10A_VFD1","UL1_10A_VFD1_I2","I2",null,"UL1_9_TPE4","TRACKING PHOTOEYE"]
["UL1_10A_VFD1","UL1_10A_VFD1_I3","I3",null,"UL1_9_TPE5","TRACKING PHOTOEYE"]
["UL1_10A_VFD1","UL1_10A_VFD1_IO0","IO0",null,"UL1_9_S2_PB","START PUSHBUTTON"]
["UL1_10A_VFD1","UL1_10A_VFD1_IO1","IO1",null,"UL1_9_S2_PB_LT","START PUSHBUTTON LIGHT"]
["UL1_10A_VFD1","UL1_10A_VFD1_SI0","SI0",null,"SPARE"]
["UL1_10A_VFD1","UL1_10A_VFD1_SI1","SI1",null,"SPARE"]
["UL1_10A_VFD1","UL1_10A_VFD1_SI2","SI2",null,"SPARE"]
["UL1_10A_VFD1","UL1_10A_VFD1_SI3","SI3",null,"SPARE"]
["UL1_10A_VFD1","UL1_10A_VFD1_SO0","SO0",null,"SPARE"]
["UL1_10B_VFD1","UL1_10B_VFD1_I0","I0",null,"UL1_10B_VFD1_DISC","DISCONNECT AUX"]
["UL1_10B_VFD1","UL1_10B_VFD1_I1","I1",null,"SPARE"]
["UL1_10B_VFD1","UL1_10B_VFD1_I2","I2",null,"SPARE"]
["UL1_10B_VFD1","UL1_10B_VFD1_I3","I3",null,"SPARE"]
["UL1_10B_VFD1","UL1_10B_VFD1_IO0","IO0",null,"SPARE"]
["UL1_10B_VFD1","UL1_10B_VFD1_IO1","IO1",null,"SPARE"]
["UL1_10B_VFD1","UL1_10B_VFD1_SI0","SI0",null,"SPARE"]
["UL1_10B_VFD1","UL1_10B_VFD1_SI1","SI1",null,"SPARE"]
["UL1_10B_VFD1","UL1_10B_VFD1_SI2","SI2",null,"SPARE"]
["UL1_10B_VFD1","UL1_10B_VFD1_SI3","SI3",null,"SPARE"]
["UL1_10B_VFD1","UL1_10B_VFD1_SO0","SO0",null,"SPARE"]
["UL1_11_VFD1","UL1_11_VFD1_I0","I0",null,"UL1_11_VFD1_DISC","DISCONNECT AUX"]
["UL1_11_VFD1","UL1_11_VFD1_I1","I1",null,"SPARE"]
["UL1_11_VFD1","UL1_11_VFD1_I2","I2",null,"UL1_11_TPE1","TRACKING PHOTOEYE"]
["UL1_11_VFD1","UL1_11_VFD1_I3","I3",null,"UL1_11_TPE2","TRACKING PHOTOEYE"]
["UL1_11_VFD1","UL1_11_VFD1_IO0","IO0",null,"SPARE"]
["UL1_11_VFD1","UL1_11_VFD1_IO1","IO1",null,"SPARE"]
["UL1_11_VFD1","UL1_11_VFD1_SI0","SI0",null,"SPARE"]
["UL1_11_VFD1","UL1_11_VFD1_SI1","SI1",null,"SPARE"]
["UL1_11_VFD1","UL1_11_VFD1_SI2","SI2",null,"SPARE"]
["UL1_11_VFD1","UL1_11_VFD1_SI3","SI3",null,"SPARE"]
["UL1_11_VFD1","UL1_11_VFD1_SO0","SO0",null,"SPARE"]
["UL1_12_VFD1","UL1_12_VFD1_I0","I0",null,"UL1_12_VFD1_DISC","DISCONNECT AUX"]
["UL1_12_VFD1","UL1_12_VFD1_I1","I1",null,"SPARE"]
["UL1_12_VFD1","UL1_12_VFD1_I2","I2",null,"UL1_12_TPE1","TRACKING PHOTOEYE"]
["UL1_12_VFD1","UL1_12_VFD1_I3","I3",null,"SPARE"]
["UL1_12_VFD1","UL1_12_VFD1_IO0","IO0",null,"SPARE"]
["UL1_12_VFD1","UL1_12_VFD1_IO1","IO1",null,"SPARE"]
["UL1_12_VFD1","UL1_12_VFD1_SI0","SI0",null,"SPARE"]
["UL1_12_VFD1","UL1_12_VFD1_SI1","SI1",null,"SPARE"]
["UL1_12_VFD1","UL1_12_VFD1_SI2","SI2",null,"SPARE"]
["UL1_12_VFD1","UL1_12_VFD1_SI3","SI3",null,"SPARE"]
["UL1_12_VFD1","UL1_12_VFD1_SO0","SO0",null,"SPARE"]
["UL1_13_VFD1","UL1_13_VFD1_I0","I0",null,"UL1_13_VFD1_DISC","DISCONNECT AUX"]
["UL1_13_VFD1","UL1_13_VFD1_I1","I1",null,"SPARE"]
["UL1_13_VFD1","UL1_13_VFD1_I2","I2",null,"SPARE"]
["UL1_13_VFD1","UL1_13_VFD1_I3","I3",null,"SPARE"]
["UL1_13_VFD1","UL1_13_VFD1_IO0","IO0",null,"SPARE"]
["UL1_13_VFD1","UL1_13_VFD1_IO1","IO1",null,"SPARE"]
["UL1_13_VFD1","UL1_13_VFD1_SI0","SI0",null,"SPARE"]
["UL1_13_VFD1","UL1_13_VFD1_SI1","SI1",null,"SPARE"]
["UL1_13_VFD1","UL1_13_VFD1_SI2","SI2",null,"SPARE"]
["UL1_13_VFD1","UL1_13_VFD1_SI3","SI3",null,"SPARE"]
["UL1_13_VFD1","UL1_13_VFD1_SO0","SO0",null,"SPARE"]
["UL10_01_VFD1","UL10_01_VFD1_I0","I0",null,"UL10_1_VFD1_DISC","DISCONNECT AUX"]
["UL10_01_VFD1","UL10_01_VFD1_I1","I1",null,"SPARE"]
["UL10_01_VFD1","UL10_01_VFD1_I2","I2",null,"UL10_1_TPE1","TRACKING PHOTOEYE"]
["UL10_01_VFD1","UL10_01_VFD1_I3","I3",null,"SPARE"]
["UL10_01_VFD1","UL10_01_VFD1_IO0","IO0",null,"SPARE"]
["UL10_01_VFD1","UL10_01_VFD1_IO1","IO1",null,"SPARE"]
["UL10_01_VFD1","UL10_01_VFD1_SI0","SI0",null,"UL10_1_EPC1","E-STOP PULLCORD"]
["UL10_01_VFD1","UL10_01_VFD1_SI1","SI1",null,"UL10_1_EPC1_2","E-STOP PULLCORD"]
["UL10_01_VFD1","UL10_01_VFD1_SI2","SI2",null,"UL10_1_EPC2","E-STOP PULLCORD"]
["UL10_01_VFD1","UL10_01_VFD1_SI3","SI3",null,"UL10_1_EPC2_2","E-STOP PULLCORD"]
["UL10_01_VFD1","UL10_01_VFD1_SO0","SO0",null,"SPARE"]
["UL10_02_FIO1","UL10_02_FIO1_IO00","IO00",null,"UL10_1_BCN1_R","RED BEACON LIGHT"]
["UL10_02_FIO1","UL10_02_FIO1_IO01","IO01",null,"SPARE"]
["UL10_02_FIO1","UL10_02_FIO1_IO02","IO02",null,"UL10_1_BCN2_R","RED BEACON LIGHT"]
["UL10_02_FIO1","UL10_02_FIO1_IO03","IO03",null,"SPARE"]
["UL10_02_FIO1","UL10_02_FIO1_IO04","IO04",null,"UL10_1_SS1_SPB","SS STATION START PUSHBUTTON"]
["UL10_02_FIO1","UL10_02_FIO1_IO05","IO05",null,"SPARE"]
["UL10_02_FIO1","UL10_02_FIO1_IO06","IO06",null,"UL10_1_SS1_STPB","SS STATION STOP PUSHBUTTON"]
["UL10_02_FIO1","UL10_02_FIO1_IO07","IO07",null,"UL10_1_SS1_STPB_LT","SS STATION STOP PUSHBUTTON LIGHT"]
["UL10_02_FIO1","UL10_02_FIO1_IO08","IO08",null,"UL10_2_LPE1","LASEREYE"]
["UL10_02_FIO1","UL10_02_FIO1_IO09","IO09",null,"SPARE"]
["UL10_02_FIO1","UL10_02_FIO1_IO10","IO10",null,"UL10_2_LPE2","LASEREYE"]
["UL10_02_FIO1","UL10_02_FIO1_IO11","IO11",null,"SPARE"]
["UL10_02_FIO1","UL10_02_FIO1_IO12","IO12",null,"SPARE"]
["UL10_02_FIO1","UL10_02_FIO1_IO13","IO13",null,"SPARE"]
["UL10_02_FIO1","UL10_02_FIO1_IO14","IO14",null,"SPARE"]
["UL10_02_FIO1","UL10_02_FIO1_IO15","IO15",null,"SPARE"]
["UL10_02_VFD1","UL10_02_VFD1_I0","I0",null,"UL10_2_VFD1_DISC","DISCONNECT AUX"]
["UL10_02_VFD1","UL10_02_VFD1_I1","I1",null,"SPARE"]
["UL10_02_VFD1","UL10_02_VFD1_I2","I2",null,"UL10_2_TPE1","TRACKING PHOTOEYE"]
["UL10_02_VFD1","UL10_02_VFD1_I3","I3",null,"UL10_2_TPE2","TRACKING PHOTOEYE"]
["UL10_02_VFD1","UL10_02_VFD1_IO0","IO0",null,"SPARE"]
["UL10_02_VFD1","UL10_02_VFD1_IO1","IO1",null,"SPARE"]
["UL10_02_VFD1","UL10_02_VFD1_SI0","SI0",null,"SPARE"]
["UL10_02_VFD1","UL10_02_VFD1_SI1","SI1",null,"SPARE"]
["UL10_02_VFD1","UL10_02_VFD1_SI2","SI2",null,"SPARE"]
["UL10_02_VFD1","UL10_02_VFD1_SI3","SI3",null,"SPARE"]
["UL10_02_VFD1","UL10_02_VFD1_SO0","SO0",null,"SPARE"]
["UL10_03_VFD1","UL10_03_VFD1_I0","I0",null,"UL10_3_VFD1_DISC","DISCONNECT AUX"]
["UL10_03_VFD1","UL10_03_VFD1_I1","I1",null,"SPARE"]
["UL10_03_VFD1","UL10_03_VFD1_I2","I2",null,"UL10_3_TPE1","TRACKING PHOTOEYE"]
["UL10_03_VFD1","UL10_03_VFD1_I3","I3",null,"SPARE"]
["UL10_03_VFD1","UL10_03_VFD1_IO0","IO0",null,"UL10_3_BCN1_R","RED BEACON LIGHT"]
["UL10_03_VFD1","UL10_03_VFD1_IO1","IO1",null,"UL10_3_BCN2_R","RED BEACON LIGHT"]
["UL10_03_VFD1","UL10_03_VFD1_SI0","SI0",null,"UL10_3_EPC1","E-STOP PULLCORD"]
["UL10_03_VFD1","UL10_03_VFD1_SI1","SI1",null,"UL10_3_EPC1_2","E-STOP PULLCORD"]
["UL10_03_VFD1","UL10_03_VFD1_SI2","SI2",null,"UL10_3_EPC2","E-STOP PULLCORD"]
["UL10_03_VFD1","UL10_03_VFD1_SI3","SI3",null,"UL10_3_EPC2_2","E-STOP PULLCORD"]
["UL10_03_VFD1","UL10_03_VFD1_SO0","SO0",null,"SPARE"]
["UL10_04_VFD1","UL10_04_VFD1_I0","I0",null,"UL10_4_VFD1_DISC","DISCONNECT AUX"]
["UL10_04_VFD1","UL10_04_VFD1_I1","I1",null,"UL10_4_ENC1","ENCODER"]
["UL10_04_VFD1","UL10_04_VFD1_I2","I2",null,"UL10_4_TPE1","TRACKING PHOTOEYE"]
["UL10_04_VFD1","UL10_04_VFD1_I3","I3",null,"SPARE"]
["UL10_04_VFD1","UL10_04_VFD1_IO0","IO0",null,"UL10_3_S1_PB","START PUSHBUTTON"]
["UL10_04_VFD1","UL10_04_VFD1_IO1","IO1",null,"UL10_3_S1_PB_LT","START PUSHBUTTON LIGHT"]
["UL10_04_VFD1","UL10_04_VFD1_SI0","SI0",null,"SPARE"]
["UL10_04_VFD1","UL10_04_VFD1_SI1","SI1",null,"SPARE"]
["UL10_04_VFD1","UL10_04_VFD1_SI2","SI2",null,"SPARE"]
["UL10_04_VFD1","UL10_04_VFD1_SI3","SI3",null,"SPARE"]
["UL10_04_VFD1","UL10_04_VFD1_SO0","SO0",null,"SPARE"]
["UL10_05_VFD1","UL10_05_VFD1_I0","I0",null,"UL10_5_VFD1_DISC","DISCONNECT AUX"]
["UL10_05_VFD1","UL10_05_VFD1_I1","I1",null,"UL10_5_ENC1","ENCODER"]
["UL10_05_VFD1","UL10_05_VFD1_I2","I2",null,"UL10_5_TPE1","TRACKING PHOTOEYE"]
["UL10_05_VFD1","UL10_05_VFD1_I3","I3",null,"SPARE"]
["UL10_05_VFD1","UL10_05_VFD1_IO0","IO0",null,"UL10_3_S2_PB","START PUSHBUTTON"]
["UL10_05_VFD1","UL10_05_VFD1_IO1","IO1",null,"UL10_3_S2_PB_LT","START PUSHBUTTON LIGHT"]
["UL10_05_VFD1","UL10_05_VFD1_SI0","SI0",null,"SPARE"]
["UL10_05_VFD1","UL10_05_VFD1_SI1","SI1",null,"SPARE"]
["UL10_05_VFD1","UL10_05_VFD1_SI2","SI2",null,"SPARE"]
["UL10_05_VFD1","UL10_05_VFD1_SI3","SI3",null,"SPARE"]
["UL10_05_VFD1","UL10_05_VFD1_SO0","SO0",null,"SPARE"]
["UL10_06_VFD1","UL10_06_VFD1_I0","I0",null,"UL10_6_VFD1_DISC","DISCONNECT AUX"]
["UL10_06_VFD1","UL10_06_VFD1_I1","I1",null,"UL10_6_ENC1","ENCODER"]
["UL10_06_VFD1","UL10_06_VFD1_I2","I2",null,"UL10_6_TPE1","TRACKING PHOTOEYE"]
["UL10_06_VFD1","UL10_06_VFD1_I3","I3",null,"SPARE"]
["UL10_06_VFD1","UL10_06_VFD1_IO0","IO0",null,"SPARE"]
["UL10_06_VFD1","UL10_06_VFD1_IO1","IO1",null,"SPARE"]
["UL10_06_VFD1","UL10_06_VFD1_SI0","SI0",null,"SPARE"]
["UL10_06_VFD1","UL10_06_VFD1_SI1","SI1",null,"SPARE"]
["UL10_06_VFD1","UL10_06_VFD1_SI2","SI2",null,"SPARE"]
["UL10_06_VFD1","UL10_06_VFD1_SI3","SI3",null,"SPARE"]
["UL10_06_VFD1","UL10_06_VFD1_SO0","SO0",null,"SPARE"]
["UL10_07_VFD1","UL10_07_VFD1_I0","I0",null,"UL10_7_VFD1_DISC","DISCONNECT AUX"]
["UL10_07_VFD1","UL10_07_VFD1_I1","I1",null,"UL10_7_ENC1","ENCODER"]
["UL10_07_VFD1","UL10_07_VFD1_I2","I2",null,"UL10_7_TPE1","TRACKING PHOTOEYE"]
["UL10_07_VFD1","UL10_07_VFD1_I3","I3",null,"SPARE"]
["UL10_07_VFD1","UL10_07_VFD1_IO0","IO0",null,"SPARE"]
["UL10_07_VFD1","UL10_07_VFD1_IO1","IO1",null,"SPARE"]
["UL10_07_VFD1","UL10_07_VFD1_SI0","SI0",null,"SPARE"]
["UL10_07_VFD1","UL10_07_VFD1_SI1","SI1",null,"SPARE"]
["UL10_07_VFD1","UL10_07_VFD1_SI2","SI2",null,"SPARE"]
["UL10_07_VFD1","UL10_07_VFD1_SI3","SI3",null,"SPARE"]
["UL10_07_VFD1","UL10_07_VFD1_SO0","SO0",null,"SPARE"]
["UL10_08_VFD1","UL10_08_VFD1_I0","I0",null,"UL10_8_VFD1_DISC","DISCONNECT AUX"]
["UL10_08_VFD1","UL10_08_VFD1_I1","I1",null,"UL10_8_ENC1","ENCODER"]
["UL10_08_VFD1","UL10_08_VFD1_I2","I2",null,"SPARE"]
["UL10_08_VFD1","UL10_08_VFD1_I3","I3",null,"SPARE"]
["UL10_08_VFD1","UL10_08_VFD1_IO0","IO0",null,"SPARE"]
["UL10_08_VFD1","UL10_08_VFD1_IO1","IO1",null,"SPARE"]
["UL10_08_VFD1","UL10_08_VFD1_SI0","SI0",null,"SPARE"]
["UL10_08_VFD1","UL10_08_VFD1_SI1","SI1",null,"SPARE"]
["UL10_08_VFD1","UL10_08_VFD1_SI2","SI2",null,"SPARE"]
["UL10_08_VFD1","UL10_08_VFD1_SI3","SI3",null,"SPARE"]
["UL10_08_VFD1","UL10_08_VFD1_SO0","SO0",null,"SPARE"]
["UL10_09_VFD1","UL10_09_VFD1_I0","I0",null,"UL10_9_VFD1_DISC","DISCONNECT AUX"]
["UL10_09_VFD1","UL10_09_VFD1_I1","I1",null,"UL10_9_ENC1","ENCODER"]
["UL10_09_VFD1","UL10_09_VFD1_I2","I2",null,"UL10_9_TPE1","TRACKING PHOTOEYE"]
["UL10_09_VFD1","UL10_09_VFD1_I3","I3",null,"UL10_9_TPE2","TRACKING PHOTOEYE"]
["UL10_09_VFD1","UL10_09_VFD1_IO0","IO0",null,"SPARE"]
["UL10_09_VFD1","UL10_09_VFD1_IO1","IO1",null,"SPARE"]
["UL10_09_VFD1","UL10_09_VFD1_SI0","SI0",null,"SPARE"]
["UL10_09_VFD1","UL10_09_VFD1_SI1","SI1",null,"SPARE"]
["UL10_09_VFD1","UL10_09_VFD1_SI2","SI2",null,"SPARE"]
["UL10_09_VFD1","UL10_09_VFD1_SI3","SI3",null,"SPARE"]
["UL10_09_VFD1","UL10_09_VFD1_SO0","SO0",null,"SPARE"]
["UL10_10_VFD1","UL10_10_VFD1_I0","I0",null,"UL10_10_VFD1_DISC","DISCONNECT AUX"]
["UL10_10_VFD1","UL10_10_VFD1_I1","I1",null,"SPARE"]
["UL10_10_VFD1","UL10_10_VFD1_I2","I2",null,"SPARE"]
["UL10_10_VFD1","UL10_10_VFD1_I3","I3",null,"SPARE"]
["UL10_10_VFD1","UL10_10_VFD1_IO0","IO0",null,"UL1_9_JR2_PB","JAM RESET PUSHBUTTON"]
["UL10_10_VFD1","UL10_10_VFD1_IO1","IO1",null,"UL1_9_JR2_PB_LT","JAM RESET PUSHBUTTON LIGHT"]
["UL10_10_VFD1","UL10_10_VFD1_SI0","SI0",null,"SPARE"]
["UL10_10_VFD1","UL10_10_VFD1_SI1","SI1",null,"SPARE"]
["UL10_10_VFD1","UL10_10_VFD1_SI2","SI2",null,"SPARE"]
["UL10_10_VFD1","UL10_10_VFD1_SI3","SI3",null,"SPARE"]
["UL10_10_VFD1","UL10_10_VFD1_SO0","SO0",null,"SPARE"]
["UL11_03_FIO1","UL11_03_FIO1_IO00","IO00",null,"UL11_3_BCN1_R","RED BEACON LIGHT"]
["UL11_03_FIO1","UL11_03_FIO1_IO01","IO01",null,"SPARE"]
["UL11_03_FIO1","UL11_03_FIO1_IO02","IO02",null,"UL11_3_BCN2_R","RED BEACON LIGHT"]
["UL11_03_FIO1","UL11_03_FIO1_IO03","IO03",null,"SPARE"]
["UL11_03_FIO1","UL11_03_FIO1_IO04","IO04",null,"UL11_3_LPE1","LASEREYE"]
["UL11_03_FIO1","UL11_03_FIO1_IO05","IO05",null,"SPARE"]
["UL11_03_FIO1","UL11_03_FIO1_IO06","IO06",null,"UL11_3_LPE2","LASEREYE"]
["UL11_03_FIO1","UL11_03_FIO1_IO07","IO07",null,"SPARE"]
["UL11_03_FIO1","UL11_03_FIO1_IO08","IO08",null,"UL11_3_S1_PB","START PUSHBUTTON"]
["UL11_03_FIO1","UL11_03_FIO1_IO09","IO09",null,"UL11_3_S1_PB_LT","START PUSHBUTTON LIGHT"]
["UL11_03_FIO1","UL11_03_FIO1_IO10","IO10",null,"UL11_3_S2_PB","START PUSHBUTTON"]
["UL11_03_FIO1","UL11_03_FIO1_IO11","IO11",null,"UL11_3_S2_PB_LT","START PUSHBUTTON LIGHT"]
["UL11_03_FIO1","UL11_03_FIO1_IO12","IO12",null,"SPARE"]
["UL11_03_FIO1","UL11_03_FIO1_IO13","IO13",null,"SPARE"]
["UL11_03_FIO1","UL11_03_FIO1_IO14","IO14",null,"SPARE"]
["UL11_03_FIO1","UL11_03_FIO1_IO15","IO15",null,"SPARE"]
["UL11_03_VFD1","UL11_03_VFD1_I0","I0",null,"UL11_3_VFD1_DISC","DISCONNECT AUX"]
["UL11_03_VFD1","UL11_03_VFD1_I1","I1",null,"UL11_3_ENC1","ENCODER"]
["UL11_03_VFD1","UL11_03_VFD1_I2","I2",null,"UL11_3_TPE1","TRACKING PHOTOEYE"]
["UL11_03_VFD1","UL11_03_VFD1_I3","I3",null,"UL11_3_TPE2","TRACKING PHOTOEYE"]
["UL11_03_VFD1","UL11_03_VFD1_IO0","IO0",null,"SPARE"]
["UL11_03_VFD1","UL11_03_VFD1_IO1","IO1",null,"SPARE"]
["UL11_03_VFD1","UL11_03_VFD1_SI0","SI0",null,"UL11_3_EPC1","E-STOP PULLCORD"]
["UL11_03_VFD1","UL11_03_VFD1_SI1","SI1",null,"UL11_3_EPC1_2","E-STOP PULLCORD"]
["UL11_03_VFD1","UL11_03_VFD1_SI2","SI2",null,"UL11_3_EPC2","E-STOP PULLCORD"]
["UL11_03_VFD1","UL11_03_VFD1_SI3","SI3",null,"UL11_3_EPC2_2","E-STOP PULLCORD"]
["UL11_03_VFD1","UL11_03_VFD1_SO0","SO0",null,"SPARE"]
["UL11_04_VFD1","UL11_04_VFD1_I0","I0",null,"UL11_4_VFD1_DISC","DISCONNECT AUX"]
["UL11_04_VFD1","UL11_04_VFD1_I1","I1",null,"SPARE"]
["UL11_04_VFD1","UL11_04_VFD1_I2","I2",null,"UL11_4_TPE1","TRACKING PHOTOEYE"]
["UL11_04_VFD1","UL11_04_VFD1_I3","I3",null,"SPARE"]
["UL11_04_VFD1","UL11_04_VFD1_IO0","IO0",null,"UL11_4_BCN1_R","RED BEACON LIGHT"]
["UL11_04_VFD1","UL11_04_VFD1_IO1","IO1",null,"UL11_4_BCN2_R","RED BEACON LIGHT"]
["UL11_04_VFD1","UL11_04_VFD1_SI0","SI0",null,"UL11_4_EPC1","E-STOP PULLCORD"]
["UL11_04_VFD1","UL11_04_VFD1_SI1","SI1",null,"UL11_4_EPC1_2","E-STOP PULLCORD"]
["UL11_04_VFD1","UL11_04_VFD1_SI2","SI2",null,"UL11_4_EPC2","E-STOP PULLCORD"]
["UL11_04_VFD1","UL11_04_VFD1_SI3","SI3",null,"UL11_4_EPC2_2","E-STOP PULLCORD"]
["UL11_04_VFD1","UL11_04_VFD1_SO0","SO0",null,"SPARE"]
["UL11_05_VFD1","UL11_05_VFD1_I0","I0",null,"UL11_5_VFD1_DISC","DISCONNECT AUX"]
["UL11_05_VFD1","UL11_05_VFD1_I1","I1",null,"UL11_5_ENC1","ENCODER"]
["UL11_05_VFD1","UL11_05_VFD1_I2","I2",null,"UL11_5_TPE1","TRACKING PHOTOEYE"]
["UL11_05_VFD1","UL11_05_VFD1_I3","I3",null,"SPARE"]
["UL11_05_VFD1","UL11_05_VFD1_IO0","IO0",null,"UL11_4_S1_PB","START PUSHBUTTON"]
["UL11_05_VFD1","UL11_05_VFD1_IO1","IO1",null,"UL11_4_S1_PB_LT","START PUSHBUTTON LIGHT"]
["UL11_05_VFD1","UL11_05_VFD1_SI0","SI0",null,"SPARE"]
["UL11_05_VFD1","UL11_05_VFD1_SI1","SI1",null,"SPARE"]
["UL11_05_VFD1","UL11_05_VFD1_SI2","SI2",null,"SPARE"]
["UL11_05_VFD1","UL11_05_VFD1_SI3","SI3",null,"SPARE"]
["UL11_05_VFD1","UL11_05_VFD1_SO0","SO0",null,"SPARE"]
["UL11_06_VFD1","UL11_06_VFD1_I0","I0",null,"UL11_6_VFD1_DISC","DISCONNECT AUX"]
["UL11_06_VFD1","UL11_06_VFD1_I1","I1",null,"UL11_6_ENC1","ENCODER"]
["UL11_06_VFD1","UL11_06_VFD1_I2","I2",null,"UL11_6_TPE1","TRACKING PHOTOEYE"]
["UL11_06_VFD1","UL11_06_VFD1_I3","I3",null,"SPARE"]
["UL11_06_VFD1","UL11_06_VFD1_IO0","IO0",null,"UL11_4_S2_PB","START PUSHBUTTON"]
["UL11_06_VFD1","UL11_06_VFD1_IO1","IO1",null,"UL11_4_S2_PB_LT","START PUSHBUTTON LIGHT"]
["UL11_06_VFD1","UL11_06_VFD1_SI0","SI0",null,"SPARE"]
["UL11_06_VFD1","UL11_06_VFD1_SI1","SI1",null,"SPARE"]
["UL11_06_VFD1","UL11_06_VFD1_SI2","SI2",null,"SPARE"]
["UL11_06_VFD1","UL11_06_VFD1_SI3","SI3",null,"SPARE"]
["UL11_06_VFD1","UL11_06_VFD1_SO0","SO0",null,"SPARE"]
["UL11_07_VFD1","UL11_07_VFD1_I0","I0",null,"UL11_7_VFD1_DISC","DISCONNECT AUX"]
["UL11_07_VFD1","UL11_07_VFD1_I1","I1",null,"UL11_7_ENC1","ENCODER"]
["UL11_07_VFD1","UL11_07_VFD1_I2","I2",null,"UL11_7_TPE1","TRACKING PHOTOEYE"]
["UL11_07_VFD1","UL11_07_VFD1_I3","I3",null,"SPARE"]
["UL11_07_VFD1","UL11_07_VFD1_IO0","IO0",null,"SPARE"]
["UL11_07_VFD1","UL11_07_VFD1_IO1","IO1",null,"SPARE"]
["UL11_07_VFD1","UL11_07_VFD1_SI0","SI0",null,"SPARE"]
["UL11_07_VFD1","UL11_07_VFD1_SI1","SI1",null,"SPARE"]
["UL11_07_VFD1","UL11_07_VFD1_SI2","SI2",null,"SPARE"]
["UL11_07_VFD1","UL11_07_VFD1_SI3","SI3",null,"SPARE"]
["UL11_07_VFD1","UL11_07_VFD1_SO0","SO0",null,"SPARE"]
["UL11_08_VFD1","UL11_08_VFD1_I0","I0",null,"UL11_8_VFD1_DISC","DISCONNECT AUX"]
["UL11_08_VFD1","UL11_08_VFD1_I1","I1",null,"UL11_8_ENC1","ENCODER"]
["UL11_08_VFD1","UL11_08_VFD1_I2","I2",null,"UL11_8_TPE1","TRACKING PHOTOEYE"]
["UL11_08_VFD1","UL11_08_VFD1_I3","I3",null,"UL11_9_TPE3","TRACKING PHOTOEYE"]
["UL11_08_VFD1","UL11_08_VFD1_IO0","IO0",null,"SPARE"]
["UL11_08_VFD1","UL11_08_VFD1_IO1","IO1",null,"SPARE"]
["UL11_08_VFD1","UL11_08_VFD1_SI0","SI0",null,"SPARE"]
["UL11_08_VFD1","UL11_08_VFD1_SI1","SI1",null,"SPARE"]
["UL11_08_VFD1","UL11_08_VFD1_SI2","SI2",null,"SPARE"]
["UL11_08_VFD1","UL11_08_VFD1_SI3","SI3",null,"SPARE"]
["UL11_08_VFD1","UL11_08_VFD1_SO0","SO0",null,"SPARE"]
["UL11_09_VFD1","UL11_09_VFD1_I0","I0",null,"UL11_9_VFD1_DISC","DISCONNECT AUX"]
["UL11_09_VFD1","UL11_09_VFD1_I1","I1",null,"UL11_9_ENC1","ENCODER"]
["UL11_09_VFD1","UL11_09_VFD1_I2","I2",null,"UL11_9_TPE1","TRACKING PHOTOEYE"]
["UL11_09_VFD1","UL11_09_VFD1_I3","I3",null,"UL11_9_TPE2","TRACKING PHOTOEYE"]
["UL11_09_VFD1","UL11_09_VFD1_IO0","IO0",null,"UL11_9_BCN1_A","AMBER BEACON LIGHT"]
["UL11_09_VFD1","UL11_09_VFD1_IO1","IO1",null,"UL11_9_BCN1_R","RED BEACON LIGHT"]
["UL11_09_VFD1","UL11_09_VFD1_SI0","SI0",null,"UL11_9_EPC1","E-STOP PULLCORD"]
["UL11_09_VFD1","UL11_09_VFD1_SI1","SI1",null,"UL11_9_EPC1_2","E-STOP PULLCORD"]
["UL11_09_VFD1","UL11_09_VFD1_SI2","SI2",null,"SPARE"]
["UL11_09_VFD1","UL11_09_VFD1_SI3","SI3",null,"SPARE"]
["UL11_09_VFD1","UL11_09_VFD1_SO0","SO0",null,"SPARE"]
["UL11_10_VFD1","UL11_10_VFD1_I0","I0",null,"UL11_10_VFD1_DISC","DISCONNECT AUX"]
["UL11_10_VFD1","UL11_10_VFD1_I1","I1",null,"UL11_10_ENC1","ENCODER"]
["UL11_10_VFD1","UL11_10_VFD1_I2","I2",null,"UL11_10_TPE1","TRACKING PHOTOEYE"]
["UL11_10_VFD1","UL11_10_VFD1_I3","I3",null,"UL11_10_TPE2","TRACKING PHOTOEYE"]
["UL11_10_VFD1","UL11_10_VFD1_IO0","IO0",null,"UL11_10_S1_PB","START PUSHBUTTON"]
["UL11_10_VFD1","UL11_10_VFD1_IO1","IO1",null,"UL11_10_S1_PB_LT","START PUSHBUTTON LIGHT"]
["UL11_10_VFD1","UL11_10_VFD1_SI0","SI0",null,"UL11_10_EPC1","E-STOP PULLCORD"]
["UL11_10_VFD1","UL11_10_VFD1_SI1","SI1",null,"UL11_10_EPC1_2","E-STOP PULLCORD"]
["UL11_10_VFD1","UL11_10_VFD1_SI2","SI2",null,"SPARE"]
["UL11_10_VFD1","UL11_10_VFD1_SI3","SI3",null,"SPARE"]
["UL11_10_VFD1","UL11_10_VFD1_SO0","SO0",null,"UL11_10_BCN1_R","RED BEACON LIGHT"]
["UL11_11A_VFD1","UL11_11A_VFD1_I0","I0",null,"UL11_11A_VFD1_DISC","DISCONNECT AUX"]
["UL11_11A_VFD1","UL11_11A_VFD1_I1","I1",null,"SPARE"]
["UL11_11A_VFD1","UL11_11A_VFD1_I2","I2",null,"SPARE"]
["UL11_11A_VFD1","UL11_11A_VFD1_I3","I3",null,"SPARE"]
["UL11_11A_VFD1","UL11_11A_VFD1_IO0","IO0",null,"UL11_9_S1_PB","START PUSHBUTTON"]
["UL11_11A_VFD1","UL11_11A_VFD1_IO1","IO1",null,"UL11_9_S1_PB_LT","START PUSHBUTTON LIGHT"]
["UL11_11A_VFD1","UL11_11A_VFD1_SI0","SI0",null,"SPARE"]
["UL11_11A_VFD1","UL11_11A_VFD1_SI1","SI1",null,"SPARE"]
["UL11_11A_VFD1","UL11_11A_VFD1_SI2","SI2",null,"SPARE"]
["UL11_11A_VFD1","UL11_11A_VFD1_SI3","SI3",null,"SPARE"]
["UL11_11A_VFD1","UL11_11A_VFD1_SO0","SO0",null,"SPARE"]
["UL11_11B_VFD1","UL11_11B_VFD1_I0","I0",null,"UL11_11B_VFD1_DISC","DISCONNECT AUX"]
["UL11_11B_VFD1","UL11_11B_VFD1_I1","I1",null,"SPARE"]
["UL11_11B_VFD1","UL11_11B_VFD1_I2","I2",null,"SPARE"]
["UL11_11B_VFD1","UL11_11B_VFD1_I3","I3",null,"SPARE"]
["UL11_11B_VFD1","UL11_11B_VFD1_IO0","IO0",null,"UL11_9_JR1_PB","JAM RESET PUSHBUTTON"]
["UL11_11B_VFD1","UL11_11B_VFD1_IO1","IO1",null,"UL11_9_JR1_PB_LT","JAM RESET PUSHBUTTON LIGHT"]
["UL11_11B_VFD1","UL11_11B_VFD1_SI0","SI0",null,"SPARE"]
["UL11_11B_VFD1","UL11_11B_VFD1_SI1","SI1",null,"SPARE"]
["UL11_11B_VFD1","UL11_11B_VFD1_SI2","SI2",null,"SPARE"]
["UL11_11B_VFD1","UL11_11B_VFD1_SI3","SI3",null,"SPARE"]
["UL11_11B_VFD1","UL11_11B_VFD1_SO0","SO0",null,"SPARE"]
["UL11_12_VFD1","UL11_12_VFD1_I0","I0",null,"UL11_12_VFD1_DISC","DISCONNECT AUX"]
["UL11_12_VFD1","UL11_12_VFD1_I1","I1",null,"UL11_12_ENC1","ENCODER"]
["UL11_12_VFD1","UL11_12_VFD1_I2","I2",null,"UL11_12_TPE1","TRACKING PHOTOEYE"]
["UL11_12_VFD1","UL11_12_VFD1_I3","I3",null,"UL11_12_TPE2","TRACKING PHOTOEYE"]
["UL11_12_VFD1","UL11_12_VFD1_IO0","IO0",null,"SPARE"]
["UL11_12_VFD1","UL11_12_VFD1_IO1","IO1",null,"SPARE"]
["UL11_12_VFD1","UL11_12_VFD1_SI0","SI0",null,"SPARE"]
["UL11_12_VFD1","UL11_12_VFD1_SI1","SI1",null,"SPARE"]
["UL11_12_VFD1","UL11_12_VFD1_SI2","SI2",null,"SPARE"]
["UL11_12_VFD1","UL11_12_VFD1_SI3","SI3",null,"SPARE"]
["UL11_12_VFD1","UL11_12_VFD1_SO0","SO0",null,"SPARE"]
["UL11_13_VFD1","UL11_13_VFD1_I0","I0",null,"UL11_13_VFD1_DISC","DISCONNECT AUX"]
["UL11_13_VFD1","UL11_13_VFD1_I1","I1",null,"UL11_13_ENC1","ENCODER"]
["UL11_13_VFD1","UL11_13_VFD1_I2","I2",null,"UL11_13_TPE1","TRACKING PHOTOEYE"]
["UL11_13_VFD1","UL11_13_VFD1_I3","I3",null,"SPARE"]
["UL11_13_VFD1","UL11_13_VFD1_IO0","IO0",null,"SPARE"]
["UL11_13_VFD1","UL11_13_VFD1_IO1","IO1",null,"SPARE"]
["UL11_13_VFD1","UL11_13_VFD1_SI0","SI0",null,"SPARE"]
["UL11_13_VFD1","UL11_13_VFD1_SI1","SI1",null,"SPARE"]
["UL11_13_VFD1","UL11_13_VFD1_SI2","SI2",null,"SPARE"]
["UL11_13_VFD1","UL11_13_VFD1_SI3","SI3",null,"SPARE"]
["UL11_13_VFD1","UL11_13_VFD1_SO0","SO0",null,"SPARE"]
["UL11_14_VFD1","UL11_14_VFD1_I0","I0",null,"UL11_14_VFD1_DISC","DISCONNECT AUX"]
["UL11_14_VFD1","UL11_14_VFD1_I1","I1",null,"SPARE"]
["UL11_14_VFD1","UL11_14_VFD1_I2","I2",null,"UL11_14_TPE1","TRACKING PHOTOEYE"]
["UL11_14_VFD1","UL11_14_VFD1_I3","I3",null,"SPARE"]
["UL11_14_VFD1","UL11_14_VFD1_IO0","IO0",null,"SPARE"]
["UL11_14_VFD1","UL11_14_VFD1_IO1","IO1",null,"SPARE"]
["UL11_14_VFD1","UL11_14_VFD1_SI0","SI0",null,"SPARE"]
["UL11_14_VFD1","UL11_14_VFD1_SI1","SI1",null,"SPARE"]
["UL11_14_VFD1","UL11_14_VFD1_SI2","SI2",null,"SPARE"]
["UL11_14_VFD1","UL11_14_VFD1_SI3","SI3",null,"SPARE"]
["UL11_14_VFD1","UL11_14_VFD1_SO0","SO0",null,"SPARE"]
["UL12_03_FIO1","UL12_03_FIO1_IO00","IO00",null,"UL12_3_BCN1_R","RED BEACON LIGHT"]
["UL12_03_FIO1","UL12_03_FIO1_IO01","IO01",null,"SPARE"]
["UL12_03_FIO1","UL12_03_FIO1_IO02","IO02",null,"UL12_3_BCN2_R","RED BEACON LIGHT"]
["UL12_03_FIO1","UL12_03_FIO1_IO03","IO03",null,"SPARE"]
["UL12_03_FIO1","UL12_03_FIO1_IO04","IO04",null,"UL12_3_LPE1","LASEREYE"]
["UL12_03_FIO1","UL12_03_FIO1_IO05","IO05",null,"SPARE"]
["UL12_03_FIO1","UL12_03_FIO1_IO06","IO06",null,"UL12_3_LPE2","LASEREYE"]
["UL12_03_FIO1","UL12_03_FIO1_IO07","IO07",null,"SPARE"]
["UL12_03_FIO1","UL12_03_FIO1_IO08","IO08",null,"UL12_3_S1_PB","START PUSHBUTTON"]
["UL12_03_FIO1","UL12_03_FIO1_IO09","IO09",null,"UL12_3_S1_PB_LT","START PUSHBUTTON LIGHT"]
["UL12_03_FIO1","UL12_03_FIO1_IO10","IO10",null,"UL12_3_S2_PB","START PUSHBUTTON"]
["UL12_03_FIO1","UL12_03_FIO1_IO11","IO11",null,"UL12_3_S2_PB_LT","START PUSHBUTTON LIGHT"]
["UL12_03_FIO1","UL12_03_FIO1_IO12","IO12",null,"SPARE"]
["UL12_03_FIO1","UL12_03_FIO1_IO13","IO13",null,"SPARE"]
["UL12_03_FIO1","UL12_03_FIO1_IO14","IO14",null,"SPARE"]
["UL12_03_FIO1","UL12_03_FIO1_IO15","IO15",null,"SPARE"]
["UL12_03_VFD1","UL12_03_VFD1_I0","I0",null,"UL12_3_VFD1_DISC","DISCONNECT AUX"]
["UL12_03_VFD1","UL12_03_VFD1_I1","I1",null,"UL12_3_ENC1","ENCODER"]
["UL12_03_VFD1","UL12_03_VFD1_I2","I2",null,"UL12_3_TPE1","TRACKING PHOTOEYE"]
["UL12_03_VFD1","UL12_03_VFD1_I3","I3",null,"UL12_3_TPE2","TRACKING PHOTOEYE"]
["UL12_03_VFD1","UL12_03_VFD1_IO0","IO0",null,"SPARE"]
["UL12_03_VFD1","UL12_03_VFD1_IO1","IO1",null,"SPARE"]
["UL12_03_VFD1","UL12_03_VFD1_SI0","SI0",null,"UL12_3_EPC1","E-STOP PULLCORD"]
["UL12_03_VFD1","UL12_03_VFD1_SI1","SI1",null,"UL12_3_EPC1_2","E-STOP PULLCORD"]
["UL12_03_VFD1","UL12_03_VFD1_SI2","SI2",null,"UL12_3_EPC2","E-STOP PULLCORD"]
["UL12_03_VFD1","UL12_03_VFD1_SI3","SI3",null,"UL12_3_EPC2_2","E-STOP PULLCORD"]
["UL12_03_VFD1","UL12_03_VFD1_SO0","SO0",null,"SPARE"]
["UL12_04_VFD1","UL12_04_VFD1_I0","I0",null,"UL12_4_VFD1_DISC","DISCONNECT AUX"]
["UL12_04_VFD1","UL12_04_VFD1_I1","I1",null,"UL12_4_ENC1","ENCODER"]
["UL12_04_VFD1","UL12_04_VFD1_I2","I2",null,"UL12_4_TPE1","TRACKING PHOTOEYE"]
["UL12_04_VFD1","UL12_04_VFD1_I3","I3",null,"SPARE"]
["UL12_04_VFD1","UL12_04_VFD1_IO0","IO0",null,"UL12_4_BCN1_R","RED BEACON LIGHT"]
["UL12_04_VFD1","UL12_04_VFD1_IO1","IO1",null,"UL12_4_BCN2_R","RED BEACON LIGHT"]
["UL12_04_VFD1","UL12_04_VFD1_SI0","SI0",null,"UL12_4_EPC1","E-STOP PULLCORD"]
["UL12_04_VFD1","UL12_04_VFD1_SI1","SI1",null,"UL12_4_EPC1_2","E-STOP PULLCORD"]
["UL12_04_VFD1","UL12_04_VFD1_SI2","SI2",null,"UL12_4_EPC2","E-STOP PULLCORD"]
["UL12_04_VFD1","UL12_04_VFD1_SI3","SI3",null,"UL12_4_EPC2_2","E-STOP PULLCORD"]
["UL12_04_VFD1","UL12_04_VFD1_SO0","SO0",null,"SPARE"]
["UL12_05_VFD1","UL12_05_VFD1_I0","I0",null,"UL12_5_VFD1_DISC","DISCONNECT AUX"]
["UL12_05_VFD1","UL12_05_VFD1_I1","I1",null,"UL12_5_ENC1","ENCODER"]
["UL12_05_VFD1","UL12_05_VFD1_I2","I2",null,"SPARE"]
["UL12_05_VFD1","UL12_05_VFD1_I3","I3",null,"SPARE"]
["UL12_05_VFD1","UL12_05_VFD1_IO0","IO0",null,"UL12_4_S1_PB","START PUSHBUTTON"]
["UL12_05_VFD1","UL12_05_VFD1_IO1","IO1",null,"UL12_4_S1_PB_LT","START PUSHBUTTON LIGHT"]
["UL12_05_VFD1","UL12_05_VFD1_SI0","SI0",null,"SPARE"]
["UL12_05_VFD1","UL12_05_VFD1_SI1","SI1",null,"SPARE"]
["UL12_05_VFD1","UL12_05_VFD1_SI2","SI2",null,"SPARE"]
["UL12_05_VFD1","UL12_05_VFD1_SI3","SI3",null,"SPARE"]
["UL12_05_VFD1","UL12_05_VFD1_SO0","SO0",null,"SPARE"]
["UL12_06_VFD1","UL12_06_VFD1_I0","I0",null,"UL12_6_VFD1_DISC","DISCONNECT AUX"]
["UL12_06_VFD1","UL12_06_VFD1_I1","I1",null,"UL12_6_ENC1","ENCODER"]
["UL12_06_VFD1","UL12_06_VFD1_I2","I2",null,"UL12_6_TPE1","TRACKING PHOTOEYE"]
["UL12_06_VFD1","UL12_06_VFD1_I3","I3",null,"UL12_6_TPE2","TRACKING PHOTOEYE"]
["UL12_06_VFD1","UL12_06_VFD1_IO0","IO0",null,"UL12_4_S2_PB","START PUSHBUTTON"]
["UL12_06_VFD1","UL12_06_VFD1_IO1","IO1",null,"UL12_4_S2_PB_LT","START PUSHBUTTON LIGHT"]
["UL12_06_VFD1","UL12_06_VFD1_SI0","SI0",null,"SPARE"]
["UL12_06_VFD1","UL12_06_VFD1_SI1","SI1",null,"SPARE"]
["UL12_06_VFD1","UL12_06_VFD1_SI2","SI2",null,"SPARE"]
["UL12_06_VFD1","UL12_06_VFD1_SI3","SI3",null,"SPARE"]
["UL12_06_VFD1","UL12_06_VFD1_SO0","SO0",null,"SPARE"]
["UL12_07_VFD1","UL12_07_VFD1_I0","I0",null,"UL12_7_VFD1_DISC","DISCONNECT AUX"]
["UL12_07_VFD1","UL12_07_VFD1_I1","I1",null,"UL12_7_ENC1","ENCODER"]
["UL12_07_VFD1","UL12_07_VFD1_I2","I2",null,"UL12_7_TPE1","TRACKING PHOTOEYE"]
["UL12_07_VFD1","UL12_07_VFD1_I3","I3",null,"SPARE"]
["UL12_07_VFD1","UL12_07_VFD1_IO0","IO0",null,"SPARE"]
["UL12_07_VFD1","UL12_07_VFD1_IO1","IO1",null,"SPARE"]
["UL12_07_VFD1","UL12_07_VFD1_SI0","SI0",null,"SPARE"]
["UL12_07_VFD1","UL12_07_VFD1_SI1","SI1",null,"SPARE"]
["UL12_07_VFD1","UL12_07_VFD1_SI2","SI2",null,"SPARE"]
["UL12_07_VFD1","UL12_07_VFD1_SI3","SI3",null,"SPARE"]
["UL12_07_VFD1","UL12_07_VFD1_SO0","SO0",null,"SPARE"]
["UL12_08_VFD1","UL12_08_VFD1_I0","I0",null,"UL12_8_VFD1_DISC","DISCONNECT AUX"]
["UL12_08_VFD1","UL12_08_VFD1_I1","I1",null,"UL12_8_ENC1","ENCODER"]
["UL12_08_VFD1","UL12_08_VFD1_I2","I2",null,"UL12_8_TPE1","TRACKING PHOTOEYE"]
["UL12_08_VFD1","UL12_08_VFD1_I3","I3",null,"SPARE"]
["UL12_08_VFD1","UL12_08_VFD1_IO0","IO0",null,"SPARE"]
["UL12_08_VFD1","UL12_08_VFD1_IO1","IO1",null,"SPARE"]
["UL12_08_VFD1","UL12_08_VFD1_SI0","SI0",null,"SPARE"]
["UL12_08_VFD1","UL12_08_VFD1_SI1","SI1",null,"SPARE"]
["UL12_08_VFD1","UL12_08_VFD1_SI2","SI2",null,"SPARE"]
["UL12_08_VFD1","UL12_08_VFD1_SI3","SI3",null,"SPARE"]
["UL12_08_VFD1","UL12_08_VFD1_SO0","SO0",null,"SPARE"]
["UL12_09_VFD1","UL12_09_VFD1_I0","I0",null,"UL12_9_VFD1_DISC","DISCONNECT AUX"]
["UL12_09_VFD1","UL12_09_VFD1_I1","I1",null,"UL12_9_ENC1","ENCODER"]
["UL12_09_VFD1","UL12_09_VFD1_I2","I2",null,"UL12_9_TPE1","TRACKING PHOTOEYE"]
["UL12_09_VFD1","UL12_09_VFD1_I3","I3",null,"SPARE"]
["UL12_09_VFD1","UL12_09_VFD1_IO0","IO0",null,"SPARE"]
["UL12_09_VFD1","UL12_09_VFD1_IO1","IO1",null,"SPARE"]
["UL12_09_VFD1","UL12_09_VFD1_SI0","SI0",null,"SPARE"]
["UL12_09_VFD1","UL12_09_VFD1_SI1","SI1",null,"SPARE"]
["UL12_09_VFD1","UL12_09_VFD1_SI2","SI2",null,"SPARE"]
["UL12_09_VFD1","UL12_09_VFD1_SI3","SI3",null,"SPARE"]
["UL12_09_VFD1","UL12_09_VFD1_SO0","SO0",null,"SPARE"]
["UL12_10_VFD1","UL12_10_VFD1_I0","I0",null,"UL12_10_VFD1_DISC","DISCONNECT AUX"]
["UL12_10_VFD1","UL12_10_VFD1_I1","I1",null,"SPARE"]
["UL12_10_VFD1","UL12_10_VFD1_I2","I2",null,"SPARE"]
["UL12_10_VFD1","UL12_10_VFD1_I3","I3",null,"SPARE"]
["UL12_10_VFD1","UL12_10_VFD1_IO0","IO0",null,"SPARE"]
["UL12_10_VFD1","UL12_10_VFD1_IO1","IO1",null,"SPARE"]
["UL12_10_VFD1","UL12_10_VFD1_SI0","SI0",null,"SPARE"]
["UL12_10_VFD1","UL12_10_VFD1_SI1","SI1",null,"SPARE"]
["UL12_10_VFD1","UL12_10_VFD1_SI2","SI2",null,"SPARE"]
["UL12_10_VFD1","UL12_10_VFD1_SI3","SI3",null,"SPARE"]
["UL12_10_VFD1","UL12_10_VFD1_SO0","SO0",null,"SPARE"]
["UL2_03_FIO1","UL2_03_FIO1_IO00","IO00",null,"UL2_3_BCN1_R","RED BEACON LIGHT"]
["UL2_03_FIO1","UL2_03_FIO1_IO01","IO01",null,"SPARE"]
["UL2_03_FIO1","UL2_03_FIO1_IO02","IO02",null,"UL2_3_BCN2_R","RED BEACON LIGHT"]
["UL2_03_FIO1","UL2_03_FIO1_IO03","IO03",null,"SPARE"]
["UL2_03_FIO1","UL2_03_FIO1_IO04","IO04",null,"UL2_3_LPE1","LASEREYE"]
["UL2_03_FIO1","UL2_03_FIO1_IO05","IO05",null,"SPARE"]
["UL2_03_FIO1","UL2_03_FIO1_IO06","IO06",null,"UL2_3_LPE2","LASEREYE"]
["UL2_03_FIO1","UL2_03_FIO1_IO07","IO07",null,"SPARE"]
["UL2_03_FIO1","UL2_03_FIO1_IO08","IO08",null,"UL2_3_S1_PB","START PUSHBUTTON"]
["UL2_03_FIO1","UL2_03_FIO1_IO09","IO09",null,"UL2_3_S1_PB_LT","START PUSHBUTTON LIGHT"]
["UL2_03_FIO1","UL2_03_FIO1_IO10","IO10",null,"UL2_3_S2_PB","START PUSHBUTTON"]
["UL2_03_FIO1","UL2_03_FIO1_IO11","IO11",null,"UL2_3_S2_PB_LT","START PUSHBUTTON LIGHT"]
["UL2_03_FIO1","UL2_03_FIO1_IO12","IO12",null,"SPARE"]
["UL2_03_FIO1","UL2_03_FIO1_IO13","IO13",null,"SPARE"]
["UL2_03_FIO1","UL2_03_FIO1_IO14","IO14",null,"SPARE"]
["UL2_03_FIO1","UL2_03_FIO1_IO15","IO15",null,"SPARE"]
["UL2_03_VFD1","UL2_03_VFD1_I0","I0",null,"UL2_3_VFD1_DISC","DISCONNECT AUX"]
["UL2_03_VFD1","UL2_03_VFD1_I1","I1",null,"UL2_3_ENC1","ENCODER"]
["UL2_03_VFD1","UL2_03_VFD1_I2","I2",null,"UL2_3_TPE1","TRACKING PHOTOEYE"]
["UL2_03_VFD1","UL2_03_VFD1_I3","I3",null,"UL2_3_TPE2","TRACKING PHOTOEYE"]
["UL2_03_VFD1","UL2_03_VFD1_IO0","IO0",null,"SPARE"]
["UL2_03_VFD1","UL2_03_VFD1_IO1","IO1",null,"SPARE"]
["UL2_03_VFD1","UL2_03_VFD1_SI0","SI0",null,"UL2_3_EPC1","E-STOP PULLCORD"]
["UL2_03_VFD1","UL2_03_VFD1_SI1","SI1",null,"UL2_3_EPC1_2","E-STOP PULLCORD"]
["UL2_03_VFD1","UL2_03_VFD1_SI2","SI2",null,"UL2_3_EPC2","E-STOP PULLCORD"]
["UL2_03_VFD1","UL2_03_VFD1_SI3","SI3",null,"UL2_3_EPC2_2","E-STOP PULLCORD"]
["UL2_03_VFD1","UL2_03_VFD1_SO0","SO0",null,"SPARE"]
["UL2_04_VFD1","UL2_04_VFD1_I0","I0",null,"UL2_4_VFD1_DISC","DISCONNECT AUX"]
["UL2_04_VFD1","UL2_04_VFD1_I1","I1",null,"UL2_4_ENC1","ENCODER"]
["UL2_04_VFD1","UL2_04_VFD1_I2","I2",null,"UL2_4_TPE1","TRACKING PHOTOEYE"]
["UL2_04_VFD1","UL2_04_VFD1_I3","I3",null,"SPARE"]
["UL2_04_VFD1","UL2_04_VFD1_IO0","IO0",null,"UL2_4_BCN1_R","RED BEACON LIGHT"]
["UL2_04_VFD1","UL2_04_VFD1_IO1","IO1",null,"UL2_4_BCN2_R","RED BEACON LIGHT"]
["UL2_04_VFD1","UL2_04_VFD1_SI0","SI0",null,"UL2_4_EPC1","E-STOP PULLCORD"]
["UL2_04_VFD1","UL2_04_VFD1_SI1","SI1",null,"UL2_4_EPC1_2","E-STOP PULLCORD"]
["UL2_04_VFD1","UL2_04_VFD1_SI2","SI2",null,"UL2_4_EPC2","E-STOP PULLCORD"]
["UL2_04_VFD1","UL2_04_VFD1_SI3","SI3",null,"UL2_4_EPC2_2","E-STOP PULLCORD"]
["UL2_04_VFD1","UL2_04_VFD1_SO0","SO0",null,"SPARE"]
["UL2_05_VFD1","UL2_05_VFD1_I0","I0",null,"UL2_5_VFD1_DISC","DISCONNECT AUX"]
["UL2_05_VFD1","UL2_05_VFD1_I1","I1",null,"UL2_5_ENC1","ENCODER"]
["UL2_05_VFD1","UL2_05_VFD1_I2","I2",null,"SPARE"]
["UL2_05_VFD1","UL2_05_VFD1_I3","I3",null,"SPARE"]
["UL2_05_VFD1","UL2_05_VFD1_IO0","IO0",null,"UL2_4_S1_PB","START PUSHBUTTON"]
["UL2_05_VFD1","UL2_05_VFD1_IO1","IO1",null,"UL2_4_S1_PB_LT","START PUSHBUTTON LIGHT"]
["UL2_05_VFD1","UL2_05_VFD1_SI0","SI0",null,"SPARE"]
["UL2_05_VFD1","UL2_05_VFD1_SI1","SI1",null,"SPARE"]
["UL2_05_VFD1","UL2_05_VFD1_SI2","SI2",null,"SPARE"]
["UL2_05_VFD1","UL2_05_VFD1_SI3","SI3",null,"SPARE"]
["UL2_05_VFD1","UL2_05_VFD1_SO0","SO0",null,"SPARE"]
["UL2_06_VFD1","UL2_06_VFD1_I0","I0",null,"UL2_6_VFD1_DISC","DISCONNECT AUX"]
["UL2_06_VFD1","UL2_06_VFD1_I1","I1",null,"UL2_6_ENC1","ENCODER"]
["UL2_06_VFD1","UL2_06_VFD1_I2","I2",null,"UL2_6_TPE1","TRACKING PHOTOEYE"]
["UL2_06_VFD1","UL2_06_VFD1_I3","I3",null,"UL2_6_TPE2","TRACKING PHOTOEYE"]
["UL2_06_VFD1","UL2_06_VFD1_IO0","IO0",null,"UL2_4_S2_PB","START PUSHBUTTON"]
["UL2_06_VFD1","UL2_06_VFD1_IO1","IO1",null,"UL2_4_S2_PB_LT","START PUSHBUTTON LIGHT"]
["UL2_06_VFD1","UL2_06_VFD1_SI0","SI0",null,"SPARE"]
["UL2_06_VFD1","UL2_06_VFD1_SI1","SI1",null,"SPARE"]
["UL2_06_VFD1","UL2_06_VFD1_SI2","SI2",null,"SPARE"]
["UL2_06_VFD1","UL2_06_VFD1_SI3","SI3",null,"SPARE"]
["UL2_06_VFD1","UL2_06_VFD1_SO0","SO0",null,"SPARE"]
["UL2_07_VFD1","UL2_07_VFD1_I0","I0",null,"UL2_7_VFD1_DISC","DISCONNECT AUX"]
["UL2_07_VFD1","UL2_07_VFD1_I1","I1",null,"UL2_7_ENC1","ENCODER"]
["UL2_07_VFD1","UL2_07_VFD1_I2","I2",null,"UL2_7_TPE1","TRACKING PHOTOEYE"]
["UL2_07_VFD1","UL2_07_VFD1_I3","I3",null,"SPARE"]
["UL2_07_VFD1","UL2_07_VFD1_IO0","IO0",null,"SPARE"]
["UL2_07_VFD1","UL2_07_VFD1_IO1","IO1",null,"SPARE"]
["UL2_07_VFD1","UL2_07_VFD1_SI0","SI0",null,"SPARE"]
["UL2_07_VFD1","UL2_07_VFD1_SI1","SI1",null,"SPARE"]
["UL2_07_VFD1","UL2_07_VFD1_SI2","SI2",null,"SPARE"]
["UL2_07_VFD1","UL2_07_VFD1_SI3","SI3",null,"SPARE"]
["UL2_07_VFD1","UL2_07_VFD1_SO0","SO0",null,"SPARE"]
["UL2_08_VFD1","UL2_08_VFD1_I0","I0",null,"UL2_8_VFD1_DISC","DISCONNECT AUX"]
["UL2_08_VFD1","UL2_08_VFD1_I1","I1",null,"UL2_8_ENC1","ENCODER"]
["UL2_08_VFD1","UL2_08_VFD1_I2","I2",null,"UL2_8_TPE1","TRACKING PHOTOEYE"]
["UL2_08_VFD1","UL2_08_VFD1_I3","I3",null,"SPARE"]
["UL2_08_VFD1","UL2_08_VFD1_IO0","IO0",null,"SPARE"]
["UL2_08_VFD1","UL2_08_VFD1_IO1","IO1",null,"SPARE"]
["UL2_08_VFD1","UL2_08_VFD1_SI0","SI0",null,"SPARE"]
["UL2_08_VFD1","UL2_08_VFD1_SI1","SI1",null,"SPARE"]
["UL2_08_VFD1","UL2_08_VFD1_SI2","SI2",null,"SPARE"]
["UL2_08_VFD1","UL2_08_VFD1_SI3","SI3",null,"SPARE"]
["UL2_08_VFD1","UL2_08_VFD1_SO0","SO0",null,"SPARE"]
["UL2_09_VFD1","UL2_09_VFD1_I0","I0",null,"UL2_9_VFD1_DISC","DISCONNECT AUX"]
["UL2_09_VFD1","UL2_09_VFD1_I1","I1",null,"UL2_9_ENC1","ENCODER"]
["UL2_09_VFD1","UL2_09_VFD1_I2","I2",null,"UL2_9_TPE1","TRACKING PHOTOEYE"]
["UL2_09_VFD1","UL2_09_VFD1_I3","I3",null,"SPARE"]
["UL2_09_VFD1","UL2_09_VFD1_IO0","IO0",null,"SPARE"]
["UL2_09_VFD1","UL2_09_VFD1_IO1","IO1",null,"SPARE"]
["UL2_09_VFD1","UL2_09_VFD1_SI0","SI0",null,"SPARE"]
["UL2_09_VFD1","UL2_09_VFD1_SI1","SI1",null,"SPARE"]
["UL2_09_VFD1","UL2_09_VFD1_SI2","SI2",null,"SPARE"]
["UL2_09_VFD1","UL2_09_VFD1_SI3","SI3",null,"SPARE"]
["UL2_09_VFD1","UL2_09_VFD1_SO0","SO0",null,"SPARE"]
["UL2_10_VFD1","UL2_10_VFD1_I0","I0",null,"UL2_10_VFD1_DISC","DISCONNECT AUX"]
["UL2_10_VFD1","UL2_10_VFD1_I1","I1",null,"SPARE"]
["UL2_10_VFD1","UL2_10_VFD1_I2","I2",null,"SPARE"]
["UL2_10_VFD1","UL2_10_VFD1_I3","I3",null,"SPARE"]
["UL2_10_VFD1","UL2_10_VFD1_IO0","IO0",null,"SPARE"]
["UL2_10_VFD1","UL2_10_VFD1_IO1","IO1",null,"SPARE"]
["UL2_10_VFD1","UL2_10_VFD1_SI0","SI0",null,"SPARE"]
["UL2_10_VFD1","UL2_10_VFD1_SI1","SI1",null,"SPARE"]
["UL2_10_VFD1","UL2_10_VFD1_SI2","SI2",null,"SPARE"]
["UL2_10_VFD1","UL2_10_VFD1_SI3","SI3",null,"SPARE"]
["UL2_10_VFD1","UL2_10_VFD1_SO0","SO0",null,"SPARE"]
["UL3_01_VFD1","UL3_01_VFD1_I0","I0",null,"UL3_1_VFD1_DISC","DISCONNECT AUX"]
["UL3_01_VFD1","UL3_01_VFD1_I1","I1",null,"SPARE"]
["UL3_01_VFD1","UL3_01_VFD1_I2","I2",null,"UL3_1_TPE1","TRACKING PHOTOEYE"]
["UL3_01_VFD1","UL3_01_VFD1_I3","I3",null,"SPARE"]
["UL3_01_VFD1","UL3_01_VFD1_IO0","IO0",null,"SPARE"]
["UL3_01_VFD1","UL3_01_VFD1_IO1","IO1",null,"SPARE"]
["UL3_01_VFD1","UL3_01_VFD1_SI0","SI0",null,"UL3_1_EPC1","E-STOP PULLCORD"]
["UL3_01_VFD1","UL3_01_VFD1_SI1","SI1",null,"UL3_1_EPC1_2","E-STOP PULLCORD"]
["UL3_01_VFD1","UL3_01_VFD1_SI2","SI2",null,"UL3_1_EPC2","E-STOP PULLCORD"]
["UL3_01_VFD1","UL3_01_VFD1_SI3","SI3",null,"UL3_1_EPC2_2","E-STOP PULLCORD"]
["UL3_01_VFD1","UL3_01_VFD1_SO0","SO0",null,"SPARE"]
["UL3_02_FIO1","UL3_02_FIO1_IO00","IO00",null,"UL3_1_BCN1_R","RED BEACON LIGHT"]
["UL3_02_FIO1","UL3_02_FIO1_IO01","IO01",null,"UL3_1_BCN2_R","RED BEACON LIGHT"]
["UL3_02_FIO1","UL3_02_FIO1_IO02","IO02",null,"UL3_1_SS1_SPB","SS STATION START PUSHBUTTON"]
["UL3_02_FIO1","UL3_02_FIO1_IO03","IO03",null,"SPARE"]
["UL3_02_FIO1","UL3_02_FIO1_IO04","IO04",null,"UL3_1_SS1_STPB","SS STATION STOP PUSHBUTTON"]
["UL3_02_FIO1","UL3_02_FIO1_IO05","IO05",null,"UL3_1_SS1_STPB_LT","SS STATION STOP PUSHBUTTON LIGHT"]
["UL3_02_FIO1","UL3_02_FIO1_IO06","IO06",null,"UL3_2_LPE1","LASEREYE"]
["UL3_02_FIO1","UL3_02_FIO1_IO07","IO07",null,"SPARE"]
["UL3_02_FIO1","UL3_02_FIO1_IO08","IO08",null,"UL3_2_LPE2","LASEREYE"]
["UL3_02_FIO1","UL3_02_FIO1_IO09","IO09",null,"SPARE"]
["UL3_02_FIO1","UL3_02_FIO1_IO10","IO10",null,"UL3_2_BCN1_R","RED BEACON LIGHT"]
["UL3_02_FIO1","UL3_02_FIO1_IO11","IO11",null,"UL3_2_BCN2_R","RED BEACON LIGHT"]
["UL3_02_FIO1","UL3_02_FIO1_IO12","IO12",null,"UL3_2_S1_PB","START PUSHBUTTON"]
["UL3_02_FIO1","UL3_02_FIO1_IO13","IO13",null,"UL3_2_S1_PB_LT","START PUSHBUTTON LIGHT"]
["UL3_02_FIO1","UL3_02_FIO1_IO14","IO14",null,"UL3_2_S2_PB","START PUSHBUTTON"]
["UL3_02_FIO1","UL3_02_FIO1_IO15","IO15",null,"UL3_2_S2_PB_LT","START PUSHBUTTON LIGHT"]
["UL3_02_VFD1","UL3_02_VFD1_I0","I0",null,"UL3_2_VFD1_DISC","DISCONNECT AUX"]
["UL3_02_VFD1","UL3_02_VFD1_I1","I1",null,"UL3_2_ENC1","ENCODER"]
["UL3_02_VFD1","UL3_02_VFD1_I2","I2",null,"UL3_2_TPE1","TRACKING PHOTOEYE"]
["UL3_02_VFD1","UL3_02_VFD1_I3","I3",null,"UL3_2_TPE2","TRACKING PHOTOEYE"]
["UL3_02_VFD1","UL3_02_VFD1_IO0","IO0",null,"SPARE"]
["UL3_02_VFD1","UL3_02_VFD1_IO1","IO1",null,"SPARE"]
["UL3_02_VFD1","UL3_02_VFD1_SI0","SI0",null,"UL3_2_EPC1","E-STOP PULLCORD"]
["UL3_02_VFD1","UL3_02_VFD1_SI1","SI1",null,"UL3_2_EPC1_2","E-STOP PULLCORD"]
["UL3_02_VFD1","UL3_02_VFD1_SI2","SI2",null,"UL3_2_EPC2","E-STOP PULLCORD"]
["UL3_02_VFD1","UL3_02_VFD1_SI3","SI3",null,"UL3_2_EPC2_2","E-STOP PULLCORD"]
["UL3_02_VFD1","UL3_02_VFD1_SO0","SO0",null,"SPARE"]
["UL3_03_VFD1","UL3_03_VFD1_I0","I0",null,"UL3_3_VFD1_DISC","DISCONNECT AUX"]
["UL3_03_VFD1","UL3_03_VFD1_I1","I1",null,"UL3_3_ENC1","ENCODER"]
["UL3_03_VFD1","UL3_03_VFD1_I2","I2",null,"SPARE"]
["UL3_03_VFD1","UL3_03_VFD1_I3","I3",null,"SPARE"]
["UL3_03_VFD1","UL3_03_VFD1_IO0","IO0",null,"SPARE"]
["UL3_03_VFD1","UL3_03_VFD1_IO1","IO1",null,"SPARE"]
["UL3_03_VFD1","UL3_03_VFD1_SI0","SI0",null,"SPARE"]
["UL3_03_VFD1","UL3_03_VFD1_SI1","SI1",null,"SPARE"]
["UL3_03_VFD1","UL3_03_VFD1_SI2","SI2",null,"SPARE"]
["UL3_03_VFD1","UL3_03_VFD1_SI3","SI3",null,"SPARE"]
["UL3_03_VFD1","UL3_03_VFD1_SO0","SO0",null,"SPARE"]
["UL3_04_VFD1","UL3_04_VFD1_I0","I0",null,"UL3_4_VFD1_DISC","DISCONNECT AUX"]
["UL3_04_VFD1","UL3_04_VFD1_I1","I1",null,"UL3_4_ENC1","ENCODER"]
["UL3_04_VFD1","UL3_04_VFD1_I2","I2",null,"UL3_4_TPE1","TRACKING PHOTOEYE"]
["UL3_04_VFD1","UL3_04_VFD1_I3","I3",null,"UL3_4_TPE2","TRACKING PHOTOEYE"]
["UL3_04_VFD1","UL3_04_VFD1_IO0","IO0",null,"SPARE"]
["UL3_04_VFD1","UL3_04_VFD1_IO1","IO1",null,"SPARE"]
["UL3_04_VFD1","UL3_04_VFD1_SI0","SI0",null,"SPARE"]
["UL3_04_VFD1","UL3_04_VFD1_SI1","SI1",null,"SPARE"]
["UL3_04_VFD1","UL3_04_VFD1_SI2","SI2",null,"SPARE"]
["UL3_04_VFD1","UL3_04_VFD1_SI3","SI3",null,"SPARE"]
["UL3_04_VFD1","UL3_04_VFD1_SO0","SO0",null,"SPARE"]
["UL3_05_VFD1","UL3_05_VFD1_I0","I0",null,"UL3_5_VFD1_DISC","DISCONNECT AUX"]
["UL3_05_VFD1","UL3_05_VFD1_I1","I1",null,"UL3_5_ENC1","ENCODER"]
["UL3_05_VFD1","UL3_05_VFD1_I2","I2",null,"UL3_5_TPE1","TRACKING PHOTOEYE"]
["UL3_05_VFD1","UL3_05_VFD1_I3","I3",null,"SPARE"]
["UL3_05_VFD1","UL3_05_VFD1_IO0","IO0",null,"SPARE"]
["UL3_05_VFD1","UL3_05_VFD1_IO1","IO1",null,"SPARE"]
["UL3_05_VFD1","UL3_05_VFD1_SI0","SI0",null,"SPARE"]
["UL3_05_VFD1","UL3_05_VFD1_SI1","SI1",null,"SPARE"]
["UL3_05_VFD1","UL3_05_VFD1_SI2","SI2",null,"SPARE"]
["UL3_05_VFD1","UL3_05_VFD1_SI3","SI3",null,"SPARE"]
["UL3_05_VFD1","UL3_05_VFD1_SO0","SO0",null,"SPARE"]
["UL3_06_VFD1","UL3_06_VFD1_I0","I0",null,"UL3_6_VFD1_DISC","DISCONNECT AUX"]
["UL3_06_VFD1","UL3_06_VFD1_I1","I1",null,"UL3_6_ENC1","ENCODER"]
["UL3_06_VFD1","UL3_06_VFD1_I2","I2",null,"UL3_6_TPE1","TRACKING PHOTOEYE"]
["UL3_06_VFD1","UL3_06_VFD1_I3","I3",null,"SPARE"]
["UL3_06_VFD1","UL3_06_VFD1_IO0","IO0",null,"SPARE"]
["UL3_06_VFD1","UL3_06_VFD1_IO1","IO1",null,"SPARE"]
["UL3_06_VFD1","UL3_06_VFD1_SI0","SI0",null,"SPARE"]
["UL3_06_VFD1","UL3_06_VFD1_SI1","SI1",null,"SPARE"]
["UL3_06_VFD1","UL3_06_VFD1_SI2","SI2",null,"SPARE"]
["UL3_06_VFD1","UL3_06_VFD1_SI3","SI3",null,"SPARE"]
["UL3_06_VFD1","UL3_06_VFD1_SO0","SO0",null,"SPARE"]
["UL3_07_VFD1","UL3_07_VFD1_I0","I0",null,"UL3_7_VFD1_DISC","DISCONNECT AUX"]
["UL3_07_VFD1","UL3_07_VFD1_I1","I1",null,"UL3_7_ENC1","ENCODER"]
["UL3_07_VFD1","UL3_07_VFD1_I2","I2",null,"UL3_7_TPE1","TRACKING PHOTOEYE"]
["UL3_07_VFD1","UL3_07_VFD1_I3","I3",null,"SPARE"]
["UL3_07_VFD1","UL3_07_VFD1_IO0","IO0",null,"SPARE"]
["UL3_07_VFD1","UL3_07_VFD1_IO1","IO1",null,"SPARE"]
["UL3_07_VFD1","UL3_07_VFD1_SI0","SI0",null,"SPARE"]
["UL3_07_VFD1","UL3_07_VFD1_SI1","SI1",null,"SPARE"]
["UL3_07_VFD1","UL3_07_VFD1_SI2","SI2",null,"SPARE"]
["UL3_07_VFD1","UL3_07_VFD1_SI3","SI3",null,"SPARE"]
["UL3_07_VFD1","UL3_07_VFD1_SO0","SO0",null,"SPARE"]
["UL3_08_VFD1","UL3_08_VFD1_I0","I0",null,"UL3_8_VFD1_DISC","DISCONNECT AUX"]
["UL3_08_VFD1","UL3_08_VFD1_I1","I1",null,"UL3_8_ENC1","ENCODER"]
["UL3_08_VFD1","UL3_08_VFD1_I2","I2",null,"UL3_8_TPE1","TRACKING PHOTOEYE"]
["UL3_08_VFD1","UL3_08_VFD1_I3","I3",null,"SPARE"]
["UL3_08_VFD1","UL3_08_VFD1_IO0","IO0",null,"SPARE"]
["UL3_08_VFD1","UL3_08_VFD1_IO1","IO1",null,"SPARE"]
["UL3_08_VFD1","UL3_08_VFD1_SI0","SI0",null,"SPARE"]
["UL3_08_VFD1","UL3_08_VFD1_SI1","SI1",null,"SPARE"]
["UL3_08_VFD1","UL3_08_VFD1_SI2","SI2",null,"SPARE"]
["UL3_08_VFD1","UL3_08_VFD1_SI3","SI3",null,"SPARE"]
["UL3_08_VFD1","UL3_08_VFD1_SO0","SO0",null,"SPARE"]
["UL3_09_VFD1","UL3_09_VFD1_I0","I0",null,"UL3_9_VFD1_DISC","DISCONNECT AUX"]
["UL3_09_VFD1","UL3_09_VFD1_I1","I1",null,"SPARE"]
["UL3_09_VFD1","UL3_09_VFD1_I2","I2",null,"SPARE"]
["UL3_09_VFD1","UL3_09_VFD1_I3","I3",null,"SPARE"]
["UL3_09_VFD1","UL3_09_VFD1_IO0","IO0",null,"SPARE"]
["UL3_09_VFD1","UL3_09_VFD1_IO1","IO1",null,"SPARE"]
["UL3_09_VFD1","UL3_09_VFD1_SI0","SI0",null,"SPARE"]
["UL3_09_VFD1","UL3_09_VFD1_SI1","SI1",null,"SPARE"]
["UL3_09_VFD1","UL3_09_VFD1_SI2","SI2",null,"SPARE"]
["UL3_09_VFD1","UL3_09_VFD1_SI3","SI3",null,"SPARE"]
["UL3_09_VFD1","UL3_09_VFD1_SO0","SO0",null,"SPARE"]
["UL4_03_FIO1","UL4_03_FIO1_IO00","IO00",null,"UL4_3_BCN1_R","RED BEACON LIGHT"]
["UL4_03_FIO1","UL4_03_FIO1_IO01","IO01",null,"SPARE"]
["UL4_03_FIO1","UL4_03_FIO1_IO02","IO02",null,"UL4_3_BCN2_R","RED BEACON LIGHT"]
["UL4_03_FIO1","UL4_03_FIO1_IO03","IO03",null,"SPARE"]
["UL4_03_FIO1","UL4_03_FIO1_IO04","IO04",null,"UL4_3_LPE1","LASEREYE"]
["UL4_03_FIO1","UL4_03_FIO1_IO05","IO05",null,"SPARE"]
["UL4_03_FIO1","UL4_03_FIO1_IO06","IO06",null,"UL4_3_LPE2","LASEREYE"]
["UL4_03_FIO1","UL4_03_FIO1_IO07","IO07",null,"SPARE"]
["UL4_03_FIO1","UL4_03_FIO1_IO08","IO08",null,"UL4_3_S1_PB","START PUSHBUTTON"]
["UL4_03_FIO1","UL4_03_FIO1_IO09","IO09",null,"UL4_3_S1_PB_LT","START PUSHBUTTON LIGHT"]
["UL4_03_FIO1","UL4_03_FIO1_IO10","IO10",null,"UL4_3_S2_PB","START PUSHBUTTON"]
["UL4_03_FIO1","UL4_03_FIO1_IO11","IO11",null,"UL4_3_S2_PB_LT","START PUSHBUTTON LIGHT"]
["UL4_03_FIO1","UL4_03_FIO1_IO12","IO12",null,"SPARE"]
["UL4_03_FIO1","UL4_03_FIO1_IO13","IO13",null,"SPARE"]
["UL4_03_FIO1","UL4_03_FIO1_IO14","IO14",null,"SPARE"]
["UL4_03_FIO1","UL4_03_FIO1_IO15","IO15",null,"SPARE"]
["UL4_03_VFD1","UL4_03_VFD1_I0","I0",null,"UL4_3_VFD1_DISC","DISCONNECT AUX"]
["UL4_03_VFD1","UL4_03_VFD1_I1","I1",null,"UL4_3_ENC1","ENCODER"]
["UL4_03_VFD1","UL4_03_VFD1_I2","I2",null,"UL4_3_TPE1","TRACKING PHOTOEYE"]
["UL4_03_VFD1","UL4_03_VFD1_I3","I3",null,"UL4_3_TPE2","TRACKING PHOTOEYE"]
["UL4_03_VFD1","UL4_03_VFD1_IO0","IO0",null,"SPARE"]
["UL4_03_VFD1","UL4_03_VFD1_IO1","IO1",null,"SPARE"]
["UL4_03_VFD1","UL4_03_VFD1_SI0","SI0",null,"UL4_3_EPC1","E-STOP PULLCORD"]
["UL4_03_VFD1","UL4_03_VFD1_SI1","SI1",null,"UL4_3_EPC1_2","E-STOP PULLCORD"]
["UL4_03_VFD1","UL4_03_VFD1_SI2","SI2",null,"UL4_3_EPC2","E-STOP PULLCORD"]
["UL4_03_VFD1","UL4_03_VFD1_SI3","SI3",null,"UL4_3_EPC2_2","E-STOP PULLCORD"]
["UL4_03_VFD1","UL4_03_VFD1_SO0","SO0",null,"SPARE"]
["UL4_04_VFD1","UL4_04_VFD1_I0","I0",null,"UL4_4_VFD1_DISC","DISCONNECT AUX"]
["UL4_04_VFD1","UL4_04_VFD1_I1","I1",null,"UL4_4_ENC1","ENCODER"]
["UL4_04_VFD1","UL4_04_VFD1_I2","I2",null,"UL4_4_TPE1","TRACKING PHOTOEYE"]
["UL4_04_VFD1","UL4_04_VFD1_I3","I3",null,"SPARE"]
["UL4_04_VFD1","UL4_04_VFD1_IO0","IO0",null,"UL4_4_BCN1_R","RED BEACON LIGHT"]
["UL4_04_VFD1","UL4_04_VFD1_IO1","IO1",null,"UL4_4_BCN2_R","RED BEACON LIGHT"]
["UL4_04_VFD1","UL4_04_VFD1_SI0","SI0",null,"UL4_4_EPC1","E-STOP PULLCORD"]
["UL4_04_VFD1","UL4_04_VFD1_SI1","SI1",null,"UL4_4_EPC1_2","E-STOP PULLCORD"]
["UL4_04_VFD1","UL4_04_VFD1_SI2","SI2",null,"UL4_4_EPC2","E-STOP PULLCORD"]
["UL4_04_VFD1","UL4_04_VFD1_SI3","SI3",null,"UL4_4_EPC2_2","E-STOP PULLCORD"]
["UL4_04_VFD1","UL4_04_VFD1_SO0","SO0",null,"SPARE"]
["UL4_05_VFD1","UL4_05_VFD1_I0","I0",null,"UL4_5_VFD1_DISC","DISCONNECT AUX"]
["UL4_05_VFD1","UL4_05_VFD1_I1","I1",null,"UL4_5_ENC1","ENCODER"]
["UL4_05_VFD1","UL4_05_VFD1_I2","I2",null,"UL4_5_TPE1","TRACKING PHOTOEYE"]
["UL4_05_VFD1","UL4_05_VFD1_I3","I3",null,"SPARE"]
["UL4_05_VFD1","UL4_05_VFD1_IO0","IO0",null,"UL4_4_S1_PB","START PUSHBUTTON"]
["UL4_05_VFD1","UL4_05_VFD1_IO1","IO1",null,"UL4_4_S1_PB_LT","START PUSHBUTTON LIGHT"]
["UL4_05_VFD1","UL4_05_VFD1_SI0","SI0",null,"SPARE"]
["UL4_05_VFD1","UL4_05_VFD1_SI1","SI1",null,"SPARE"]
["UL4_05_VFD1","UL4_05_VFD1_SI2","SI2",null,"SPARE"]
["UL4_05_VFD1","UL4_05_VFD1_SI3","SI3",null,"SPARE"]
["UL4_05_VFD1","UL4_05_VFD1_SO0","SO0",null,"SPARE"]
["UL4_06_VFD1","UL4_06_VFD1_I0","I0",null,"UL4_6_VFD1_DISC","DISCONNECT AUX"]
["UL4_06_VFD1","UL4_06_VFD1_I1","I1",null,"UL4_6_ENC1","ENCODER"]
["UL4_06_VFD1","UL4_06_VFD1_I2","I2",null,"UL4_6_TPE1","TRACKING PHOTOEYE"]
["UL4_06_VFD1","UL4_06_VFD1_I3","I3",null,"SPARE"]
["UL4_06_VFD1","UL4_06_VFD1_IO0","IO0",null,"UL4_4_S2_PB","START PUSHBUTTON"]
["UL4_06_VFD1","UL4_06_VFD1_IO1","IO1",null,"UL4_4_S2_PB_LT","START PUSHBUTTON LIGHT"]
["UL4_06_VFD1","UL4_06_VFD1_SI0","SI0",null,"SPARE"]
["UL4_06_VFD1","UL4_06_VFD1_SI1","SI1",null,"SPARE"]
["UL4_06_VFD1","UL4_06_VFD1_SI2","SI2",null,"SPARE"]
["UL4_06_VFD1","UL4_06_VFD1_SI3","SI3",null,"SPARE"]
["UL4_06_VFD1","UL4_06_VFD1_SO0","SO0",null,"SPARE"]
["UL4_07_VFD1","UL4_07_VFD1_I0","I0",null,"UL4_7_VFD1_DISC","DISCONNECT AUX"]
["UL4_07_VFD1","UL4_07_VFD1_I1","I1",null,"UL4_7_ENC1","ENCODER"]
["UL4_07_VFD1","UL4_07_VFD1_I2","I2",null,"UL4_7_TPE1","TRACKING PHOTOEYE"]
["UL4_07_VFD1","UL4_07_VFD1_I3","I3",null,"SPARE"]
["UL4_07_VFD1","UL4_07_VFD1_IO0","IO0",null,"SPARE"]
["UL4_07_VFD1","UL4_07_VFD1_IO1","IO1",null,"SPARE"]
["UL4_07_VFD1","UL4_07_VFD1_SI0","SI0",null,"SPARE"]
["UL4_07_VFD1","UL4_07_VFD1_SI1","SI1",null,"SPARE"]
["UL4_07_VFD1","UL4_07_VFD1_SI2","SI2",null,"SPARE"]
["UL4_07_VFD1","UL4_07_VFD1_SI3","SI3",null,"SPARE"]
["UL4_07_VFD1","UL4_07_VFD1_SO0","SO0",null,"SPARE"]
["UL4_08_VFD1","UL4_08_VFD1_I0","I0",null,"UL4_8_VFD1_DISC","DISCONNECT AUX"]
["UL4_08_VFD1","UL4_08_VFD1_I1","I1",null,"UL4_8_ENC1","ENCODER"]
["UL4_08_VFD1","UL4_08_VFD1_I2","I2",null,"UL4_8_TPE1","TRACKING PHOTOEYE"]
["UL4_08_VFD1","UL4_08_VFD1_I3","I3",null,"SPARE"]
["UL4_08_VFD1","UL4_08_VFD1_IO0","IO0",null,"SPARE"]
["UL4_08_VFD1","UL4_08_VFD1_IO1","IO1",null,"SPARE"]
["UL4_08_VFD1","UL4_08_VFD1_SI0","SI0",null,"SPARE"]
["UL4_08_VFD1","UL4_08_VFD1_SI1","SI1",null,"SPARE"]
["UL4_08_VFD1","UL4_08_VFD1_SI2","SI2",null,"SPARE"]
["UL4_08_VFD1","UL4_08_VFD1_SI3","SI3",null,"SPARE"]
["UL4_08_VFD1","UL4_08_VFD1_SO0","SO0",null,"SPARE"]
["UL4_09_VFD1","UL4_09_VFD1_I0","I0",null,"UL4_9_VFD1_DISC","DISCONNECT AUX"]
["UL4_09_VFD1","UL4_09_VFD1_I1","I1",null,"UL4_9_ENC1","ENCODER"]
["UL4_09_VFD1","UL4_09_VFD1_I2","I2",null,"UL4_9_TPE1","TRACKING PHOTOEYE"]
["UL4_09_VFD1","UL4_09_VFD1_I3","I3",null,"UL4_9_TPE2","TRACKING PHOTOEYE"]
["UL4_09_VFD1","UL4_09_VFD1_IO0","IO0",null,"UL4_9_BCN1_A","AMBER BEACON LIGHT"]
["UL4_09_VFD1","UL4_09_VFD1_IO1","IO1",null,"UL4_9_BCN1_R","RED BEACON LIGHT"]
["UL4_09_VFD1","UL4_09_VFD1_SI0","SI0",null,"UL4_9_EPC1","E-STOP PULLCORD"]
["UL4_09_VFD1","UL4_09_VFD1_SI1","SI1",null,"UL4_9_EPC1_2","E-STOP PULLCORD"]
["UL4_09_VFD1","UL4_09_VFD1_SI2","SI2",null,"UL4_9_EPC2","E-STOP PULLCORD"]
["UL4_09_VFD1","UL4_09_VFD1_SI3","SI3",null,"UL4_9_EPC2_2","E-STOP PULLCORD"]
["UL4_09_VFD1","UL4_09_VFD1_SO0","SO0",null,"UL4_9_BCN2_R","RED BEACON LIGHT"]
["UL4_10A_VFD1","UL4_10A_VFD1_I0","I0",null,"UL4_10A_VFD1_DISC","DISCONNECT AUX"]
["UL4_10A_VFD1","UL4_10A_VFD1_I1","I1",null,"UL4_9_TPE3","TRACKING PHOTOEYE"]
["UL4_10A_VFD1","UL4_10A_VFD1_I2","I2",null,"UL4_9_TPE4","TRACKING PHOTOEYE"]
["UL4_10A_VFD1","UL4_10A_VFD1_I3","I3",null,"UL4_9_TPE5","TRACKING PHOTOEYE"]
["UL4_10A_VFD1","UL4_10A_VFD1_IO0","IO0",null,"UL4_9_JR1_PB","JAM RESET PUSHBUTTON"]
["UL4_10A_VFD1","UL4_10A_VFD1_IO1","IO1",null,"UL4_9_JR1_PB_LT","JAM RESET PUSHBUTTON LIGHT"]
["UL4_10A_VFD1","UL4_10A_VFD1_SI0","SI0",null,"SPARE"]
["UL4_10A_VFD1","UL4_10A_VFD1_SI1","SI1",null,"SPARE"]
["UL4_10A_VFD1","UL4_10A_VFD1_SI2","SI2",null,"SPARE"]
["UL4_10A_VFD1","UL4_10A_VFD1_SI3","SI3",null,"SPARE"]
["UL4_10A_VFD1","UL4_10A_VFD1_SO0","SO0",null,"SPARE"]
["UL4_10B_VFD1","UL4_10B_VFD1_I0","I0",null,"UL4_10B_VFD1_DISC","DISCONNECT AUX"]
["UL4_10B_VFD1","UL4_10B_VFD1_I1","I1",null,"SPARE"]
["UL4_10B_VFD1","UL4_10B_VFD1_I2","I2",null,"SPARE"]
["UL4_10B_VFD1","UL4_10B_VFD1_I3","I3",null,"SPARE"]
["UL4_10B_VFD1","UL4_10B_VFD1_IO0","IO0",null,"UL4_9_JR2_PB","JAM RESET PUSHBUTTON"]
["UL4_10B_VFD1","UL4_10B_VFD1_IO1","IO1",null,"UL4_9_JR2_PB_LT","JAM RESET PUSHBUTTON LIGHT"]
["UL4_10B_VFD1","UL4_10B_VFD1_SI0","SI0",null,"SPARE"]
["UL4_10B_VFD1","UL4_10B_VFD1_SI1","SI1",null,"SPARE"]
["UL4_10B_VFD1","UL4_10B_VFD1_SI2","SI2",null,"SPARE"]
["UL4_10B_VFD1","UL4_10B_VFD1_SI3","SI3",null,"SPARE"]
["UL4_10B_VFD1","UL4_10B_VFD1_SO0","SO0",null,"SPARE"]
["UL4_11_VFD1","UL4_11_VFD1_I0","I0",null,"UL4_11_VFD1_DISC","DISCONNECT AUX"]
["UL4_11_VFD1","UL4_11_VFD1_I1","I1",null,"SPARE"]
["UL4_11_VFD1","UL4_11_VFD1_I2","I2",null,"UL4_11_TPE1","TRACKING PHOTOEYE"]
["UL4_11_VFD1","UL4_11_VFD1_I3","I3",null,"UL4_11_TPE2","TRACKING PHOTOEYE"]
["UL4_11_VFD1","UL4_11_VFD1_IO0","IO0",null,"UL4_9_S1_PB","START PUSHBUTTON"]
["UL4_11_VFD1","UL4_11_VFD1_IO1","IO1",null,"UL4_9_S1_PB_LT","START PUSHBUTTON LIGHT"]
["UL4_11_VFD1","UL4_11_VFD1_SI0","SI0",null,"SPARE"]
["UL4_11_VFD1","UL4_11_VFD1_SI1","SI1",null,"SPARE"]
["UL4_11_VFD1","UL4_11_VFD1_SI2","SI2",null,"SPARE"]
["UL4_11_VFD1","UL4_11_VFD1_SI3","SI3",null,"SPARE"]
["UL4_11_VFD1","UL4_11_VFD1_SO0","SO0",null,"SPARE"]
["UL4_12_VFD1","UL4_12_VFD1_I0","I0",null,"UL4_12_VFD1_DISC","DISCONNECT AUX"]
["UL4_12_VFD1","UL4_12_VFD1_I1","I1",null,"SPARE"]
["UL4_12_VFD1","UL4_12_VFD1_I2","I2",null,"UL4_12_TPE1","TRACKING PHOTOEYE"]
["UL4_12_VFD1","UL4_12_VFD1_I3","I3",null,"SPARE"]
["UL4_12_VFD1","UL4_12_VFD1_IO0","IO0",null,"UL4_9_S2_PB","START PUSHBUTTON"]
["UL4_12_VFD1","UL4_12_VFD1_IO1","IO1",null,"UL4_9_S2_PB_LT","START PUSHBUTTON LIGHT"]
["UL4_12_VFD1","UL4_12_VFD1_SI0","SI0",null,"SPARE"]
["UL4_12_VFD1","UL4_12_VFD1_SI1","SI1",null,"SPARE"]
["UL4_12_VFD1","UL4_12_VFD1_SI2","SI2",null,"SPARE"]
["UL4_12_VFD1","UL4_12_VFD1_SI3","SI3",null,"SPARE"]
["UL4_12_VFD1","UL4_12_VFD1_SO0","SO0",null,"SPARE"]
["UL4_13_VFD1","UL4_13_VFD1_I0","I0",null,"UL4_13_VFD1_DISC","DISCONNECT AUX"]
["UL4_13_VFD1","UL4_13_VFD1_I1","I1",null,"SPARE"]
["UL4_13_VFD1","UL4_13_VFD1_I2","I2",null,"SPARE"]
["UL4_13_VFD1","UL4_13_VFD1_I3","I3",null,"SPARE"]
["UL4_13_VFD1","UL4_13_VFD1_IO0","IO0",null,"SPARE"]
["UL4_13_VFD1","UL4_13_VFD1_IO1","IO1",null,"SPARE"]
["UL4_13_VFD1","UL4_13_VFD1_SI0","SI0",null,"SPARE"]
["UL4_13_VFD1","UL4_13_VFD1_SI1","SI1",null,"SPARE"]
["UL4_13_VFD1","UL4_13_VFD1_SI2","SI2",null,"SPARE"]
["UL4_13_VFD1","UL4_13_VFD1_SI3","SI3",null,"SPARE"]
["UL4_13_VFD1","UL4_13_VFD1_SO0","SO0",null,"SPARE"]
["UL5_03_FIO1","UL5_03_FIO1_IO00","IO00",null,"UL5_3_BCN1_R","RED BEACON LIGHT"]
["UL5_03_FIO1","UL5_03_FIO1_IO01","IO01",null,"SPARE"]
["UL5_03_FIO1","UL5_03_FIO1_IO02","IO02",null,"UL5_3_BCN2_R","RED BEACON LIGHT"]
["UL5_03_FIO1","UL5_03_FIO1_IO03","IO03",null,"SPARE"]
["UL5_03_FIO1","UL5_03_FIO1_IO04","IO04",null,"UL5_3_LPE1","LASEREYE"]
["UL5_03_FIO1","UL5_03_FIO1_IO05","IO05",null,"SPARE"]
["UL5_03_FIO1","UL5_03_FIO1_IO06","IO06",null,"UL5_3_LPE2","LASEREYE"]
["UL5_03_FIO1","UL5_03_FIO1_IO07","IO07",null,"SPARE"]
["UL5_03_FIO1","UL5_03_FIO1_IO08","IO08",null,"UL5_3_S1_PB","START PUSHBUTTON"]
["UL5_03_FIO1","UL5_03_FIO1_IO09","IO09",null,"UL5_3_S1_PB_LT","START PUSHBUTTON LIGHT"]
["UL5_03_FIO1","UL5_03_FIO1_IO10","IO10",null,"UL5_3_S2_PB","START PUSHBUTTON"]
["UL5_03_FIO1","UL5_03_FIO1_IO11","IO11",null,"UL5_3_S2_PB_LT","START PUSHBUTTON LIGHT"]
["UL5_03_FIO1","UL5_03_FIO1_IO12","IO12",null,"SPARE"]
["UL5_03_FIO1","UL5_03_FIO1_IO13","IO13",null,"SPARE"]
["UL5_03_FIO1","UL5_03_FIO1_IO14","IO14",null,"SPARE"]
["UL5_03_FIO1","UL5_03_FIO1_IO15","IO15",null,"SPARE"]
["UL5_03_VFD1","UL5_03_VFD1_I0","I0",null,"UL5_3_VFD1_DISC","DISCONNECT AUX"]
["UL5_03_VFD1","UL5_03_VFD1_I1","I1",null,"UL5_3_ENC1","ENCODER"]
["UL5_03_VFD1","UL5_03_VFD1_I2","I2",null,"UL5_3_TPE1","TRACKING PHOTOEYE"]
["UL5_03_VFD1","UL5_03_VFD1_I3","I3",null,"UL5_3_TPE2","TRACKING PHOTOEYE"]
["UL5_03_VFD1","UL5_03_VFD1_IO0","IO0",null,"UL5_4_S1_PB","START PUSHBUTTON"]
["UL5_03_VFD1","UL5_03_VFD1_IO1","IO1",null,"UL5_4_S1_PB_LT","START PUSHBUTTON LIGHT"]
["UL5_03_VFD1","UL5_03_VFD1_SI0","SI0",null,"UL5_3_EPC1","E-STOP PULLCORD"]
["UL5_03_VFD1","UL5_03_VFD1_SI1","SI1",null,"UL5_3_EPC1_2","E-STOP PULLCORD"]
["UL5_03_VFD1","UL5_03_VFD1_SI2","SI2",null,"UL5_3_EPC2","E-STOP PULLCORD"]
["UL5_03_VFD1","UL5_03_VFD1_SI3","SI3",null,"UL5_3_EPC2_2","E-STOP PULLCORD"]
["UL5_03_VFD1","UL5_03_VFD1_SO0","SO0",null,"SPARE"]
["UL5_04_VFD1","UL5_04_VFD1_I0","I0",null,"UL5_4_VFD1_DISC","DISCONNECT AUX"]
["UL5_04_VFD1","UL5_04_VFD1_I1","I1",null,"UL5_4_ENC1","ENCODER"]
["UL5_04_VFD1","UL5_04_VFD1_I2","I2",null,"UL5_4_TPE1","TRACKING PHOTOEYE"]
["UL5_04_VFD1","UL5_04_VFD1_I3","I3",null,"SPARE"]
["UL5_04_VFD1","UL5_04_VFD1_IO0","IO0",null,"UL5_4_BCN1_R","RED BEACON LIGHT"]
["UL5_04_VFD1","UL5_04_VFD1_IO1","IO1",null,"UL5_4_BCN2_R","RED BEACON LIGHT"]
["UL5_04_VFD1","UL5_04_VFD1_SI0","SI0",null,"UL5_4_EPC1","E-STOP PULLCORD"]
["UL5_04_VFD1","UL5_04_VFD1_SI1","SI1",null,"UL5_4_EPC1_2","E-STOP PULLCORD"]
["UL5_04_VFD1","UL5_04_VFD1_SI2","SI2",null,"UL5_4_EPC2","E-STOP PULLCORD"]
["UL5_04_VFD1","UL5_04_VFD1_SI3","SI3",null,"UL5_4_EPC2_2","E-STOP PULLCORD"]
["UL5_04_VFD1","UL5_04_VFD1_SO0","SO0",null,"SPARE"]
["UL5_05_VFD1","UL5_05_VFD1_I0","I0",null,"UL5_5_VFD1_DISC","DISCONNECT AUX"]
["UL5_05_VFD1","UL5_05_VFD1_I1","I1",null,"UL5_5_ENC1","ENCODER"]
["UL5_05_VFD1","UL5_05_VFD1_I2","I2",null,"SPARE"]
["UL5_05_VFD1","UL5_05_VFD1_I3","I3",null,"SPARE"]
["UL5_05_VFD1","UL5_05_VFD1_IO0","IO0",null,"UL5_4_S2_PB","START PUSHBUTTON"]
["UL5_05_VFD1","UL5_05_VFD1_IO1","IO1",null,"UL5_4_S2_PB_LT","START PUSHBUTTON LIGHT"]
["UL5_05_VFD1","UL5_05_VFD1_SI0","SI0",null,"SPARE"]
["UL5_05_VFD1","UL5_05_VFD1_SI1","SI1",null,"SPARE"]
["UL5_05_VFD1","UL5_05_VFD1_SI2","SI2",null,"SPARE"]
["UL5_05_VFD1","UL5_05_VFD1_SI3","SI3",null,"SPARE"]
["UL5_05_VFD1","UL5_05_VFD1_SO0","SO0",null,"SPARE"]
["UL5_06_VFD1","UL5_06_VFD1_I0","I0",null,"UL5_6_VFD1_DISC","DISCONNECT AUX"]
["UL5_06_VFD1","UL5_06_VFD1_I1","I1",null,"UL5_6_ENC1","ENCODER"]
["UL5_06_VFD1","UL5_06_VFD1_I2","I2",null,"UL5_6_TPE1","TRACKING PHOTOEYE"]
["UL5_06_VFD1","UL5_06_VFD1_I3","I3",null,"UL5_6_TPE2","TRACKING PHOTOEYE"]
["UL5_06_VFD1","UL5_06_VFD1_IO0","IO0",null,"SPARE"]
["UL5_06_VFD1","UL5_06_VFD1_IO1","IO1",null,"SPARE"]
["UL5_06_VFD1","UL5_06_VFD1_SI0","SI0",null,"SPARE"]
["UL5_06_VFD1","UL5_06_VFD1_SI1","SI1",null,"SPARE"]
["UL5_06_VFD1","UL5_06_VFD1_SI2","SI2",null,"SPARE"]
["UL5_06_VFD1","UL5_06_VFD1_SI3","SI3",null,"SPARE"]
["UL5_06_VFD1","UL5_06_VFD1_SO0","SO0",null,"SPARE"]
["UL5_07_VFD1","UL5_07_VFD1_I0","I0",null,"UL5_7_VFD1_DISC","DISCONNECT AUX"]
["UL5_07_VFD1","UL5_07_VFD1_I1","I1",null,"UL5_7_ENC1","ENCODER"]
["UL5_07_VFD1","UL5_07_VFD1_I2","I2",null,"UL5_7_TPE1","TRACKING PHOTOEYE"]
["UL5_07_VFD1","UL5_07_VFD1_I3","I3",null,"SPARE"]
["UL5_07_VFD1","UL5_07_VFD1_IO0","IO0",null,"SPARE"]
["UL5_07_VFD1","UL5_07_VFD1_IO1","IO1",null,"SPARE"]
["UL5_07_VFD1","UL5_07_VFD1_SI0","SI0",null,"SPARE"]
["UL5_07_VFD1","UL5_07_VFD1_SI1","SI1",null,"SPARE"]
["UL5_07_VFD1","UL5_07_VFD1_SI2","SI2",null,"SPARE"]
["UL5_07_VFD1","UL5_07_VFD1_SI3","SI3",null,"SPARE"]
["UL5_07_VFD1","UL5_07_VFD1_SO0","SO0",null,"SPARE"]
["UL5_08_VFD1","UL5_08_VFD1_I0","I0",null,"UL5_8_VFD1_DISC","DISCONNECT AUX"]
["UL5_08_VFD1","UL5_08_VFD1_I1","I1",null,"UL5_8_ENC1","ENCODER"]
["UL5_08_VFD1","UL5_08_VFD1_I2","I2",null,"UL5_8_TPE1","TRACKING PHOTOEYE"]
["UL5_08_VFD1","UL5_08_VFD1_I3","I3",null,"SPARE"]
["UL5_08_VFD1","UL5_08_VFD1_IO0","IO0",null,"SPARE"]
["UL5_08_VFD1","UL5_08_VFD1_IO1","IO1",null,"SPARE"]
["UL5_08_VFD1","UL5_08_VFD1_SI0","SI0",null,"SPARE"]
["UL5_08_VFD1","UL5_08_VFD1_SI1","SI1",null,"SPARE"]
["UL5_08_VFD1","UL5_08_VFD1_SI2","SI2",null,"SPARE"]
["UL5_08_VFD1","UL5_08_VFD1_SI3","SI3",null,"SPARE"]
["UL5_08_VFD1","UL5_08_VFD1_SO0","SO0",null,"SPARE"]
["UL5_09_VFD1","UL5_09_VFD1_I0","I0",null,"UL5_9_VFD1_DISC","DISCONNECT AUX"]
["UL5_09_VFD1","UL5_09_VFD1_I1","I1",null,"UL5_9_ENC1","ENCODER"]
["UL5_09_VFD1","UL5_09_VFD1_I2","I2",null,"UL5_9_TPE1","TRACKING PHOTOEYE"]
["UL5_09_VFD1","UL5_09_VFD1_I3","I3",null,"SPARE"]
["UL5_09_VFD1","UL5_09_VFD1_IO0","IO0",null,"SPARE"]
["UL5_09_VFD1","UL5_09_VFD1_IO1","IO1",null,"SPARE"]
["UL5_09_VFD1","UL5_09_VFD1_SI0","SI0",null,"SPARE"]
["UL5_09_VFD1","UL5_09_VFD1_SI1","SI1",null,"SPARE"]
["UL5_09_VFD1","UL5_09_VFD1_SI2","SI2",null,"SPARE"]
["UL5_09_VFD1","UL5_09_VFD1_SI3","SI3",null,"SPARE"]
["UL5_09_VFD1","UL5_09_VFD1_SO0","SO0",null,"SPARE"]
["UL5_10_VFD1","UL5_10_VFD1_I0","I0",null,"UL5_10_VFD1_DISC","DISCONNECT AUX"]
["UL5_10_VFD1","UL5_10_VFD1_I1","I1",null,"SPARE"]
["UL5_10_VFD1","UL5_10_VFD1_I2","I2",null,"SPARE"]
["UL5_10_VFD1","UL5_10_VFD1_I3","I3",null,"SPARE"]
["UL5_10_VFD1","UL5_10_VFD1_IO0","IO0",null,"SPARE"]
["UL5_10_VFD1","UL5_10_VFD1_IO1","IO1",null,"SPARE"]
["UL5_10_VFD1","UL5_10_VFD1_SI0","SI0",null,"SPARE"]
["UL5_10_VFD1","UL5_10_VFD1_SI1","SI1",null,"SPARE"]
["UL5_10_VFD1","UL5_10_VFD1_SI2","SI2",null,"SPARE"]
["UL5_10_VFD1","UL5_10_VFD1_SI3","SI3",null,"SPARE"]
["UL5_10_VFD1","UL5_10_VFD1_SO0","SO0",null,"SPARE"]
["UL6_01_VFD1","UL6_01_VFD1_I0","I0",null,"UL6_1_VFD1_DISC","DISCONNECT AUX"]
["UL6_01_VFD1","UL6_01_VFD1_I1","I1",null,"SPARE"]
["UL6_01_VFD1","UL6_01_VFD1_I2","I2",null,"UL6_1_TPE1","TRACKING PHOTOEYE"]
["UL6_01_VFD1","UL6_01_VFD1_I3","I3",null,"SPARE"]
["UL6_01_VFD1","UL6_01_VFD1_IO0","IO0",null,"SPARE"]
["UL6_01_VFD1","UL6_01_VFD1_IO1","IO1",null,"SPARE"]
["UL6_01_VFD1","UL6_01_VFD1_SI0","SI0",null,"UL6_1_EPC1","E-STOP PULLCORD"]
["UL6_01_VFD1","UL6_01_VFD1_SI1","SI1",null,"UL6_1_EPC1_2","E-STOP PULLCORD"]
["UL6_01_VFD1","UL6_01_VFD1_SI2","SI2",null,"UL6_1_EPC2","E-STOP PULLCORD"]
["UL6_01_VFD1","UL6_01_VFD1_SI3","SI3",null,"UL6_1_EPC2_2","E-STOP PULLCORD"]
["UL6_01_VFD1","UL6_01_VFD1_SO0","SO0",null,"SPARE"]
["UL6_02_FIO1","UL6_02_FIO1_IO00","IO00",null,"UL6_1_BCN1_R","RED BEACON LIGHT"]
["UL6_02_FIO1","UL6_02_FIO1_IO01","IO01",null,"UL6_1_BCN2_R","RED BEACON LIGHT"]
["UL6_02_FIO1","UL6_02_FIO1_IO02","IO02",null,"UL6_1_SS1_SPB","SS STATION START PUSHBUTTON"]
["UL6_02_FIO1","UL6_02_FIO1_IO03","IO03",null,"SPARE"]
["UL6_02_FIO1","UL6_02_FIO1_IO04","IO04",null,"UL6_1_SS1_STPB","SS STATION STOP PUSHBUTTON"]
["UL6_02_FIO1","UL6_02_FIO1_IO05","IO05",null,"UL6_1_SS1_STPB_LT","SS STATION STOP PUSHBUTTON LIGHT"]
["UL6_02_FIO1","UL6_02_FIO1_IO06","IO06",null,"UL6_2_BCN1_R","RED BEACON LIGHT"]
["UL6_02_FIO1","UL6_02_FIO1_IO07","IO07",null,"UL6_2_BCN2_R","RED BEACON LIGHT"]
["UL6_02_FIO1","UL6_02_FIO1_IO08","IO08",null,"UL6_2_LPE1","LASEREYE"]
["UL6_02_FIO1","UL6_02_FIO1_IO09","IO09",null,"SPARE"]
["UL6_02_FIO1","UL6_02_FIO1_IO10","IO10",null,"UL6_2_LPE2","LASEREYE"]
["UL6_02_FIO1","UL6_02_FIO1_IO11","IO11",null,"SPARE"]
["UL6_02_FIO1","UL6_02_FIO1_IO12","IO12",null,"UL6_2_S1_PB","START PUSHBUTTON"]
["UL6_02_FIO1","UL6_02_FIO1_IO13","IO13",null,"UL6_2_S1_PB_LT","START PUSHBUTTON LIGHT"]
["UL6_02_FIO1","UL6_02_FIO1_IO14","IO14",null,"UL6_2_S2_PB","START PUSHBUTTON"]
["UL6_02_FIO1","UL6_02_FIO1_IO15","IO15",null,"UL6_2_S2_PB_LT","START PUSHBUTTON LIGHT"]
["UL6_02_VFD1","UL6_02_VFD1_I0","I0",null,"UL6_2_VFD1_DISC","DISCONNECT AUX"]
["UL6_02_VFD1","UL6_02_VFD1_I1","I1",null,"UL6_2_ENC1","ENCODER"]
["UL6_02_VFD1","UL6_02_VFD1_I2","I2",null,"UL6_2_TPE1","TRACKING PHOTOEYE"]
["UL6_02_VFD1","UL6_02_VFD1_I3","I3",null,"UL6_2_TPE2","TRACKING PHOTOEYE"]
["UL6_02_VFD1","UL6_02_VFD1_IO0","IO0",null,"SPARE"]
["UL6_02_VFD1","UL6_02_VFD1_IO1","IO1",null,"SPARE"]
["UL6_02_VFD1","UL6_02_VFD1_SI0","SI0",null,"UL6_2_EPC1","E-STOP PULLCORD"]
["UL6_02_VFD1","UL6_02_VFD1_SI1","SI1",null,"UL6_2_EPC1_2","E-STOP PULLCORD"]
["UL6_02_VFD1","UL6_02_VFD1_SI2","SI2",null,"UL6_2_EPC2","E-STOP PULLCORD"]
["UL6_02_VFD1","UL6_02_VFD1_SI3","SI3",null,"UL6_2_EPC2_2","E-STOP PULLCORD"]
["UL6_02_VFD1","UL6_02_VFD1_SO0","SO0",null,"SPARE"]
["UL6_03_VFD1","UL6_03_VFD1_I0","I0",null,"UL6_3_VFD1_DISC","DISCONNECT AUX"]
["UL6_03_VFD1","UL6_03_VFD1_I1","I1",null,"UL6_3_ENC1","ENCODER"]
["UL6_03_VFD1","UL6_03_VFD1_I2","I2",null,"SPARE"]
["UL6_03_VFD1","UL6_03_VFD1_I3","I3",null,"SPARE"]
["UL6_03_VFD1","UL6_03_VFD1_IO0","IO0",null,"SPARE"]
["UL6_03_VFD1","UL6_03_VFD1_IO1","IO1",null,"SPARE"]
["UL6_03_VFD1","UL6_03_VFD1_SI0","SI0",null,"SPARE"]
["UL6_03_VFD1","UL6_03_VFD1_SI1","SI1",null,"SPARE"]
["UL6_03_VFD1","UL6_03_VFD1_SI2","SI2",null,"SPARE"]
["UL6_03_VFD1","UL6_03_VFD1_SI3","SI3",null,"SPARE"]
["UL6_03_VFD1","UL6_03_VFD1_SO0","SO0",null,"SPARE"]
["UL6_04_VFD1","UL6_04_VFD1_I0","I0",null,"UL6_4_VFD1_DISC","DISCONNECT AUX"]
["UL6_04_VFD1","UL6_04_VFD1_I1","I1",null,"UL6_4_ENC1","ENCODER"]
["UL6_04_VFD1","UL6_04_VFD1_I2","I2",null,"UL6_4_TPE1","TRACKING PHOTOEYE"]
["UL6_04_VFD1","UL6_04_VFD1_I3","I3",null,"UL6_4_TPE2","TRACKING PHOTOEYE"]
["UL6_04_VFD1","UL6_04_VFD1_IO0","IO0",null,"SPARE"]
["UL6_04_VFD1","UL6_04_VFD1_IO1","IO1",null,"SPARE"]
["UL6_04_VFD1","UL6_04_VFD1_SI0","SI0",null,"SPARE"]
["UL6_04_VFD1","UL6_04_VFD1_SI1","SI1",null,"SPARE"]
["UL6_04_VFD1","UL6_04_VFD1_SI2","SI2",null,"SPARE"]
["UL6_04_VFD1","UL6_04_VFD1_SI3","SI3",null,"SPARE"]
["UL6_04_VFD1","UL6_04_VFD1_SO0","SO0",null,"SPARE"]
["UL6_05_VFD1","UL6_05_VFD1_I0","I0",null,"UL6_5_VFD1_DISC","DISCONNECT AUX"]
["UL6_05_VFD1","UL6_05_VFD1_I1","I1",null,"UL6_5_ENC1","ENCODER"]
["UL6_05_VFD1","UL6_05_VFD1_I2","I2",null,"UL6_5_TPE1","TRACKING PHOTOEYE"]
["UL6_05_VFD1","UL6_05_VFD1_I3","I3",null,"SPARE"]
["UL6_05_VFD1","UL6_05_VFD1_IO0","IO0",null,"SPARE"]
["UL6_05_VFD1","UL6_05_VFD1_IO1","IO1",null,"SPARE"]
["UL6_05_VFD1","UL6_05_VFD1_SI0","SI0",null,"SPARE"]
["UL6_05_VFD1","UL6_05_VFD1_SI1","SI1",null,"SPARE"]
["UL6_05_VFD1","UL6_05_VFD1_SI2","SI2",null,"SPARE"]
["UL6_05_VFD1","UL6_05_VFD1_SI3","SI3",null,"SPARE"]
["UL6_05_VFD1","UL6_05_VFD1_SO0","SO0",null,"SPARE"]
["UL6_06_VFD1","UL6_06_VFD1_I0","I0",null,"UL6_6_VFD1_DISC","DISCONNECT AUX"]
["UL6_06_VFD1","UL6_06_VFD1_I1","I1",null,"UL6_6_ENC1","ENCODER"]
["UL6_06_VFD1","UL6_06_VFD1_I2","I2",null,"UL6_6_TPE1","TRACKING PHOTOEYE"]
["UL6_06_VFD1","UL6_06_VFD1_I3","I3",null,"SPARE"]
["UL6_06_VFD1","UL6_06_VFD1_IO0","IO0",null,"SPARE"]
["UL6_06_VFD1","UL6_06_VFD1_IO1","IO1",null,"SPARE"]
["UL6_06_VFD1","UL6_06_VFD1_SI0","SI0",null,"SPARE"]
["UL6_06_VFD1","UL6_06_VFD1_SI1","SI1",null,"SPARE"]
["UL6_06_VFD1","UL6_06_VFD1_SI2","SI2",null,"SPARE"]
["UL6_06_VFD1","UL6_06_VFD1_SI3","SI3",null,"SPARE"]
["UL6_06_VFD1","UL6_06_VFD1_SO0","SO0",null,"SPARE"]
["UL6_07_VFD1","UL6_07_VFD1_I0","I0",null,"UL6_7_VFD1_DISC","DISCONNECT AUX"]
["UL6_07_VFD1","UL6_07_VFD1_I1","I1",null,"UL6_7_ENC1","ENCODER"]
["UL6_07_VFD1","UL6_07_VFD1_I2","I2",null,"UL6_7_TPE1","TRACKING PHOTOEYE"]
["UL6_07_VFD1","UL6_07_VFD1_I3","I3",null,"SPARE"]
["UL6_07_VFD1","UL6_07_VFD1_IO0","IO0",null,"SPARE"]
["UL6_07_VFD1","UL6_07_VFD1_IO1","IO1",null,"SPARE"]
["UL6_07_VFD1","UL6_07_VFD1_SI0","SI0",null,"SPARE"]
["UL6_07_VFD1","UL6_07_VFD1_SI1","SI1",null,"SPARE"]
["UL6_07_VFD1","UL6_07_VFD1_SI2","SI2",null,"SPARE"]
["UL6_07_VFD1","UL6_07_VFD1_SI3","SI3",null,"SPARE"]
["UL6_07_VFD1","UL6_07_VFD1_SO0","SO0",null,"SPARE"]
["UL6_08_VFD1","UL6_08_VFD1_I0","I0",null,"UL6_8_VFD1_DISC","DISCONNECT AUX"]
["UL6_08_VFD1","UL6_08_VFD1_I1","I1",null,"UL6_8_ENC1","ENCODER"]
["UL6_08_VFD1","UL6_08_VFD1_I2","I2",null,"UL6_8_TPE1","TRACKING PHOTOEYE"]
["UL6_08_VFD1","UL6_08_VFD1_I3","I3",null,"SPARE"]
["UL6_08_VFD1","UL6_08_VFD1_IO0","IO0",null,"SPARE"]
["UL6_08_VFD1","UL6_08_VFD1_IO1","IO1",null,"SPARE"]
["UL6_08_VFD1","UL6_08_VFD1_SI0","SI0",null,"SPARE"]
["UL6_08_VFD1","UL6_08_VFD1_SI1","SI1",null,"SPARE"]
["UL6_08_VFD1","UL6_08_VFD1_SI2","SI2",null,"SPARE"]
["UL6_08_VFD1","UL6_08_VFD1_SI3","SI3",null,"SPARE"]
["UL6_08_VFD1","UL6_08_VFD1_SO0","SO0",null,"SPARE"]
["UL6_09_VFD1","UL6_09_VFD1_I0","I0",null,"UL6_9_VFD1_DISC","DISCONNECT AUX"]
["UL6_09_VFD1","UL6_09_VFD1_I1","I1",null,"SPARE"]
["UL6_09_VFD1","UL6_09_VFD1_I2","I2",null,"SPARE"]
["UL6_09_VFD1","UL6_09_VFD1_I3","I3",null,"SPARE"]
["UL6_09_VFD1","UL6_09_VFD1_IO0","IO0",null,"SPARE"]
["UL6_09_VFD1","UL6_09_VFD1_IO1","IO1",null,"SPARE"]
["UL6_09_VFD1","UL6_09_VFD1_SI0","SI0",null,"SPARE"]
["UL6_09_VFD1","UL6_09_VFD1_SI1","SI1",null,"SPARE"]
["UL6_09_VFD1","UL6_09_VFD1_SI2","SI2",null,"SPARE"]
["UL6_09_VFD1","UL6_09_VFD1_SI3","SI3",null,"SPARE"]
["UL6_09_VFD1","UL6_09_VFD1_SO0","SO0",null,"SPARE"]
["UL7_03_FIO1","UL7_03_FIO1_IO00","IO00",null,"UL7_3_BCN1_R","RED BEACON LIGHT"]
["UL7_03_FIO1","UL7_03_FIO1_IO01","IO01",null,"SPARE"]
["UL7_03_FIO1","UL7_03_FIO1_IO02","IO02",null,"UL7_3_BCN2_R","RED BEACON LIGHT"]
["UL7_03_FIO1","UL7_03_FIO1_IO03","IO03",null,"SPARE"]
["UL7_03_FIO1","UL7_03_FIO1_IO04","IO04",null,"UL7_3_LPE1","LASEREYE"]
["UL7_03_FIO1","UL7_03_FIO1_IO05","IO05",null,"SPARE"]
["UL7_03_FIO1","UL7_03_FIO1_IO06","IO06",null,"UL7_3_LPE2","LASEREYE"]
["UL7_03_FIO1","UL7_03_FIO1_IO07","IO07",null,"SPARE"]
["UL7_03_FIO1","UL7_03_FIO1_IO08","IO08",null,"UL7_3_S1_PB","START PUSHBUTTON"]
["UL7_03_FIO1","UL7_03_FIO1_IO09","IO09",null,"UL7_3_S1_PB_LT","START PUSHBUTTON LIGHT"]
["UL7_03_FIO1","UL7_03_FIO1_IO10","IO10",null,"UL7_3_S2_PB","START PUSHBUTTON"]
["UL7_03_FIO1","UL7_03_FIO1_IO11","IO11",null,"UL7_3_S2_PB_LT","START PUSHBUTTON LIGHT"]
["UL7_03_FIO1","UL7_03_FIO1_IO12","IO12",null,"SPARE"]
["UL7_03_FIO1","UL7_03_FIO1_IO13","IO13",null,"SPARE"]
["UL7_03_FIO1","UL7_03_FIO1_IO14","IO14",null,"SPARE"]
["UL7_03_FIO1","UL7_03_FIO1_IO15","IO15",null,"SPARE"]
["UL7_03_VFD1","UL7_03_VFD1_I0","I0",null,"UL7_3_VFD1_DISC","DISCONNECT AUX"]
["UL7_03_VFD1","UL7_03_VFD1_I1","I1",null,"UL7_3_ENC1","ENCODER"]
["UL7_03_VFD1","UL7_03_VFD1_I2","I2",null,"UL7_3_TPE1","TRACKING PHOTOEYE"]
["UL7_03_VFD1","UL7_03_VFD1_I3","I3",null,"UL7_3_TPE2","TRACKING PHOTOEYE"]
["UL7_03_VFD1","UL7_03_VFD1_IO0","IO0",null,"UL7_4_S1_PB","START PUSHBUTTON"]
["UL7_03_VFD1","UL7_03_VFD1_IO1","IO1",null,"UL7_4_S1_PB_LT","START PUSHBUTTON LIGHT"]
["UL7_03_VFD1","UL7_03_VFD1_SI0","SI0",null,"UL7_3_EPC1","E-STOP PULLCORD"]
["UL7_03_VFD1","UL7_03_VFD1_SI1","SI1",null,"UL7_3_EPC1_2","E-STOP PULLCORD"]
["UL7_03_VFD1","UL7_03_VFD1_SI2","SI2",null,"UL7_3_EPC2","E-STOP PULLCORD"]
["UL7_03_VFD1","UL7_03_VFD1_SI3","SI3",null,"UL7_3_EPC2_2","E-STOP PULLCORD"]
["UL7_03_VFD1","UL7_03_VFD1_SO0","SO0",null,"SPARE"]
["UL7_04_VFD1","UL7_04_VFD1_I0","I0",null,"UL7_4_VFD1_DISC","DISCONNECT AUX"]
["UL7_04_VFD1","UL7_04_VFD1_I1","I1",null,"UL7_4_ENC1","ENCODER"]
["UL7_04_VFD1","UL7_04_VFD1_I2","I2",null,"UL7_4_TPE1","TRACKING PHOTOEYE"]
["UL7_04_VFD1","UL7_04_VFD1_I3","I3",null,"SPARE"]
["UL7_04_VFD1","UL7_04_VFD1_IO0","IO0",null,"UL7_4_BCN1_R","RED BEACON LIGHT"]
["UL7_04_VFD1","UL7_04_VFD1_IO1","IO1",null,"UL7_4_BCN2_R","RED BEACON LIGHT"]
["UL7_04_VFD1","UL7_04_VFD1_SI0","SI0",null,"UL7_4_EPC1","E-STOP PULLCORD"]
["UL7_04_VFD1","UL7_04_VFD1_SI1","SI1",null,"UL7_4_EPC1_2","E-STOP PULLCORD"]
["UL7_04_VFD1","UL7_04_VFD1_SI2","SI2",null,"UL7_4_EPC2","E-STOP PULLCORD"]
["UL7_04_VFD1","UL7_04_VFD1_SI3","SI3",null,"UL7_4_EPC2_2","E-STOP PULLCORD"]
["UL7_04_VFD1","UL7_04_VFD1_SO0","SO0",null,"SPARE"]
["UL7_05_VFD1","UL7_05_VFD1_I0","I0",null,"UL7_5_VFD1_DISC","DISCONNECT AUX"]
["UL7_05_VFD1","UL7_05_VFD1_I1","I1",null,"UL7_5_ENC1","ENCODER"]
["UL7_05_VFD1","UL7_05_VFD1_I2","I2",null,"UL7_5_TPE1","TRACKING PHOTOEYE"]
["UL7_05_VFD1","UL7_05_VFD1_I3","I3",null,"SPARE"]
["UL7_05_VFD1","UL7_05_VFD1_IO0","IO0",null,"UL7_4_S2_PB","START PUSHBUTTON"]
["UL7_05_VFD1","UL7_05_VFD1_IO1","IO1",null,"UL7_4_S2_PB_LT","START PUSHBUTTON LIGHT"]
["UL7_05_VFD1","UL7_05_VFD1_SI0","SI0",null,"SPARE"]
["UL7_05_VFD1","UL7_05_VFD1_SI1","SI1",null,"SPARE"]
["UL7_05_VFD1","UL7_05_VFD1_SI2","SI2",null,"SPARE"]
["UL7_05_VFD1","UL7_05_VFD1_SI3","SI3",null,"SPARE"]
["UL7_05_VFD1","UL7_05_VFD1_SO0","SO0",null,"SPARE"]
["UL7_06_VFD1","UL7_06_VFD1_I0","I0",null,"UL7_6_VFD1_DISC","DISCONNECT AUX"]
["UL7_06_VFD1","UL7_06_VFD1_I1","I1",null,"UL7_6_ENC1","ENCODER"]
["UL7_06_VFD1","UL7_06_VFD1_I2","I2",null,"UL7_6_TPE1","TRACKING PHOTOEYE"]
["UL7_06_VFD1","UL7_06_VFD1_I3","I3",null,"SPARE"]
["UL7_06_VFD1","UL7_06_VFD1_IO0","IO0",null,"UL7_9_S1_PB","START PUSHBUTTON"]
["UL7_06_VFD1","UL7_06_VFD1_IO1","IO1",null,"UL7_9_S1_PB_LT","START PUSHBUTTON LIGHT"]
["UL7_06_VFD1","UL7_06_VFD1_SI0","SI0",null,"SPARE"]
["UL7_06_VFD1","UL7_06_VFD1_SI1","SI1",null,"SPARE"]
["UL7_06_VFD1","UL7_06_VFD1_SI2","SI2",null,"SPARE"]
["UL7_06_VFD1","UL7_06_VFD1_SI3","SI3",null,"SPARE"]
["UL7_06_VFD1","UL7_06_VFD1_SO0","SO0",null,"SPARE"]
["UL7_07_VFD1","UL7_07_VFD1_I0","I0",null,"UL7_7_VFD1_DISC","DISCONNECT AUX"]
["UL7_07_VFD1","UL7_07_VFD1_I1","I1",null,"UL7_7_ENC1","ENCODER"]
["UL7_07_VFD1","UL7_07_VFD1_I2","I2",null,"UL7_7_TPE1","TRACKING PHOTOEYE"]
["UL7_07_VFD1","UL7_07_VFD1_I3","I3",null,"SPARE"]
["UL7_07_VFD1","UL7_07_VFD1_IO0","IO0",null,"UL7_9_JR2_PB","JAM RESET PUSHBUTTON"]
["UL7_07_VFD1","UL7_07_VFD1_IO1","IO1",null,"UL7_9_JR2_PB_LT","JAM RESET PUSHBUTTON LIGHT"]
["UL7_07_VFD1","UL7_07_VFD1_SI0","SI0",null,"SPARE"]
["UL7_07_VFD1","UL7_07_VFD1_SI1","SI1",null,"SPARE"]
["UL7_07_VFD1","UL7_07_VFD1_SI2","SI2",null,"SPARE"]
["UL7_07_VFD1","UL7_07_VFD1_SI3","SI3",null,"SPARE"]
["UL7_07_VFD1","UL7_07_VFD1_SO0","SO0",null,"SPARE"]
["UL7_08_VFD1","UL7_08_VFD1_I0","I0",null,"UL7_8_VFD1_DISC","DISCONNECT AUX"]
["UL7_08_VFD1","UL7_08_VFD1_I1","I1",null,"UL7_8_ENC1","ENCODER"]
["UL7_08_VFD1","UL7_08_VFD1_I2","I2",null,"UL7_8_TPE1","TRACKING PHOTOEYE"]
["UL7_08_VFD1","UL7_08_VFD1_I3","I3",null,"SPARE"]
["UL7_08_VFD1","UL7_08_VFD1_IO0","IO0",null,"UL7_9_JR1_PB","JAM RESET PUSHBUTTON"]
["UL7_08_VFD1","UL7_08_VFD1_IO1","IO1",null,"UL7_9_JR1_PB_LT","JAM RESET PUSHBUTTON LIGHT"]
["UL7_08_VFD1","UL7_08_VFD1_SI0","SI0",null,"SPARE"]
["UL7_08_VFD1","UL7_08_VFD1_SI1","SI1",null,"SPARE"]
["UL7_08_VFD1","UL7_08_VFD1_SI2","SI2",null,"SPARE"]
["UL7_08_VFD1","UL7_08_VFD1_SI3","SI3",null,"SPARE"]
["UL7_08_VFD1","UL7_08_VFD1_SO0","SO0",null,"SPARE"]
["UL7_09_VFD1","UL7_09_VFD1_I0","I0",null,"UL7_9_VFD1_DISC","DISCONNECT AUX"]
["UL7_09_VFD1","UL7_09_VFD1_I1","I1",null,"SPARE"]
["UL7_09_VFD1","UL7_09_VFD1_I2","I2",null,"UL7_9_TPE1","TRACKING PHOTOEYE"]
["UL7_09_VFD1","UL7_09_VFD1_I3","I3",null,"UL7_9_TPE2","TRACKING PHOTOEYE"]
["UL7_09_VFD1","UL7_09_VFD1_IO0","IO0",null,"UL7_9_BCN1_A","AMBER BEACON LIGHT"]
["UL7_09_VFD1","UL7_09_VFD1_IO1","IO1",null,"UL7_9_BCN1_R","RED BEACON LIGHT"]
["UL7_09_VFD1","UL7_09_VFD1_SI0","SI0",null,"UL7_9_EPC1","E-STOP PULLCORD"]
["UL7_09_VFD1","UL7_09_VFD1_SI1","SI1",null,"UL7_9_EPC1_2","E-STOP PULLCORD"]
["UL7_09_VFD1","UL7_09_VFD1_SI2","SI2",null,"UL7_9_EPC2","E-STOP PULLCORD"]
["UL7_09_VFD1","UL7_09_VFD1_SI3","SI3",null,"UL7_9_EPC2_2","E-STOP PULLCORD"]
["UL7_09_VFD1","UL7_09_VFD1_SO0","SO0",null,"UL7_9_BCN2_R","RED BEACON LIGHT"]
["UL7_10A_VFD1","UL7_10A_VFD1_I0","I0",null,"UL7_10A_VFD1_DISC","DISCONNECT AUX"]
["UL7_10A_VFD1","UL7_10A_VFD1_I1","I1",null,"UL7_9_TPE4","TRACKING PHOTOEYE"]
["UL7_10A_VFD1","UL7_10A_VFD1_I2","I2",null,"UL7_9_TPE5","TRACKING PHOTOEYE"]
["UL7_10A_VFD1","UL7_10A_VFD1_I3","I3",null,"SPARE"]
["UL7_10A_VFD1","UL7_10A_VFD1_IO0","IO0",null,"UL7_9_S2_PB","START PUSHBUTTON"]
["UL7_10A_VFD1","UL7_10A_VFD1_IO1","IO1",null,"UL7_9_S2_PB_LT","START PUSHBUTTON LIGHT"]
["UL7_10A_VFD1","UL7_10A_VFD1_SI0","SI0",null,"SPARE"]
["UL7_10A_VFD1","UL7_10A_VFD1_SI1","SI1",null,"SPARE"]
["UL7_10A_VFD1","UL7_10A_VFD1_SI2","SI2",null,"SPARE"]
["UL7_10A_VFD1","UL7_10A_VFD1_SI3","SI3",null,"SPARE"]
["UL7_10A_VFD1","UL7_10A_VFD1_SO0","SO0",null,"SPARE"]
["UL7_10B_VFD1","UL7_10B_VFD1_I0","I0",null,"UL7_10B_VFD1_DISC","DISCONNECT AUX"]
["UL7_10B_VFD1","UL7_10B_VFD1_I1","I1",null,"SPARE"]
["UL7_10B_VFD1","UL7_10B_VFD1_I2","I2",null,"SPARE"]
["UL7_10B_VFD1","UL7_10B_VFD1_I3","I3",null,"SPARE"]
["UL7_10B_VFD1","UL7_10B_VFD1_IO0","IO0",null,"SPARE"]
["UL7_10B_VFD1","UL7_10B_VFD1_IO1","IO1",null,"SPARE"]
["UL7_10B_VFD1","UL7_10B_VFD1_SI0","SI0",null,"SPARE"]
["UL7_10B_VFD1","UL7_10B_VFD1_SI1","SI1",null,"SPARE"]
["UL7_10B_VFD1","UL7_10B_VFD1_SI2","SI2",null,"SPARE"]
["UL7_10B_VFD1","UL7_10B_VFD1_SI3","SI3",null,"SPARE"]
["UL7_10B_VFD1","UL7_10B_VFD1_SO0","SO0",null,"SPARE"]
["UL7_11_VFD1","UL7_11_VFD1_I0","I0",null,"UL7_11_VFD1_DISC","DISCONNECT AUX"]
["UL7_11_VFD1","UL7_11_VFD1_I1","I1",null,"SPARE"]
["UL7_11_VFD1","UL7_11_VFD1_I2","I2",null,"UL7_11_TPE1","TRACKING PHOTOEYE"]
["UL7_11_VFD1","UL7_11_VFD1_I3","I3",null,"UL7_11_TPE2","TRACKING PHOTOEYE"]
["UL7_11_VFD1","UL7_11_VFD1_IO0","IO0",null,"SPARE"]
["UL7_11_VFD1","UL7_11_VFD1_IO1","IO1",null,"SPARE"]
["UL7_11_VFD1","UL7_11_VFD1_SI0","SI0",null,"SPARE"]
["UL7_11_VFD1","UL7_11_VFD1_SI1","SI1",null,"SPARE"]
["UL7_11_VFD1","UL7_11_VFD1_SI2","SI2",null,"SPARE"]
["UL7_11_VFD1","UL7_11_VFD1_SI3","SI3",null,"SPARE"]
["UL7_11_VFD1","UL7_11_VFD1_SO0","SO0",null,"SPARE"]
["UL7_12_VFD1","UL7_12_VFD1_I0","I0",null,"UL7_12_VFD1_DISC","DISCONNECT AUX"]
["UL7_12_VFD1","UL7_12_VFD1_I1","I1",null,"SPARE"]
["UL7_12_VFD1","UL7_12_VFD1_I2","I2",null,"UL7_12_TPE1","TRACKING PHOTOEYE"]
["UL7_12_VFD1","UL7_12_VFD1_I3","I3",null,"SPARE"]
["UL7_12_VFD1","UL7_12_VFD1_IO0","IO0",null,"SPARE"]
["UL7_12_VFD1","UL7_12_VFD1_IO1","IO1",null,"SPARE"]
["UL7_12_VFD1","UL7_12_VFD1_SI0","SI0",null,"SPARE"]
["UL7_12_VFD1","UL7_12_VFD1_SI1","SI1",null,"SPARE"]
["UL7_12_VFD1","UL7_12_VFD1_SI2","SI2",null,"SPARE"]
["UL7_12_VFD1","UL7_12_VFD1_SI3","SI3",null,"SPARE"]
["UL7_12_VFD1","UL7_12_VFD1_SO0","SO0",null,"SPARE"]
["UL7_13_VFD1","UL7_13_VFD1_I0","I0",null,"UL7_13_VFD1_DISC","DISCONNECT AUX"]
["UL7_13_VFD1","UL7_13_VFD1_I1","I1",null,"SPARE"]
["UL7_13_VFD1","UL7_13_VFD1_I2","I2",null,"SPARE"]
["UL7_13_VFD1","UL7_13_VFD1_I3","I3",null,"SPARE"]
["UL7_13_VFD1","UL7_13_VFD1_IO0","IO0",null,"SPARE"]
["UL7_13_VFD1","UL7_13_VFD1_IO1","IO1",null,"SPARE"]
["UL7_13_VFD1","UL7_13_VFD1_SI0","SI0",null,"SPARE"]
["UL7_13_VFD1","UL7_13_VFD1_SI1","SI1",null,"SPARE"]
["UL7_13_VFD1","UL7_13_VFD1_SI2","SI2",null,"SPARE"]
["UL7_13_VFD1","UL7_13_VFD1_SI3","SI3",null,"SPARE"]
["UL7_13_VFD1","UL7_13_VFD1_SO0","SO0",null,"SPARE"]
["UL8_01_VFD1","UL8_01_VFD1_I0","I0",null,"UL8_1_VFD1_DISC","DISCONNECT AUX"]
["UL8_01_VFD1","UL8_01_VFD1_I1","I1",null,"SPARE"]
["UL8_01_VFD1","UL8_01_VFD1_I2","I2",null,"UL8_1_TPE1","TRACKING PHOTOEYE"]
["UL8_01_VFD1","UL8_01_VFD1_I3","I3",null,"SPARE"]
["UL8_01_VFD1","UL8_01_VFD1_IO0","IO0",null,"SPARE"]
["UL8_01_VFD1","UL8_01_VFD1_IO1","IO1",null,"SPARE"]
["UL8_01_VFD1","UL8_01_VFD1_SI0","SI0",null,"UL8_1_EPC1","E-STOP PULLCORD"]
["UL8_01_VFD1","UL8_01_VFD1_SI1","SI1",null,"UL8_1_EPC1_2","E-STOP PULLCORD"]
["UL8_01_VFD1","UL8_01_VFD1_SI2","SI2",null,"UL8_1_EPC2","E-STOP PULLCORD"]
["UL8_01_VFD1","UL8_01_VFD1_SI3","SI3",null,"UL8_1_EPC2_2","E-STOP PULLCORD"]
["UL8_01_VFD1","UL8_01_VFD1_SO0","SO0",null,"SPARE"]
["UL8_02_FIO1","UL8_02_FIO1_IO00","IO00",null,"UL8_1_BCN1_R","RED BEACON LIGHT"]
["UL8_02_FIO1","UL8_02_FIO1_IO01","IO01",null,"SPARE"]
["UL8_02_FIO1","UL8_02_FIO1_IO02","IO02",null,"UL8_1_BCN2_R","RED BEACON LIGHT"]
["UL8_02_FIO1","UL8_02_FIO1_IO03","IO03",null,"SPARE"]
["UL8_02_FIO1","UL8_02_FIO1_IO04","IO04",null,"UL8_1_SS1_SPB","SS STATION START PUSHBUTTON"]
["UL8_02_FIO1","UL8_02_FIO1_IO05","IO05",null,"SPARE"]
["UL8_02_FIO1","UL8_02_FIO1_IO06","IO06",null,"UL8_1_SS1_STPB","SS STATION STOP PUSHBUTTON"]
["UL8_02_FIO1","UL8_02_FIO1_IO07","IO07",null,"UL8_1_SS1_STPB_LT","SS STATION STOP PUSHBUTTON LIGHT"]
["UL8_02_FIO1","UL8_02_FIO1_IO08","IO08",null,"UL8_2_LPE1","LASEREYE"]
["UL8_02_FIO1","UL8_02_FIO1_IO09","IO09",null,"SPARE"]
["UL8_02_FIO1","UL8_02_FIO1_IO10","IO10",null,"UL8_2_LPE2","LASEREYE"]
["UL8_02_FIO1","UL8_02_FIO1_IO11","IO11",null,"SPARE"]
["UL8_02_FIO1","UL8_02_FIO1_IO12","IO12",null,"SPARE"]
["UL8_02_FIO1","UL8_02_FIO1_IO13","IO13",null,"SPARE"]
["UL8_02_FIO1","UL8_02_FIO1_IO14","IO14",null,"SPARE"]
["UL8_02_FIO1","UL8_02_FIO1_IO15","IO15",null,"SPARE"]
["UL8_02_VFD1","UL8_02_VFD1_I0","I0",null,"UL8_2_VFD1_DISC","DISCONNECT AUX"]
["UL8_02_VFD1","UL8_02_VFD1_I1","I1",null,"SPARE"]
["UL8_02_VFD1","UL8_02_VFD1_I2","I2",null,"UL8_2_TPE1","TRACKING PHOTOEYE"]
["UL8_02_VFD1","UL8_02_VFD1_I3","I3",null,"UL8_2_TPE2","TRACKING PHOTOEYE"]
["UL8_02_VFD1","UL8_02_VFD1_IO0","IO0",null,"SPARE"]
["UL8_02_VFD1","UL8_02_VFD1_IO1","IO1",null,"SPARE"]
["UL8_02_VFD1","UL8_02_VFD1_SI0","SI0",null,"SPARE"]
["UL8_02_VFD1","UL8_02_VFD1_SI1","SI1",null,"SPARE"]
["UL8_02_VFD1","UL8_02_VFD1_SI2","SI2",null,"SPARE"]
["UL8_02_VFD1","UL8_02_VFD1_SI3","SI3",null,"SPARE"]
["UL8_02_VFD1","UL8_02_VFD1_SO0","SO0",null,"SPARE"]
["UL8_03_VFD1","UL8_03_VFD1_I0","I0",null,"UL8_3_VFD1_DISC","DISCONNECT AUX"]
["UL8_03_VFD1","UL8_03_VFD1_I1","I1",null,"UL8_3_ENC1","ENCODER"]
["UL8_03_VFD1","UL8_03_VFD1_I2","I2",null,"UL8_3_TPE1","TRACKING PHOTOEYE"]
["UL8_03_VFD1","UL8_03_VFD1_I3","I3",null,"SPARE"]
["UL8_03_VFD1","UL8_03_VFD1_IO0","IO0",null,"UL8_3_BCN1_R","RED BEACON LIGHT"]
["UL8_03_VFD1","UL8_03_VFD1_IO1","IO1",null,"UL8_3_BCN2_R","RED BEACON LIGHT"]
["UL8_03_VFD1","UL8_03_VFD1_SI0","SI0",null,"UL8_3_EPC1","E-STOP PULLCORD"]
["UL8_03_VFD1","UL8_03_VFD1_SI1","SI1",null,"UL8_3_EPC1_2","E-STOP PULLCORD"]
["UL8_03_VFD1","UL8_03_VFD1_SI2","SI2",null,"UL8_3_EPC2","E-STOP PULLCORD"]
["UL8_03_VFD1","UL8_03_VFD1_SI3","SI3",null,"UL8_3_EPC2_2","E-STOP PULLCORD"]
["UL8_03_VFD1","UL8_03_VFD1_SO0","SO0",null,"SPARE"]
["UL8_04_VFD1","UL8_04_VFD1_I0","I0",null,"UL8_4_VFD1_DISC","DISCONNECT AUX"]
["UL8_04_VFD1","UL8_04_VFD1_I1","I1",null,"UL8_4_ENC1","ENCODER"]
["UL8_04_VFD1","UL8_04_VFD1_I2","I2",null,"SPARE"]
["UL8_04_VFD1","UL8_04_VFD1_I3","I3",null,"SPARE"]
["UL8_04_VFD1","UL8_04_VFD1_IO0","IO0",null,"UL8_3_S1_PB","START PUSHBUTTON"]
["UL8_04_VFD1","UL8_04_VFD1_IO1","IO1",null,"UL8_3_S1_PB_LT","START PUSHBUTTON LIGHT"]
["UL8_04_VFD1","UL8_04_VFD1_SI0","SI0",null,"SPARE"]
["UL8_04_VFD1","UL8_04_VFD1_SI1","SI1",null,"SPARE"]
["UL8_04_VFD1","UL8_04_VFD1_SI2","SI2",null,"SPARE"]
["UL8_04_VFD1","UL8_04_VFD1_SI3","SI3",null,"SPARE"]
["UL8_04_VFD1","UL8_04_VFD1_SO0","SO0",null,"SPARE"]
["UL8_05_VFD1","UL8_05_VFD1_I0","I0",null,"UL8_5_VFD1_DISC","DISCONNECT AUX"]
["UL8_05_VFD1","UL8_05_VFD1_I1","I1",null,"UL8_5_ENC1","ENCODER"]
["UL8_05_VFD1","UL8_05_VFD1_I2","I2",null,"UL8_5_TPE1","TRACKING PHOTOEYE"]
["UL8_05_VFD1","UL8_05_VFD1_I3","I3",null,"UL8_5_TPE2","TRACKING PHOTOEYE"]
["UL8_05_VFD1","UL8_05_VFD1_IO0","IO0",null,"UL8_3_S2_PB","START PUSHBUTTON"]
["UL8_05_VFD1","UL8_05_VFD1_IO1","IO1",null,"UL8_3_S2_PB_LT","START PUSHBUTTON LIGHT"]
["UL8_05_VFD1","UL8_05_VFD1_SI0","SI0",null,"SPARE"]
["UL8_05_VFD1","UL8_05_VFD1_SI1","SI1",null,"SPARE"]
["UL8_05_VFD1","UL8_05_VFD1_SI2","SI2",null,"SPARE"]
["UL8_05_VFD1","UL8_05_VFD1_SI3","SI3",null,"SPARE"]
["UL8_05_VFD1","UL8_05_VFD1_SO0","SO0",null,"SPARE"]
["UL8_06_VFD1","UL8_06_VFD1_I0","I0",null,"UL8_6_VFD1_DISC","DISCONNECT AUX"]
["UL8_06_VFD1","UL8_06_VFD1_I1","I1",null,"UL8_6_ENC1","ENCODER"]
["UL8_06_VFD1","UL8_06_VFD1_I2","I2",null,"UL8_6_TPE1","TRACKING PHOTOEYE"]
["UL8_06_VFD1","UL8_06_VFD1_I3","I3",null,"SPARE"]
["UL8_06_VFD1","UL8_06_VFD1_IO0","IO0",null,"SPARE"]
["UL8_06_VFD1","UL8_06_VFD1_IO1","IO1",null,"SPARE"]
["UL8_06_VFD1","UL8_06_VFD1_SI0","SI0",null,"SPARE"]
["UL8_06_VFD1","UL8_06_VFD1_SI1","SI1",null,"SPARE"]
["UL8_06_VFD1","UL8_06_VFD1_SI2","SI2",null,"SPARE"]
["UL8_06_VFD1","UL8_06_VFD1_SI3","SI3",null,"SPARE"]
["UL8_06_VFD1","UL8_06_VFD1_SO0","SO0",null,"SPARE"]
["UL8_07_VFD1","UL8_07_VFD1_I0","I0",null,"UL8_7_VFD1_DISC","DISCONNECT AUX"]
["UL8_07_VFD1","UL8_07_VFD1_I1","I1",null,"UL8_7_ENC1","ENCODER"]
["UL8_07_VFD1","UL8_07_VFD1_I2","I2",null,"UL8_7_TPE1","TRACKING PHOTOEYE"]
["UL8_07_VFD1","UL8_07_VFD1_I3","I3",null,"SPARE"]
["UL8_07_VFD1","UL8_07_VFD1_IO0","IO0",null,"SPARE"]
["UL8_07_VFD1","UL8_07_VFD1_IO1","IO1",null,"SPARE"]
["UL8_07_VFD1","UL8_07_VFD1_SI0","SI0",null,"SPARE"]
["UL8_07_VFD1","UL8_07_VFD1_SI1","SI1",null,"SPARE"]
["UL8_07_VFD1","UL8_07_VFD1_SI2","SI2",null,"SPARE"]
["UL8_07_VFD1","UL8_07_VFD1_SI3","SI3",null,"SPARE"]
["UL8_07_VFD1","UL8_07_VFD1_SO0","SO0",null,"SPARE"]
["UL8_08_VFD1","UL8_08_VFD1_I0","I0",null,"UL8_8_VFD1_DISC","DISCONNECT AUX"]
["UL8_08_VFD1","UL8_08_VFD1_I1","I1",null,"UL8_8_ENC1","ENCODER"]
["UL8_08_VFD1","UL8_08_VFD1_I2","I2",null,"UL8_8_TPE1","TRACKING PHOTOEYE"]
["UL8_08_VFD1","UL8_08_VFD1_I3","I3",null,"SPARE"]
["UL8_08_VFD1","UL8_08_VFD1_IO0","IO0",null,"SPARE"]
["UL8_08_VFD1","UL8_08_VFD1_IO1","IO1",null,"SPARE"]
["UL8_08_VFD1","UL8_08_VFD1_SI0","SI0",null,"SPARE"]
["UL8_08_VFD1","UL8_08_VFD1_SI1","SI1",null,"SPARE"]
["UL8_08_VFD1","UL8_08_VFD1_SI2","SI2",null,"SPARE"]
["UL8_08_VFD1","UL8_08_VFD1_SI3","SI3",null,"SPARE"]
["UL8_08_VFD1","UL8_08_VFD1_SO0","SO0",null,"SPARE"]
["UL8_09_VFD1","UL8_09_VFD1_I0","I0",null,"UL8_9_VFD1_DISC","DISCONNECT AUX"]
["UL8_09_VFD1","UL8_09_VFD1_I1","I1",null,"SPARE"]
["UL8_09_VFD1","UL8_09_VFD1_I2","I2",null,"SPARE"]
["UL8_09_VFD1","UL8_09_VFD1_I3","I3",null,"SPARE"]
["UL8_09_VFD1","UL8_09_VFD1_IO0","IO0",null,"SPARE"]
["UL8_09_VFD1","UL8_09_VFD1_IO1","IO1",null,"SPARE"]
["UL8_09_VFD1","UL8_09_VFD1_SI0","SI0",null,"SPARE"]
["UL8_09_VFD1","UL8_09_VFD1_SI1","SI1",null,"SPARE"]
["UL8_09_VFD1","UL8_09_VFD1_SI2","SI2",null,"SPARE"]
["UL8_09_VFD1","UL8_09_VFD1_SI3","SI3",null,"SPARE"]
["UL8_09_VFD1","UL8_09_VFD1_SO0","SO0",null,"SPARE"]
["UL9_03_FIO1","UL9_03_FIO1_IO00","IO00",null,"UL9_3_BCN1_R","RED BEACON LIGHT"]
["UL9_03_FIO1","UL9_03_FIO1_IO01","IO01",null,"SPARE"]
["UL9_03_FIO1","UL9_03_FIO1_IO02","IO02",null,"UL9_3_BCN2_R","RED BEACON LIGHT"]
["UL9_03_FIO1","UL9_03_FIO1_IO03","IO03",null,"SPARE"]
["UL9_03_FIO1","UL9_03_FIO1_IO04","IO04",null,"UL9_3_LPE1","LASEREYE"]
["UL9_03_FIO1","UL9_03_FIO1_IO05","IO05",null,"SPARE"]
["UL9_03_FIO1","UL9_03_FIO1_IO06","IO06",null,"UL9_3_LPE2","LASEREYE"]
["UL9_03_FIO1","UL9_03_FIO1_IO07","IO07",null,"SPARE"]
["UL9_03_FIO1","UL9_03_FIO1_IO08","IO08",null,"UL9_3_S1_PB","START PUSHBUTTON"]
["UL9_03_FIO1","UL9_03_FIO1_IO09","IO09",null,"UL9_3_S1_PB_LT","START PUSHBUTTON LIGHT"]
["UL9_03_FIO1","UL9_03_FIO1_IO10","IO10",null,"UL9_3_S2_PB","START PUSHBUTTON"]
["UL9_03_FIO1","UL9_03_FIO1_IO11","IO11",null,"UL9_3_S2_PB_LT","START PUSHBUTTON LIGHT"]
["UL9_03_FIO1","UL9_03_FIO1_IO12","IO12",null,"SPARE"]
["UL9_03_FIO1","UL9_03_FIO1_IO13","IO13",null,"SPARE"]
["UL9_03_FIO1","UL9_03_FIO1_IO14","IO14",null,"SPARE"]
["UL9_03_FIO1","UL9_03_FIO1_IO15","IO15",null,"SPARE"]
["UL9_03_VFD1","UL9_03_VFD1_I0","I0",null,"UL9_3_VFD1_DISC","DISCONNECT AUX"]
["UL9_03_VFD1","UL9_03_VFD1_I1","I1",null,"UL9_3_ENC1","ENCODER"]
["UL9_03_VFD1","UL9_03_VFD1_I2","I2",null,"UL9_3_TPE1","TRACKING PHOTOEYE"]
["UL9_03_VFD1","UL9_03_VFD1_I3","I3",null,"UL9_3_TPE2","TRACKING PHOTOEYE"]
["UL9_03_VFD1","UL9_03_VFD1_IO0","IO0",null,"SPARE"]
["UL9_03_VFD1","UL9_03_VFD1_IO1","IO1",null,"SPARE"]
["UL9_03_VFD1","UL9_03_VFD1_SI0","SI0",null,"UL9_3_EPC1","E-STOP PULLCORD"]
["UL9_03_VFD1","UL9_03_VFD1_SI1","SI1",null,"UL9_3_EPC1_2","E-STOP PULLCORD"]
["UL9_03_VFD1","UL9_03_VFD1_SI2","SI2",null,"UL9_3_EPC2","E-STOP PULLCORD"]
["UL9_03_VFD1","UL9_03_VFD1_SI3","SI3",null,"UL9_3_EPC2_2","E-STOP PULLCORD"]
["UL9_03_VFD1","UL9_03_VFD1_SO0","SO0",null,"SPARE"]
["UL9_04_VFD1","UL9_04_VFD1_I0","I0",null,"UL9_4_VFD1_DISC","DISCONNECT AUX"]
["UL9_04_VFD1","UL9_04_VFD1_I1","I1",null,"UL9_4_ENC1","ENCODER"]
["UL9_04_VFD1","UL9_04_VFD1_I2","I2",null,"UL9_4_TPE1","TRACKING PHOTOEYE"]
["UL9_04_VFD1","UL9_04_VFD1_I3","I3",null,"SPARE"]
["UL9_04_VFD1","UL9_04_VFD1_IO0","IO0",null,"UL9_4_BCN1_R","RED BEACON LIGHT"]
["UL9_04_VFD1","UL9_04_VFD1_IO1","IO1",null,"UL9_4_BCN2_R","RED BEACON LIGHT"]
["UL9_04_VFD1","UL9_04_VFD1_SI0","SI0",null,"UL9_4_EPC1","E-STOP PULLCORD"]
["UL9_04_VFD1","UL9_04_VFD1_SI1","SI1",null,"UL9_4_EPC1_2","E-STOP PULLCORD"]
["UL9_04_VFD1","UL9_04_VFD1_SI2","SI2",null,"UL9_4_EPC2","E-STOP PULLCORD"]
["UL9_04_VFD1","UL9_04_VFD1_SI3","SI3",null,"UL9_4_EPC2_2","E-STOP PULLCORD"]
["UL9_04_VFD1","UL9_04_VFD1_SO0","SO0",null,"SPARE"]
["UL9_05_VFD1","UL9_05_VFD1_I0","I0",null,"UL9_5_VFD1_DISC","DISCONNECT AUX"]
["UL9_05_VFD1","UL9_05_VFD1_I1","I1",null,"UL9_5_ENC1","ENCODER"]
["UL9_05_VFD1","UL9_05_VFD1_I2","I2",null,"SPARE"]
["UL9_05_VFD1","UL9_05_VFD1_I3","I3",null,"SPARE"]
["UL9_05_VFD1","UL9_05_VFD1_IO0","IO0",null,"UL9_4_S1_PB","START PUSHBUTTON"]
["UL9_05_VFD1","UL9_05_VFD1_IO1","IO1",null,"UL9_4_S1_PB_LT","START PUSHBUTTON LIGHT"]
["UL9_05_VFD1","UL9_05_VFD1_SI0","SI0",null,"SPARE"]
["UL9_05_VFD1","UL9_05_VFD1_SI1","SI1",null,"SPARE"]
["UL9_05_VFD1","UL9_05_VFD1_SI2","SI2",null,"SPARE"]
["UL9_05_VFD1","UL9_05_VFD1_SI3","SI3",null,"SPARE"]
["UL9_05_VFD1","UL9_05_VFD1_SO0","SO0",null,"SPARE"]
["UL9_06_VFD1","UL9_06_VFD1_I0","I0",null,"UL9_6_VFD1_DISC","DISCONNECT AUX"]
["UL9_06_VFD1","UL9_06_VFD1_I1","I1",null,"UL9_6_ENC1","ENCODER"]
["UL9_06_VFD1","UL9_06_VFD1_I2","I2",null,"UL9_6_TPE1","TRACKING PHOTOEYE"]
["UL9_06_VFD1","UL9_06_VFD1_I3","I3",null,"UL9_6_TPE2","TRACKING PHOTOEYE"]
["UL9_06_VFD1","UL9_06_VFD1_IO0","IO0",null,"UL9_4_S2_PB","START PUSHBUTTON"]
["UL9_06_VFD1","UL9_06_VFD1_IO1","IO1",null,"UL9_4_S2_PB_LT","START PUSHBUTTON LIGHT"]
["UL9_06_VFD1","UL9_06_VFD1_SI0","SI0",null,"SPARE"]
["UL9_06_VFD1","UL9_06_VFD1_SI1","SI1",null,"SPARE"]
["UL9_06_VFD1","UL9_06_VFD1_SI2","SI2",null,"SPARE"]
["UL9_06_VFD1","UL9_06_VFD1_SI3","SI3",null,"SPARE"]
["UL9_06_VFD1","UL9_06_VFD1_SO0","SO0",null,"SPARE"]
["UL9_07_VFD1","UL9_07_VFD1_I0","I0",null,"UL9_7_VFD1_DISC","DISCONNECT AUX"]
["UL9_07_VFD1","UL9_07_VFD1_I1","I1",null,"UL9_7_ENC1","ENCODER"]
["UL9_07_VFD1","UL9_07_VFD1_I2","I2",null,"UL9_7_TPE1","TRACKING PHOTOEYE"]
["UL9_07_VFD1","UL9_07_VFD1_I3","I3",null,"SPARE"]
["UL9_07_VFD1","UL9_07_VFD1_IO0","IO0",null,"SPARE"]
["UL9_07_VFD1","UL9_07_VFD1_IO1","IO1",null,"SPARE"]
["UL9_07_VFD1","UL9_07_VFD1_SI0","SI0",null,"SPARE"]
["UL9_07_VFD1","UL9_07_VFD1_SI1","SI1",null,"SPARE"]
["UL9_07_VFD1","UL9_07_VFD1_SI2","SI2",null,"SPARE"]
["UL9_07_VFD1","UL9_07_VFD1_SI3","SI3",null,"SPARE"]
["UL9_07_VFD1","UL9_07_VFD1_SO0","SO0",null,"SPARE"]
["UL9_08_VFD1","UL9_08_VFD1_I0","I0",null,"UL9_8_VFD1_DISC","DISCONNECT AUX"]
["UL9_08_VFD1","UL9_08_VFD1_I1","I1",null,"UL9_8_ENC1","ENCODER"]
["UL9_08_VFD1","UL9_08_VFD1_I2","I2",null,"UL9_8_TPE1","TRACKING PHOTOEYE"]
["UL9_08_VFD1","UL9_08_VFD1_I3","I3",null,"SPARE"]
["UL9_08_VFD1","UL9_08_VFD1_IO0","IO0",null,"SPARE"]
["UL9_08_VFD1","UL9_08_VFD1_IO1","IO1",null,"SPARE"]
["UL9_08_VFD1","UL9_08_VFD1_SI0","SI0",null,"SPARE"]
["UL9_08_VFD1","UL9_08_VFD1_SI1","SI1",null,"SPARE"]
["UL9_08_VFD1","UL9_08_VFD1_SI2","SI2",null,"SPARE"]
["UL9_08_VFD1","UL9_08_VFD1_SI3","SI3",null,"SPARE"]
["UL9_08_VFD1","UL9_08_VFD1_SO0","SO0",null,"SPARE"]
["UL9_09_VFD1","UL9_09_VFD1_I0","I0",null,"UL9_9_VFD1_DISC","DISCONNECT AUX"]
["UL9_09_VFD1","UL9_09_VFD1_I1","I1",null,"UL9_9_ENC1","ENCODER"]
["UL9_09_VFD1","UL9_09_VFD1_I2","I2",null,"UL9_9_TPE1","TRACKING PHOTOEYE"]
["UL9_09_VFD1","UL9_09_VFD1_I3","I3",null,"SPARE"]
["UL9_09_VFD1","UL9_09_VFD1_IO0","IO0",null,"SPARE"]
["UL9_09_VFD1","UL9_09_VFD1_IO1","IO1",null,"SPARE"]
["UL9_09_VFD1","UL9_09_VFD1_SI0","SI0",null,"SPARE"]
["UL9_09_VFD1","UL9_09_VFD1_SI1","SI1",null,"SPARE"]
["UL9_09_VFD1","UL9_09_VFD1_SI2","SI2",null,"SPARE"]
["UL9_09_VFD1","UL9_09_VFD1_SI3","SI3",null,"SPARE"]
["UL9_09_VFD1","UL9_09_VFD1_SO0","SO0",null,"SPARE"]
["UL9_10_VFD1","UL9_10_VFD1_I0","I0",null,"UL9_10_VFD1_DISC","DISCONNECT AUX"]
["UL9_10_VFD1","UL9_10_VFD1_I1","I1",null,"UL9_10_ENC1","ENCODER"]
["UL9_10_VFD1","UL9_10_VFD1_I2","I2",null,"UL9_10_TPE1","TRACKING PHOTOEYE"]
["UL9_10_VFD1","UL9_10_VFD1_I3","I3",null,"SPARE"]
["UL9_10_VFD1","UL9_10_VFD1_IO0","IO0",null,"SPARE"]
["UL9_10_VFD1","UL9_10_VFD1_IO1","IO1",null,"SPARE"]
["UL9_10_VFD1","UL9_10_VFD1_SI0","SI0",null,"SPARE"]
["UL9_10_VFD1","UL9_10_VFD1_SI1","SI1",null,"SPARE"]
["UL9_10_VFD1","UL9_10_VFD1_SI2","SI2",null,"SPARE"]
["UL9_10_VFD1","UL9_10_VFD1_SI3","SI3",null,"SPARE"]
["UL9_10_VFD1","UL9_10_VFD1_SO0","SO0",null,"SPARE"]
["UL9_11_VFD1","UL9_11_VFD1_I0","I0",null,"UL9_11_VFD1_DISC","DISCONNECT AUX"]
["UL9_11_VFD1","UL9_11_VFD1_I1","I1",null,"SPARE"]
["UL9_11_VFD1","UL9_11_VFD1_I2","I2",null,"SPARE"]
["UL9_11_VFD1","UL9_11_VFD1_I3","I3",null,"SPARE"]
["UL9_11_VFD1","UL9_11_VFD1_IO0","IO0",null,"SPARE"]
["UL9_11_VFD1","UL9_11_VFD1_IO1","IO1",null,"SPARE"]
["UL9_11_VFD1","UL9_11_VFD1_SI0","SI0",null,"SPARE"]
["UL9_11_VFD1","UL9_11_VFD1_SI1","SI1",null,"SPARE"]
["UL9_11_VFD1","UL9_11_VFD1_SI2","SI2",null,"SPARE"]
["UL9_11_VFD1","UL9_11_VFD1_SI3","SI3",null,"SPARE"]
["UL9_11_VFD1","UL9_11_VFD1_SO0","SO0",null,"SPARE"]

{"sheet":"Sheet2","index":8,"n_rows":168,"n_cols":4,"rows_kept":168,"cut":false,"hidden":false,"merged":[[0,1,3,1],[4,1,7,1],[8,1,11,1],[12,1,15,1],[88,1,91,1],[76,1,79,1],[16,1,19,1],[20,1,23,1],[24,1,27,1],[28,1,31,1],[32,1,35,1],[36,1,39,1],[40,1,43,1],[44,1,47,1],[48,1,51,1],[52,1,55,1],[92,1,95,1],[96,1,99,1],[100,1,103,1],[80,1,83,1],[84,1,87,1],[56,1,59,1],[60,1,63,1],[64,1,67,1],[68,1,71,1],[72,1,75,1],[164,1,167,1],[104,1,107,1],[108,1,111,1],[112,1,115,1],[116,1,119,1],[120,1,123,1],[124,1,127,1],[128,1,131,1],[132,1,135,1],[136,1,139,1],[140,1,143,1],[144,1,147,1],[148,1,151,1],[152,1,155,1],[156,1,159,1],[160,1,163,1]]}
["PS1_01_VFD1",600,null,"PS4_02_VFD1"]
["PS1_02_VFD1",null,null,"PS4_03_VFD1"]
["PS1_03_VFD1",null,null,"PS4_04_VFD1"]
["PS1_04_VFD1",null,null,"PS4_05_VFD1"]
["PS1_05_VFD1",601,null,"PS4_02_VFD1"]
["PS2_01_VFD1",null,null,"PS4_03_VFD1"]
["PS2_02_VFD1",null,null,"PS4_04_VFD1"]
["PS2_03_VFD1",null,null,"PS4_05_VFD1"]
["PS2_04_VFD1",602,null,"PS4_02_VFD1"]
["PS2_05_VFD1",null,null,"PS4_03_VFD1"]
["PS2_06_VFD1",null,null,"PS4_04_VFD1"]
["PS3_01_VFD1",null,null,"PS4_05_VFD1"]
["PS3_02_VFD1",603,null,"PS4_02_VFD1"]
["PS3_03_VFD1",null,null,"PS4_03_VFD1"]
["PS3_04_VFD1",null,null,"PS4_04_VFD1"]
["PS3_05_VFD1",null,null,"PS4_05_VFD1"]
["PS3_06_VFD1",604,null,"PS4_02_VFD1"]
["PS3_07_VFD1",null,null,"PS4_03_VFD1"]
["PS3_08_VFD1",null,null,"PS4_04_VFD1"]
["PS3_09_VFD1",null,null,"PS4_05_VFD1"]
["PS3_10_VFD1",605,null,"PS4_02_VFD1"]
["PS3_11_VFD1",null,null,"PS4_03_VFD1"]
["PS3_12_VFD1",null,null,"PS4_04_VFD1"]
["PS4_01_VFD1",null,null,"PS4_05_VFD1"]
["PS4_02_VFD1",606,null,"PS4_02_VFD1"]
["PS4_03_VFD1",null,null,"PS4_03_VFD1"]
["PS4_04_VFD1",null,null,"PS4_04_VFD1"]
["PS4_05_VFD1",null,null,"PS4_05_VFD1"]
["PS4_06_VFD1",607,null,"PS4_02_VFD1"]
["PS4_07_VFD1",null,null,"PS4_03_VFD1"]
["PS4_08_VFD1",null,null,"PS4_04_VFD1"]
["PS4_09_VFD1",null,null,"PS4_05_VFD1"]
["PS4_10_VFD1",608,null,"PS4_02_VFD1"]
["PS4_11_VFD1",null,null,"PS4_03_VFD1"]
["PS4_12_VFD1",null,null,"PS4_04_VFD1"]
["PS4_13_VFD1",null,null,"PS4_05_VFD1"]
["PS4_14_VFD1",609,null,"PS4_02_VFD1"]
["UL1_03_FIO1",null,null,"PS4_03_VFD1"]
["UL1_03_VFD1",null,null,"PS4_04_VFD1"]
["UL1_04_VFD1",null,null,"PS4_05_VFD1"]
["UL1_05_VFD1",610,null,"PS4_02_VFD1"]
["UL1_06_VFD1",null,null,"PS4_03_VFD1"]
["UL1_07_VFD1",null,null,"PS4_04_VFD1"]
["UL1_08_VFD1",null,null,"PS4_05_VFD1"]
["UL1_09_VFD1",611,null,"PS4_02_VFD1"]
["UL1_10A_VFD1",null,null,"PS4_03_VFD1"]
["UL1_10B_VFD1",null,null,"PS4_04_VFD1"]
["UL1_11_VFD1",null,null,"PS4_05_VFD1"]
["UL1_12_VFD1",612,null,"PS4_02_VFD1"]
["UL1_13_VFD1",null,null,"PS4_03_VFD1"]
["UL10_01_VFD1",null,null,"PS4_04_VFD1"]
["UL10_02_FIO1",null,null,"PS4_05_VFD1"]
["UL10_02_VFD1",613,null,"PS4_02_VFD1"]
["UL10_03_VFD1",null,null,"PS4_03_VFD1"]
["UL10_04_VFD1",null,null,"PS4_04_VFD1"]
["UL10_05_VFD1",null,null,"PS4_05_VFD1"]
["UL10_06_VFD1",614,null,"PS4_02_VFD1"]
["UL10_07_VFD1",null,null,"PS4_03_VFD1"]
["UL10_08_VFD1",null,null,"PS4_04_VFD1"]
["UL10_09_VFD1",null,null,"PS4_05_VFD1"]
["UL10_10_VFD1",615,null,"PS4_02_VFD1"]
["UL11_03_FIO1",null,null,"PS4_03_VFD1"]
["UL11_03_VFD1",null,null,"PS4_04_VFD1"]
["UL11_04_VFD1",null,null,"PS4_05_VFD1"]
["UL11_05_VFD1",616,null,"PS4_02_VFD1"]
["UL11_06_VFD1",null,null,"PS4_03_VFD1"]
["UL11_07_VFD1",null,null,"PS4_04_VFD1"]
["UL11_08_VFD1",null,null,"PS4_05_VFD1"]
["UL11_09_VFD1",617,null,"PS4_02_VFD1"]
["UL11_10_VFD1",null,null,"PS4_03_VFD1"]
["UL11_11A_VFD1",null,null,"PS4_04_VFD1"]
["UL11_11B_VFD1",null,null,"PS4_05_VFD1"]
["UL11_12_VFD1",618,null,"PS4_02_VFD1"]
["UL11_13_VFD1",null,null,"PS4_03_VFD1"]
["UL11_14_VFD1",null,null,"PS4_04_VFD1"]
["UL12_03_FIO1",null,null,"PS4_05_VFD1"]
["UL12_03_VFD1",619,null,"PS4_02_VFD1"]
["UL12_04_VFD1",null,null,"PS4_03_VFD1"]
["UL12_05_VFD1",null,null,"PS4_04_VFD1"]
["UL12_06_VFD1",null,null,"PS4_05_VFD1"]
["UL12_07_VFD1",620,null,"PS4_02_VFD1"]
["UL12_08_VFD1",null,null,"PS4_03_VFD1"]
["UL12_09_VFD1",null,null,"PS4_04_VFD1"]
["UL12_10_VFD1",null,null,"PS4_05_VFD1"]
["UL2_03_FIO1",621,null,"PS4_02_VFD1"]
["UL2_03_VFD1",null,null,"PS4_03_VFD1"]
["UL2_04_VFD1",null,null,"PS4_04_VFD1"]
["UL2_05_VFD1",null,null,"PS4_05_VFD1"]
["UL2_06_VFD1",622,null,"PS4_02_VFD1"]
["UL2_07_VFD1",null,null,"PS4_03_VFD1"]
["UL2_08_VFD1",null,null,"PS4_04_VFD1"]
["UL2_09_VFD1",null,null,"PS4_05_VFD1"]
["UL2_10_VFD1",623,null,"PS4_02_VFD1"]
["UL3_01_VFD1",null,null,"PS4_03_VFD1"]
["UL3_02_FIO1",null,null,"PS4_04_VFD1"]
["UL3_02_VFD1",null,null,"PS4_05_VFD1"]
["UL3_03_VFD1",624,null,"PS4_02_VFD1"]
["UL3_04_VFD1",null,null,"PS4_03_VFD1"]
["UL3_05_VFD1",null,null,"PS4_04_VFD1"]
["UL3_06_VFD1",null,null,"PS4_05_VFD1"]
["UL3_07_VFD1",625,null,"PS4_02_VFD1"]
["UL3_08_VFD1",null,null,"PS4_03_VFD1"]
["UL3_09_VFD1",null,null,"PS4_04_VFD1"]
["UL4_03_FIO1",null,null,"PS4_05_VFD1"]
["UL4_03_VFD1",626,null,"PS4_02_VFD1"]
["UL4_04_VFD1",null,null,"PS4_03_VFD1"]
["UL4_05_VFD1",null,null,"PS4_04_VFD1"]
["UL4_06_VFD1",null,null,"PS4_05_VFD1"]
["UL4_07_VFD1",627,null,"PS4_02_VFD1"]
["UL4_08_VFD1",null,null,"PS4_03_VFD1"]
["UL4_09_VFD1",null,null,"PS4_04_VFD1"]
["UL4_10A_VFD1",null,null,"PS4_05_VFD1"]
["UL4_10B_VFD1",628,null,"PS4_02_VFD1"]
["UL4_11_VFD1",null,null,"PS4_03_VFD1"]
["UL4_12_VFD1",null,null,"PS4_04_VFD1"]
["UL4_13_VFD1",null,null,"PS4_05_VFD1"]
["UL5_03_FIO1",629,null,"PS4_02_VFD1"]
["UL5_03_VFD1",null,null,"PS4_03_VFD1"]
["UL5_04_VFD1",null,null,"PS4_04_VFD1"]
["UL5_05_VFD1",null,null,"PS4_05_VFD1"]
["UL5_06_VFD1",630,null,"PS4_02_VFD1"]
["UL5_07_VFD1",null,null,"PS4_03_VFD1"]
["UL5_08_VFD1",null,null,"PS4_04_VFD1"]
["UL5_09_VFD1",null,null,"PS4_05_VFD1"]
["UL5_10_VFD1",631,null,"PS4_02_VFD1"]
["UL6_01_VFD1",null,null,"PS4_03_VFD1"]
["UL6_02_FIO1",null,null,"PS4_04_VFD1"]
["UL6_02_VFD1",null,null,"PS4_05_VFD1"]
["UL6_03_VFD1",632,null,"PS4_02_VFD1"]
["UL6_04_VFD1",null,null,"PS4_03_VFD1"]
["UL6_05_VFD1",null,null,"PS4_04_VFD1"]
["UL6_06_VFD1",null,null,"PS4_05_VFD1"]
["UL6_07_VFD1",633,null,"PS4_02_VFD1"]
["UL6_08_VFD1",null,null,"PS4_03_VFD1"]
["UL6_09_VFD1",null,null,"PS4_04_VFD1"]
["UL7_03_FIO1",null,null,"PS4_05_VFD1"]
["UL7_03_VFD1",634,null,"PS4_02_VFD1"]
["UL7_04_VFD1",null,null,"PS4_03_VFD1"]
["UL7_05_VFD1",null,null,"PS4_04_VFD1"]
["UL7_06_VFD1",null,null,"PS4_05_VFD1"]
["UL7_07_VFD1",635,null,"PS4_02_VFD1"]
["UL7_08_VFD1",null,null,"PS4_03_VFD1"]
["UL7_09_VFD1",null,null,"PS4_04_VFD1"]
["UL7_10A_VFD1",null,null,"PS4_05_VFD1"]
["UL7_10B_VFD1",636,null,"PS4_02_VFD1"]
["UL7_11_VFD1",null,null,"PS4_03_VFD1"]
["UL7_12_VFD1",null,null,"PS4_04_VFD1"]
["UL7_13_VFD1",null,null,"PS4_05_VFD1"]
["UL8_01_VFD1",637,null,"PS4_02_VFD1"]
["UL8_02_FIO1",null,null,"PS4_03_VFD1"]
["UL8_02_VFD1",null,null,"PS4_04_VFD1"]
["UL8_03_VFD1",null,null,"PS4_05_VFD1"]
["UL8_04_VFD1",638,null,"PS4_02_VFD1"]
["UL8_05_VFD1",null,null,"PS4_03_VFD1"]
["UL8_06_VFD1",null,null,"PS4_04_VFD1"]
["UL8_07_VFD1",null,null,"PS4_05_VFD1"]
["UL8_08_VFD1",639,null,"PS4_02_VFD1"]
["UL8_09_VFD1",null,null,"PS4_03_VFD1"]
["UL9_03_FIO1",null,null,"PS4_04_VFD1"]
["UL9_03_VFD1",null,null,"PS4_05_VFD1"]
["UL9_04_VFD1",640,null,"PS4_02_VFD1"]
["UL9_05_VFD1",null,null,"PS4_03_VFD1"]
["UL9_06_VFD1",null,null,"PS4_04_VFD1"]
["UL9_07_VFD1",null,null,"PS4_05_VFD1"]
["UL9_08_VFD1",641,null,"PS4_02_VFD1"]
["UL9_09_VFD1",null,null,"PS4_03_VFD1"]
["UL9_10_VFD1",null,null,"PS4_04_VFD1"]
["UL9_11_VFD1",null,null,"PS4_05_VFD1"]

{"sheet":"MCM01_DESC_V2","index":9,"n_rows":2107,"n_cols":9,"rows_kept":2107,"cut":false,"hidden":false,"merged":[]}
["TAGNAME","TERM","DESCA","DESCB",null,"CONTROLLERS"]
["PS1_01_VFD1","I0","PS1_1_VFD1_DISC","DISCONNECT AUX",null,"PS1_01_VFD1"]
["PS1_01_VFD1","I1","SPARE",null,null,"PS1_02_VFD1"]
["PS1_01_VFD1","I2","SPARE",null,null,"PS1_03_VFD1"]
["PS1_01_VFD1","I3","SPARE",null,null,"PS1_04_VFD1"]
["PS1_01_VFD1","IO0","PS1_1_S1_PB","START PUSHBUTTON"]
["PS1_01_VFD1","IO1","PS1_1_S1_PB_LT","START PUSHBUTTON LIGHT",null,"PS1_05_VFD1"]
["PS1_01_VFD1","SI0","PS1_1_EPC1","E-STOP PULLCORD",null,"PS2_01_VFD1"]
["PS1_01_VFD1","SI1","PS1_1_EPC1_2","E-STOP PULLCORD",null,"PS2_02_VFD1"]
["PS1_01_VFD1","SI2","PS1_1_EPC2","E-STOP PULLCORD",null,"PS2_03_VFD1"]
["PS1_01_VFD1","SI3","PS1_1_EPC2_2","E-STOP PULLCORD"]
["PS1_01_VFD1","SO0","SPARE",null,null,"PS2_04_VFD1"]
["PS1_02_VFD1","I0","PS1_2_VFD1_DISC","DISCONNECT AUX",null,"PS2_05_VFD1"]
["PS1_02_VFD1","I1","SPARE",null,null,"PS2_06_VFD1"]
["PS1_02_VFD1","I2","PS1_2_TPE1","TRACKING PHOTOEYE",null,"PS3_01_VFD1"]
["PS1_02_VFD1","I3","PS1_2_TPE2","TRACKING PHOTOEYE"]
["PS1_02_VFD1","IO0","PS1_1_BCN1_R","RED BEACON LIGHT",null,"PS3_02_VFD1"]
["PS1_02_VFD1","IO1","PS1_1_BCN2_R","RED BEACON LIGHT",null,"PS3_03_VFD1"]
["PS1_02_VFD1","SI0","SPARE",null,null,"PS3_04_VFD1"]
["PS1_02_VFD1","SI1","SPARE",null,null,"PS3_05_VFD1"]
["PS1_02_VFD1","SI2","SPARE"]
["PS1_02_VFD1","SI3","SPARE",null,null,"PS3_06_VFD1"]
["PS1_02_VFD1","SO0","SPARE",null,null,"PS3_07_VFD1"]
["PS1_03_VFD1","I0","PS1_3_VFD1_DISC","DISCONNECT AUX",null,"PS3_08_VFD1"]
["PS1_03_VFD1","I1","SPARE",null,null,"PS3_09_VFD1"]
["PS1_03_VFD1","I2","SPARE"]
["PS1_03_VFD1","I3","SPARE",null,null,"PS3_10_VFD1"]
["PS1_03_VFD1","IO0","PS1_1_S2_PB","START PUSHBUTTON",null,"PS3_11_VFD1"]
["PS1_03_VFD1","IO1","PS1_1_S2_PB_LT","START PUSHBUTTON LIGHT",null,"PS3_12_VFD1"]
["PS1_03_VFD1","SI0","SPARE",null,null,"PS4_01_VFD1"]
["PS1_03_VFD1","SI1","SPARE"]
["PS1_03_VFD1","SI2","SPARE",null,null,"PS4_02_VFD1"]
["PS1_03_VFD1","SI3","SPARE",null,null,"PS4_03_VFD1"]
["PS1_03_VFD1","SO0","SPARE",null,null,"PS4_04_VFD1"]
["PS1_04_VFD1","I0","PS1_4_VFD1_DISC","DISCONNECT AUX",null,"PS4_05_VFD1"]
["PS1_04_VFD1","I1","SPARE"]
["PS1_04_VFD1","I2","PS1_4_TPE1","TRACKING PHOTOEYE",null,"PS4_06_VFD1"]
["PS1_04_VFD1","I3","PS1_4_TPE2","TRACKING PHOTOEYE",null,"PS4_07_VFD1"]
["PS1_04_VFD1","IO0","PS1_5_S1_PB","START PUSHBUTTON",null,"PS4_08_VFD1"]
["PS1_04_VFD1","IO1","PS1_5_S1_PB_LT","START PUSHBUTTON LIGHT",null,"PS4_09_VFD1"]
["PS1_04_VFD1","SI0","SPARE"]
["PS1_04_VFD1","SI1","SPARE",null,null,"PS4_10_VFD1"]
["PS1_04_VFD1","SI2","SPARE",null,null,"PS4_11_VFD1"]
["PS1_04_VFD1","SI3","SPARE",null,null,"PS4_12_VFD1"]
["PS1_04_VFD1","SO0","PS1_5_BCN2_R","RED BEACON LIGHT",null,"PS4_13_VFD1"]
["PS1_05_VFD1","I0","PS1_5_VFD1_DISC","DISCONNECT AUX"]
["PS1_05_VFD1","I1","SPARE",null,null,"PS4_14_VFD1"]
["PS1_05_VFD1","I2","PS1_5_TPE1","TRACKING PHOTOEYE",null,"UL1_03_FIO1"]
["PS1_05_VFD1","I3","SPARE",null,null,"UL1_03_VFD1"]
["PS1_05_VFD1","IO0","PS1_5_S2_PB","START PUSHBUTTON",null,"UL1_04_VFD1"]
["PS1_05_VFD1","IO1","PS1_5_S2_PB_LT","START PUSHBUTTON LIGHT"]
["PS1_05_VFD1","SI0","PS1_5_EPC1","E-STOP PULLCORD",null,"UL1_05_VFD1"]
["PS1_05_VFD1","SI1","PS1_5_EPC1_2","E-STOP PULLCORD",null,"UL1_06_VFD1"]
["PS1_05_VFD1","SI2","PS1_5_EPC2","E-STOP PULLCORD",null,"UL1_07_VFD1"]
["PS1_05_VFD1","SI3","PS1_5_EPC2_2","E-STOP PULLCORD",null,"UL1_08_VFD1"]
["PS1_05_VFD1","SO0","PS1_5_BCN1_R","RED BEACON LIGHT"]
["PS2_01_VFD1","I0","PS2_1_VFD1_DISC","DISCONNECT AUX",null,"UL1_09_VFD1"]
["PS2_01_VFD1","I1","SPARE",null,null,"UL1_10A_VFD1"]
["PS2_01_VFD1","I2","SPARE",null,null,"UL1_10B_VFD1"]
["PS2_01_VFD1","I3","SPARE",null,null,"UL1_11_VFD1"]
["PS2_01_VFD1","IO0","PS2_1_S1_PB","START PUSHBUTTON"]
["PS2_01_VFD1","IO1","PS2_1_S1_PB_LT","START PUSHBUTTON LIGHT",null,"UL1_12_VFD1"]
["PS2_01_VFD1","SI0","PS2_1_EPC1","E-STOP PULLCORD",null,"UL1_13_VFD1"]
["PS2_01_VFD1","SI1","PS2_1_EPC1_2","E-STOP PULLCORD",null,"UL10_01_VFD1"]
["PS2_01_VFD1","SI2","PS2_1_EPC2","E-STOP PULLCORD",null,"UL10_02_FIO1"]
["PS2_01_VFD1","SI3","PS2_1_EPC2_2","E-STOP PULLCORD"]
["PS2_01_VFD1","SO0","SPARE",null,null,"UL10_02_VFD1"]
["PS2_02_VFD1","I0","PS2_2_VFD1_DISC","DISCONNECT AUX",null,"UL10_03_VFD1"]
["PS2_02_VFD1","I1","SPARE",null,null,"UL10_04_VFD1"]
["PS2_02_VFD1","I2","PS2_2_TPE1","TRACKING PHOTOEYE",null,"UL10_05_VFD1"]
["PS2_02_VFD1","I3","PS2_2_TPE2","TRACKING PHOTOEYE"]
["PS2_02_VFD1","IO0","PS2_1_BCN1_R","RED BEACON LIGHT",null,"UL10_06_VFD1"]
["PS2_02_VFD1","IO1","PS2_1_BCN2_R","RED BEACON LIGHT",null,"UL10_07_VFD1"]
["PS2_02_VFD1","SI0","SPARE",null,null,"UL10_08_VFD1"]
["PS2_02_VFD1","SI1","SPARE",null,null,"UL10_09_VFD1"]
["PS2_02_VFD1","SI2","SPARE"]
["PS2_02_VFD1","SI3","SPARE",null,null,"UL10_10_VFD1"]
["PS2_02_VFD1","SO0","SPARE",null,null,"UL11_03_FIO1"]
["PS2_03_VFD1","I0","PS2_3_VFD1_DISC","DISCONNECT AUX",null,"UL11_03_VFD1"]
["PS2_03_VFD1","I1","SPARE",null,null,"UL11_04_VFD1"]
["PS2_03_VFD1","I2","PS2_3_TPE2","TRACKING PHOTOEYE"]
["PS2_03_VFD1","I3","SPARE",null,null,"UL11_05_VFD1"]
["PS2_03_VFD1","IO0","PS2_1_S2_PB","START PUSHBUTTON",null,"UL11_06_VFD1"]
["PS2_03_VFD1","IO1","PS2_1_S2_PB_LT","START PUSHBUTTON LIGHT",null,"UL11_07_VFD1"]
["PS2_03_VFD1","SI0","SPARE",null,null,"UL11_08_VFD1"]
["PS2_03_VFD1","SI1","SPARE"]
["PS2_03_VFD1","SI2","SPARE",null,null,"UL11_09_VFD1"]
["PS2_03_VFD1","SI3","SPARE",null,null,"UL11_10A_VFD1"]
["PS2_03_VFD1","SO0","PS2_3_BCN1_A","AMBER BEACON LIGHT",null,"UL11_10B_VFD1"]
["PS2_04_VFD1","I0","PS2_4_VFD1_DISC","DISCONNECT AUX",null,"UL11_11_VFD1"]
["PS2_04_VFD1","I1","SPARE"]
["PS2_04_VFD1","I2","SPARE",null,null,"UL11_12_VFD1"]
["PS2_04_VFD1","I3","SPARE",null,null,"UL11_13_VFD1"]
["PS2_04_VFD1","IO0","PS2_3_JR1_PB","JAM RESET PUSHBUTTON",null,"UL12_03_FIO1"]
["PS2_04_VFD1","IO1","PS2_3_JR1_PB_LT","JAM RESET PUSHBUTTON LIGHT",null,"UL12_03_VFD1"]
["PS2_04_VFD1","SI0","SPARE"]
["PS2_04_VFD1","SI1","SPARE",null,null,"UL12_04_VFD1"]
["PS2_04_VFD1","SI2","SPARE",null,null,"UL12_05_VFD1"]
["PS2_04_VFD1","SI3","SPARE",null,null,"UL12_06_VFD1"]
["PS2_04_VFD1","SO0","SPARE",null,null,"UL12_07_VFD1"]
["PS2_05_VFD1","I0","PS2_5_VFD1_DISC","DISCONNECT AUX"]
["PS2_05_VFD1","I1","SPARE",null,null,"UL12_08_VFD1"]
["PS2_05_VFD1","I2","PS2_5_TPE1","TRACKING PHOTOEYE",null,"UL12_09_VFD1"]
["PS2_05_VFD1","I3","PS2_5_TPE2","TRACKING PHOTOEYE",null,"UL12_10_VFD1"]
["PS2_05_VFD1","IO0","PS2_6_S2_PB","START PUSHBUTTON",null,"UL2_03_FIO1"]
["PS2_05_VFD1","IO1","PS2_6_S2_PB_LT","START PUSHBUTTON LIGHT"]
["PS2_05_VFD1","SI0","SPARE",null,null,"UL2_03_VFD1"]
["PS2_05_VFD1","SI1","SPARE",null,null,"UL2_04_VFD1"]
["PS2_05_VFD1","SI2","SPARE",null,null,"UL2_05_VFD1"]
["PS2_05_VFD1","SI3","SPARE",null,null,"UL2_06_VFD1"]
["PS2_05_VFD1","SO0","PS2_6_BCN2_R","RED BEACON LIGHT"]
["PS2_06_VFD1","I0","PS2_6_VFD1_DISC","DISCONNECT AUX",null,"UL2_07_VFD1"]
["PS2_06_VFD1","I1","SPARE",null,null,"UL2_08_VFD1"]
["PS2_06_VFD1","I2","PS2_6_TPE1","TRACKING PHOTOEYE",null,"UL2_09_VFD1"]
["PS2_06_VFD1","I3","SPARE",null,null,"UL2_10_VFD1"]
["PS2_06_VFD1","IO0","PS2_6_S1_PB","START PUSHBUTTON"]
["PS2_06_VFD1","IO1","PS2_6_S1_PB_LT","START PUSHBUTTON LIGHT",null,"UL3_01_VFD1"]
["PS2_06_VFD1","SI0","PS2_6_EPC1","E-STOP PULLCORD",null,"UL3_02_FIO1"]
["PS2_06_VFD1","SI1","PS2_6_EPC1_2","E-STOP PULLCORD",null,"UL3_02_VFD1"]
["PS2_06_VFD1","SI2","PS2_6_EPC2","E-STOP PULLCORD",null,"UL3_03_VFD1"]
["PS2_06_VFD1","SI3","PS2_6_EPC2_2","E-STOP PULLCORD"]
["PS2_06_VFD1","SO0","PS2_6_BCN1_R","RED BEACON LIGHT",null,"UL3_04_VFD1"]
["PS3_01_VFD1","I0","PS3_1_VFD1_DISC","DISCONNECT AUX",null,"UL3_05_VFD1"]
["PS3_01_VFD1","I1","SPARE",null,null,"UL3_06_VFD1"]
["PS3_01_VFD1","I2","PS3_1_TPE1","TRACKING PHOTOEYE",null,"UL3_07_VFD1"]
["PS3_01_VFD1","I3","SPARE"]
["PS3_01_VFD1","IO0","PS3_1_BCN2_A","AMBER BEACON LIGHT",null,"UL3_08_VFD1"]
["PS3_01_VFD1","IO1","PS3_1_BCN2_R","RED BEACON LIGHT",null,"UL3_09_VFD1"]
["PS3_01_VFD1","SI0","PS3_1_EPC1","E-STOP PULLCORD",null,"UL4_03_FIO1"]
["PS3_01_VFD1","SI1","PS3_1_EPC1_2","E-STOP PULLCORD",null,"UL4_03_VFD1"]
["PS3_01_VFD1","SI2","PS3_1_EPC2","E-STOP PULLCORD"]
["PS3_01_VFD1","SI3","PS3_1_EPC2_2","E-STOP PULLCORD",null,"UL4_04_VFD1"]
["PS3_01_VFD1","SO0","PS3_1_BCN1_R","RED BEACON LIGHT",null,"UL4_05_VFD1"]
["PS3_02_VFD1","I0","PS3_2_VFD1_DISC","DISCONNECT AUX",null,"UL4_06_VFD1"]
["PS3_02_VFD1","I1","SPARE",null,null,"UL4_07_VFD1"]
["PS3_02_VFD1","I2","PS3_2_TPE1","TRACKING PHOTOEYE"]
["PS3_02_VFD1","I3","SPARE",null,null,"UL4_08_VFD1"]
["PS3_02_VFD1","IO0","PS3_1_S1_PB","START PUSHBUTTON",null,"UL4_09_VFD1"]
["PS3_02_VFD1","IO1","PS3_1_S1_PB_LT","START PUSHBUTTON LIGHT",null,"UL4_10A_VFD1"]
["PS3_02_VFD1","SI0","SPARE",null,null,"UL4_10B_VFD1"]
["PS3_02_VFD1","SI1","SPARE"]
["PS3_02_VFD1","SI2","SPARE",null,null,"UL4_11_VFD1"]
["PS3_02_VFD1","SI3","SPARE",null,null,"UL4_12_VFD1"]
["PS3_02_VFD1","SO0","SPARE",null,null,"UL4_13_VFD1"]
["PS3_03_VFD1","I0","PS3_3_VFD1_DISC","DISCONNECT AUX",null,"UL5_03_FIO1"]
["PS3_03_VFD1","I1","SPARE"]
["PS3_03_VFD1","I2","PS3_3_TPE2","TRACKING PHOTOEYE",null,"UL5_03_VFD1"]
["PS3_03_VFD1","I3","SPARE",null,null,"UL5_04_VFD1"]
["PS3_03_VFD1","IO0","PS3_1_S2_PB","START PUSHBUTTON",null,"UL5_05_VFD1"]
["PS3_03_VFD1","IO1","PS3_1_S2_PB_LT","START PUSHBUTTON LIGHT",null,"UL5_06_VFD1"]
["PS3_03_VFD1","SI0","PS3_3_BCN1_A","AMBER BEACON LIGHT"]
["PS3_03_VFD1","SI1","SPARE",null,null,"UL5_07_VFD1"]
["PS3_03_VFD1","SI2","SPARE",null,null,"UL5_08_VFD1"]
["PS3_03_VFD1","SI3","SPARE",null,null,"UL5_09_VFD1"]
["PS3_03_VFD1","SO0","SPARE",null,null,"UL5_10_VFD1"]
["PS3_04_VFD1","I0","PS3_4_VFD1_DISC","DISCONNECT AUX"]
["PS3_04_VFD1","I1","SPARE",null,null,"UL6_01_VFD1"]
["PS3_04_VFD1","I2","SPARE",null,null,"UL6_02_FIO1"]
["PS3_04_VFD1","I3","SPARE",null,null,"UL6_02_VFD1"]
["PS3_04_VFD1","IO0","PS3_3_JR1_PB","JAM RESET PUSHBUTTON",null,"UL6_03_VFD1"]
["PS3_04_VFD1","IO1","PS3_3_JR1_PB_LT","JAM RESET PUSHBUTTON LIGHT"]
["PS3_04_VFD1","SI0","SPARE",null,null,"UL6_04_VFD1"]
["PS3_04_VFD1","SI1","SPARE",null,null,"UL6_05_VFD1"]
["PS3_04_VFD1","SI2","SPARE",null,null,"UL6_06_VFD1"]
["PS3_04_VFD1","SI3","SPARE",null,null,"UL6_07_VFD1"]
["PS3_04_VFD1","SO0","SPARE"]
["PS3_05_VFD1","I0","PS3_5_VFD1_DISC","DISCONNECT AUX",null,"UL6_08_VFD1"]
["PS3_05_VFD1","I1","SPARE",null,null,"UL6_09_VFD1"]
["PS3_05_VFD1","I2","PS3_5_TPE1","TRACKING PHOTOEYE",null,"UL7_03_FIO1"]
["PS3_05_VFD1","I3","PS3_5_TPE2","TRACKING PHOTOEYE",null,"UL7_03_VFD1"]
["PS3_05_VFD1","IO0","SPARE"]
["PS3_05_VFD1","IO1","SPARE",null,null,"UL7_04_VFD1"]
["PS3_05_VFD1","SI0","SPARE",null,null,"UL7_05_VFD1"]
["PS3_05_VFD1","SI1","SPARE",null,null,"UL7_06_VFD1"]
["PS3_05_VFD1","SI2","SPARE",null,null,"UL7_07_VFD1"]
["PS3_05_VFD1","SI3","SPARE"]
["PS3_05_VFD1","SO0","SPARE",null,null,"UL7_08_VFD1"]
["PS3_06_VFD1","I0","PS3_6_VFD1_DISC","DISCONNECT AUX",null,"UL7_09_VFD1"]
["PS3_06_VFD1","I1","SPARE",null,null,"UL7_10A_VFD1"]
["PS3_06_VFD1","I2","PS3_6_TPE1","TRACKING PHOTOEYE",null,"UL7_10B_VFD1"]
["PS3_06_VFD1","I3","SPARE"]
["PS3_06_VFD1","IO0","SPARE",null,null,"UL7_11_VFD1"]
["PS3_06_VFD1","IO1","SPARE",null,null,"UL7_12_VFD1"]
["PS3_06_VFD1","SI0","SPARE",null,null,"UL7_13_VFD1"]
["PS3_06_VFD1","SI1","SPARE",null,null,"UL8_01_VFD1"]
["PS3_06_VFD1","SI2","SPARE"]
["PS3_06_VFD1","SI3","SPARE",null,null,"UL8_02_FIO1"]
["PS3_06_VFD1","SO0","SPARE",null,null,"UL8_02_VFD1"]
["PS3_07_VFD1","I0","PS3_7_VFD1_DISC","DISCONNECT AUX",null,"UL8_03_VFD1"]
["PS3_07_VFD1","I1","SPARE",null,null,"UL8_04_VFD1"]
["PS3_07_VFD1","I2","PS3_7_TPE1","TRACKING PHOTOEYE"]
["PS3_07_VFD1","I3","SPARE",null,null,"UL8_05_VFD1"]
["PS3_07_VFD1","IO0","PS3_7_JR1_PB","JAM RESET PUSHBUTTON",null,"UL8_06_VFD1"]
["PS3_07_VFD1","IO1","PS3_7_JR1_PB_LT","JAM RESET PUSHBUTTON LIGHT",null,"UL8_07_VFD1"]
["PS3_07_VFD1","SI0","SPARE",null,null,"UL8_08_VFD1"]
["PS3_07_VFD1","SI1","SPARE"]
["PS3_07_VFD1","SI2","SPARE",null,null,"UL8_09_VFD1"]
["PS3_07_VFD1","SI3","SPARE",null,null,"UL9_03_FIO1"]
["PS3_07_VFD1","SO0","PS3_7_BCN1_A","AMBER BEACON LIGHT",null,"UL9_03_VFD1"]
["PS3_08_VFD1","I0","PS3_8_VFD1_DISC","DISCONNECT AUX",null,"UL9_04_VFD1"]
["PS3_08_VFD1","I1","SPARE"]
["PS3_08_VFD1","I2","SPARE",null,null,"UL9_05_VFD1"]
["PS3_08_VFD1","I3","SPARE",null,null,"UL9_06_VFD1"]
["PS3_08_VFD1","IO0","SPARE",null,null,"UL9_07_VFD1"]
["PS3_08_VFD1","IO1","SPARE",null,null,"UL9_08_VFD1"]
["PS3_08_VFD1","SI0","SPARE"]
["PS3_08_VFD1","SI1","SPARE",null,null,"UL9_09_VFD1"]
["PS3_08_VFD1","SI2","SPARE",null,null,"UL9_10_VFD1"]
["PS3_08_VFD1","SI3","SPARE",null,null,"UL9_11_VFD1"]
["PS3_08_VFD1","SO0","SPARE"]
["PS3_09_VFD1","I0","PS3_9_VFD1_DISC","DISCONNECT AUX"]
["PS3_09_VFD1","I1","SPARE"]
["PS3_09_VFD1","I2","PS3_9_TPE1","TRACKING PHOTOEYE"]
["PS3_09_VFD1","I3","PS3_9_TPE2","TRACKING PHOTOEYE"]
["PS3_09_VFD1","IO0","SPARE"]
["PS3_09_VFD1","IO1","SPARE"]
["PS3_09_VFD1","SI0","SPARE"]
["PS3_09_VFD1","SI1","SPARE"]
["PS3_09_VFD1","SI2","SPARE"]
["PS3_09_VFD1","SI3","SPARE"]
["PS3_09_VFD1","SO0","SPARE"]
["PS3_10_VFD1","I0","PS3_10_VFD1_DISC","DISCONNECT AUX"]
["PS3_10_VFD1","I1","SPARE"]
["PS3_10_VFD1","I2","PS3_10_TPE1","TRACKING PHOTOEYE"]
["PS3_10_VFD1","I3","SPARE"]
["PS3_10_VFD1","IO0","PS3_12_S2_PB","START PUSHBUTTON"]
["PS3_10_VFD1","IO1","PS3_12_S2_PB_LT","START PUSHBUTTON LIGHT"]
["PS3_10_VFD1","SI0","SPARE"]
["PS3_10_VFD1","SI1","SPARE"]
["PS3_10_VFD1","SI2","SPARE"]
["PS3_10_VFD1","SI3","SPARE"]
["PS3_10_VFD1","SO0","SPARE"]
["PS3_11_VFD1","I0","PS3_11_VFD1_DISC","DISCONNECT AUX"]
["PS3_11_VFD1","I1","SPARE"]
["PS3_11_VFD1","I2","SPARE"]
["PS3_11_VFD1","I3","SPARE"]
["PS3_11_VFD1","IO0","PS3_12_S1_PB","START PUSHBUTTON"]
["PS3_11_VFD1","IO1","PS3_12_S1_PB_LT","START PUSHBUTTON LIGHT"]
["PS3_11_VFD1","SI0","SPARE"]
["PS3_11_VFD1","SI1","SPARE"]
["PS3_11_VFD1","SI2","SPARE"]
["PS3_11_VFD1","SI3","SPARE"]
["PS3_11_VFD1","SO0","SPARE"]
["PS3_12_VFD1","I0","PS3_12_VFD1_DISC","DISCONNECT AUX"]
["PS3_12_VFD1","I1","SPARE"]
["PS3_12_VFD1","I2","PS3_12_TPE1","TRACKING PHOTOEYE"]
["PS3_12_VFD1","I3","PS3_12_TPE2","TRACKING PHOTOEYE"]
["PS3_12_VFD1","IO0","PS3_12_BCN2_A","AMBER BEACON LIGHT"]
["PS3_12_VFD1","IO1","PS3_12_BCN2_R","RED BEACON LIGHT"]
["PS3_12_VFD1","SI0","PS3_12_EPC1","E-STOP PULLCORD"]
["PS3_12_VFD1","SI1","PS3_12_EPC1_2","E-STOP PULLCORD"]
["PS3_12_VFD1","SI2","PS3_12_EPC2","E-STOP PULLCORD"]
["PS3_12_VFD1","SI3","PS3_12_EPC2_2","E-STOP PULLCORD"]
["PS3_12_VFD1","SO0","PS3_12_BCN1_R","RED BEACON LIGHT"]
["PS4_01_VFD1","I0","PS4_1_VFD1_DISC","DISCONNECT AUX"]
["PS4_01_VFD1","I1","SPARE"]
["PS4_01_VFD1","I2","SPARE"]
["PS4_01_VFD1","I3","SPARE"]
["PS4_01_VFD1","IO0","PS4_1_BCN1_R","RED BEACON LIGHT"]
["PS4_01_VFD1","IO1","PS4_1_BCN2_R","RED BEACON LIGHT"]
["PS4_01_VFD1","SI0","PS4_1_EPC1","E-STOP PULLCORD"]
["PS4_01_VFD1","SI1","PS4_1_EPC1_2","E-STOP PULLCORD"]
["PS4_01_VFD1","SI2","PS4_1_EPC2","E-STOP PULLCORD"]
["PS4_01_VFD1","SI3","PS4_1_EPC2_2","E-STOP PULLCORD"]
["PS4_01_VFD1","SO0","SPARE"]
["PS4_02_VFD1","I0","PS4_2_VFD1_DISC","DISCONNECT AUX"]
["PS4_02_VFD1","I1","SPARE"]
["PS4_02_VFD1","I2","PS4_2_TPE1","TRACKING PHOTOEYE"]
["PS4_02_VFD1","I3","PS4_2_TPE2","TRACKING PHOTOEYE"]
["PS4_02_VFD1","IO0","PS4_1_S1_PB","START PUSHBUTTON"]
["PS4_02_VFD1","IO1","PS4_1_S1_PB_LT","START PUSHBUTTON LIGHT"]
["PS4_02_VFD1","SI0","SPARE"]
["PS4_02_VFD1","SI1","SPARE"]
["PS4_02_VFD1","SI2","SPARE"]
["PS4_02_VFD1","SI3","SPARE"]
["PS4_02_VFD1","SO0","PS4_2_BCN1_A","AMBER BEACON LIGHT"]
["PS4_03_VFD1","I0","PS4_3_VFD1_DISC","DISCONNECT AUX"]
["PS4_03_VFD1","I1","SPARE"]
["PS4_03_VFD1","I2","SPARE"]
["PS4_03_VFD1","I3","SPARE"]
["PS4_03_VFD1","IO0","PS4_1_S2_PB","START PUSHBUTTON"]
["PS4_03_VFD1","IO1","PS4_1_S2_PB_LT","START PUSHBUTTON LIGHT"]
["PS4_03_VFD1","SI0","SPARE"]
["PS4_03_VFD1","SI1","SPARE"]
["PS4_03_VFD1","SI2","SPARE"]
["PS4_03_VFD1","SI3","SPARE"]
["PS4_03_VFD1","SO0","SPARE"]
["PS4_04_VFD1","I0","PS4_4_VFD1_DISC","DISCONNECT AUX"]
["PS4_04_VFD1","I1","SPARE"]
["PS4_04_VFD1","I2","PS4_4_TPE1","TRACKING PHOTOEYE"]
["PS4_04_VFD1","I3","PS4_4_TPE2","TRACKING PHOTOEYE"]
["PS4_04_VFD1","IO0","PS4_2_JR1_PB","JAM RESET PUSHBUTTON"]
["PS4_04_VFD1","IO1","PS4_2_JR1_PB_LT","JAM RESET PUSHBUTTON LIGHT"]
["PS4_04_VFD1","SI0","SPARE"]
["PS4_04_VFD1","SI1","SPARE"]
["PS4_04_VFD1","SI2","SPARE"]
["PS4_04_VFD1","SI3","SPARE"]
["PS4_04_VFD1","SO0","SPARE"]
["PS4_05_VFD1","I0","PS4_5_VFD1_DISC","DISCONNECT AUX"]
["PS4_05_VFD1","I1","SPARE"]
["PS4_05_VFD1","I2","PS4_5_TPE1","TRACKING PHOTOEYE"]
["PS4_05_VFD1","I3","SPARE"]
["PS4_05_VFD1","IO0","SPARE"]
["PS4_05_VFD1","IO1","SPARE"]
["PS4_05_VFD1","SI0","SPARE"]
["PS4_05_VFD1","SI1","SPARE"]
["PS4_05_VFD1","SI2","SPARE"]
["PS4_05_VFD1","SI3","SPARE"]
["PS4_05_VFD1","SO0","SPARE"]
["PS4_06_VFD1","I0","PS4_6_VFD1_DISC","DISCONNECT AUX"]
["PS4_06_VFD1","I1","SPARE"]
["PS4_06_VFD1","I2","PS4_6_TPE1","TRACKING PHOTOEYE"]
["PS4_06_VFD1","I3","SPARE"]
["PS4_06_VFD1","IO0","SPARE"]
["PS4_06_VFD1","IO1","SPARE"]
["PS4_06_VFD1","SI0","SPARE"]
["PS4_06_VFD1","SI1","SPARE"]
["PS4_06_VFD1","SI2","SPARE"]
["PS4_06_VFD1","SI3","SPARE"]
["PS4_06_VFD1","SO0","SPARE"]
["PS4_07_VFD1","I0","PS4_7_VFD1_DISC","DISCONNECT AUX"]
["PS4_07_VFD1","I1","SPARE"]
["PS4_07_VFD1","I2","PS4_7_TPE1","TRACKING PHOTOEYE"]
["PS4_07_VFD1","I3","SPARE"]
["PS4_07_VFD1","IO0","SPARE"]
["PS4_07_VFD1","IO1","SPARE"]
["PS4_07_VFD1","SI0","SPARE"]
["PS4_07_VFD1","SI1","SPARE"]
["PS4_07_VFD1","SI2","SPARE"]
["PS4_07_VFD1","SI3","SPARE"]
["PS4_07_VFD1","SO0","SPARE"]
["PS4_08_VFD1","I0","PS4_8_VFD1_DISC","DISCONNECT AUX"]
["PS4_08_VFD1","I1","SPARE"]
["PS4_08_VFD1","I2","PS4_8_TPE1","TRACKING PHOTOEYE"]
["PS4_08_VFD1","I3","SPARE"]
["PS4_08_VFD1","IO0","PS4_8_JR1_PB","JAM RESET PUSHBUTTON"]
["PS4_08_VFD1","IO1","PS4_8_JR1_PB_LT","JAM RESET PUSHBUTTON LIGHT"]
["PS4_08_VFD1","SI0","SPARE"]
["PS4_08_VFD1","SI1","SPARE"]
["PS4_08_VFD1","SI2","SPARE"]
["PS4_08_VFD1","SI3","SPARE"]
["PS4_08_VFD1","SO0","PS4_8_BCN1_A","AMBER BEACON LIGHT"]
["PS4_09_VFD1","I0","PS4_9_VFD1_DISC","DISCONNECT AUX"]
["PS4_09_VFD1","I1","SPARE"]
["PS4_09_VFD1","I2","SPARE"]
["PS4_09_VFD1","I3","SPARE"]
["PS4_09_VFD1","IO0","SPARE"]
["PS4_09_VFD1","IO1","SPARE"]
["PS4_09_VFD1","SI0","SPARE"]
["PS4_09_VFD1","SI1","SPARE"]
["PS4_09_VFD1","SI2","SPARE"]
["PS4_09_VFD1","SI3","SPARE"]
["PS4_09_VFD1","SO0","SPARE"]
["PS4_10_VFD1","I0","PS4_10_VFD1_DISC","DISCONNECT AUX"]
["PS4_10_VFD1","I1","SPARE"]
["PS4_10_VFD1","I2","PS4_10_TPE1","TRACKING PHOTOEYE"]
["PS4_10_VFD1","I3","PS4_10_TPE2","TRACKING PHOTOEYE"]
["PS4_10_VFD1","IO0","SPARE"]
["PS4_10_VFD1","IO1","SPARE"]
["PS4_10_VFD1","SI0","SPARE"]
["PS4_10_VFD1","SI1","SPARE"]
["PS4_10_VFD1","SI2","SPARE"]
["PS4_10_VFD1","SI3","SPARE"]
["PS4_10_VFD1","SO0","SPARE"]
["PS4_11_VFD1","I0","PS4_11_VFD1_DISC","DISCONNECT AUX"]
["PS4_11_VFD1","I1","SPARE"]
["PS4_11_VFD1","I2","PS4_11_TPE1","TRACKING PHOTOEYE"]
["PS4_11_VFD1","I3","SPARE"]
["PS4_11_VFD1","IO0","PS4_14_S2_PB","START PUSHBUTTON"]
["PS4_11_VFD1","IO1","PS4_14_S2_PB_LT","START PUSHBUTTON LIGHT"]
["PS4_11_VFD1","SI0","SPARE"]
["PS4_11_VFD1","SI1","SPARE"]
["PS4_11_VFD1","SI2","SPARE"]
["PS4_11_VFD1","SI3","SPARE"]
["PS4_11_VFD1","SO0","SPARE"]
["PS4_12_VFD1","I0","PS4_12_VFD1_DISC","DISCONNECT AUX"]
["PS4_12_VFD1","I1","SPARE"]
["PS4_12_VFD1","I2","PS4_12_TPE1","TRACKING PHOTOEYE"]
["PS4_12_VFD1","I3","SPARE"]
["PS4_12_VFD1","IO0","PS4_14_S1_PB","START PUSHBUTTON"]
["PS4_12_VFD1","IO1","PS4_14_S1_PB_LT","START PUSHBUTTON LIGHT"]
["PS4_12_VFD1","SI0","SPARE"]
["PS4_12_VFD1","SI1","SPARE"]
["PS4_12_VFD1","SI2","SPARE"]
["PS4_12_VFD1","SI3","SPARE"]
["PS4_12_VFD1","SO0","SPARE"]
["PS4_13_VFD1","I0","PS4_13_VFD1_DISC","DISCONNECT AUX"]
["PS4_13_VFD1","I1","SPARE"]
["PS4_13_VFD1","I2","SPARE"]
["PS4_13_VFD1","I3","SPARE"]
["PS4_13_VFD1","IO0","PS4_13_JR1_PB","JAM RESET PUSHBUTTON"]
["PS4_13_VFD1","IO1","PS4_13_JR1_PB_LT","JAM RESET PUSHBUTTON LIGHT"]
["PS4_13_VFD1","SI0","SPARE"]
["PS4_13_VFD1","SI1","SPARE"]
["PS4_13_VFD1","SI2","SPARE"]
["PS4_13_VFD1","SI3","SPARE"]
["PS4_13_VFD1","SO0","PS4_13_BCN1_A","AMBER BEACON LIGHT"]
["PS4_14_VFD1","I0","PS4_14_VFD1_DISC","DISCONNECT AUX"]
["PS4_14_VFD1","I1","SPARE"]
["PS4_14_VFD1","I2","PS4_14_TPE1","TRACKING PHOTOEYE"]
["PS4_14_VFD1","I3","SPARE"]
["PS4_14_VFD1","IO0","PS4_14_BCN1_A","AMBER BEACON LIGHT"]
["PS4_14_VFD1","IO1","PS4_14_BCN1_R","RED BEACON LIGHT"]
["PS4_14_VFD1","SI0","PS4_14_EPC1","E-STOP PULLCORD"]
["PS4_14_VFD1","SI1","PS4_14_EPC1_2","E-STOP PULLCORD"]
["PS4_14_VFD1","SI2","PS4_14_EPC2","E-STOP PULLCORD"]
["PS4_14_VFD1","SI3","PS4_14_EPC2_2","E-STOP PULLCORD"]
["PS4_14_VFD1","SO0","PS4_14_BCN2_R","RED BEACON LIGHT"]
["UL1_3_FIO1","IO00","UL1_3_BCN1_R","RED BEACON LIGHT"]
["UL1_3_FIO1","IO01","SPARE"]
["UL1_3_FIO1","IO02","UL1_3_BCN2_R","RED BEACON LIGHT"]
["UL1_3_FIO1","IO03","SPARE"]
["UL1_3_FIO1","IO04","UL1_3_LPE1","LASEREYE"]
["UL1_3_FIO1","IO05","SPARE"]
["UL1_3_FIO1","IO06","UL1_3_LPE2","LASEREYE"]
["UL1_3_FIO1","IO07","SPARE"]
["UL1_3_FIO1","IO08","UL1_3_S1_PB","START PUSHBUTTON"]
["UL1_3_FIO1","IO09","UL1_3_S1_PB_LT","START PUSHBUTTON LIGHT"]
["UL1_3_FIO1","IO10","UL1_3_S2_PB","START PUSHBUTTON"]
["UL1_3_FIO1","IO11","UL1_3_S2_PB_LT","START PUSHBUTTON LIGHT"]
["UL1_3_FIO1","IO12","SPARE"]
["UL1_3_FIO1","IO13","SPARE"]
["UL1_3_FIO1","IO14","SPARE"]
["UL1_3_FIO1","IO15","SPARE"]
["UL1_03_VFD1","I0","UL1_3_VFD1_DISC","DISCONNECT AUX"]
["UL1_03_VFD1","I1","UL1_3_ENC1","ENCODER"]
["UL1_03_VFD1","I2","UL1_3_TPE1","TRACKING PHOTOEYE"]
["UL1_03_VFD1","I3","UL1_3_TPE2","TRACKING PHOTOEYE"]
["UL1_03_VFD1","IO0","SPARE"]
["UL1_03_VFD1","IO1","SPARE"]
["UL1_03_VFD1","SI0","UL1_3_EPC1","E-STOP PULLCORD"]
["UL1_03_VFD1","SI1","UL1_3_EPC1_2","E-STOP PULLCORD"]
["UL1_03_VFD1","SI2","UL1_3_EPC2","E-STOP PULLCORD"]
["UL1_03_VFD1","SI3","UL1_3_EPC2_2","E-STOP PULLCORD"]
["UL1_03_VFD1","SO0","UL1_1_STO1","E-STOP OK"]
["UL1_04_VFD1","I0","UL1_4_VFD1_DISC","DISCONNECT AUX"]
["UL1_04_VFD1","I1","UL1_4_ENC1","ENCODER"]
["UL1_04_VFD1","I2","UL1_4_TPE1","TRACKING PHOTOEYE"]
["UL1_04_VFD1","I3","SPARE"]
["UL1_04_VFD1","IO0","UL1_4_S1_PB","START PUSHBUTTON"]
["UL1_04_VFD1","IO1","UL1_4_S1_PB_LT","START PUSHBUTTON LIGHT"]
["UL1_04_VFD1","SI0","UL1_4_EPC1","E-STOP PULLCORD"]
["UL1_04_VFD1","SI1","UL1_4_EPC1_2","E-STOP PULLCORD"]
["UL1_04_VFD1","SI2","UL1_4_EPC2","E-STOP PULLCORD"]
["UL1_04_VFD1","SI3","UL1_4_EPC2_2","E-STOP PULLCORD"]
["UL1_04_VFD1","SO0","SPARE"]
["UL1_05_VFD1","I0","UL1_5_VFD1_DISC","DISCONNECT AUX"]
["UL1_05_VFD1","I1","UL1_5_ENC1","ENCODER"]
["UL1_05_VFD1","I2","UL1_5_TPE1","TRACKING PHOTOEYE"]
["UL1_05_VFD1","I3","SPARE"]
["UL1_05_VFD1","IO0","UL1_4_S2_PB","START PUSHBUTTON"]
["UL1_05_VFD1","IO1","UL1_4_S2_PB_LT","START PUSHBUTTON LIGHT"]
["UL1_05_VFD1","SI0","UL1_1_ESTOP1","ESTOP OK"]
["UL1_05_VFD1","SI1","SPARE"]
["UL1_05_VFD1","SI2","SPARE"]
["UL1_05_VFD1","SI3","SPARE"]
["UL1_05_VFD1","SO0","SPARE"]
["UL1_06_VFD1","I0","UL1_6_VFD1_DISC","DISCONNECT AUX"]
["UL1_06_VFD1","I1","UL1_6_ENC1","ENCODER"]
["UL1_06_VFD1","I2","UL1_6_TPE1","TRACKING PHOTOEYE"]
["UL1_06_VFD1","I3","SPARE"]
["UL1_06_VFD1","IO0","UL1_4_BCN1_R","RED BEACON LIGHT"]
["UL1_06_VFD1","IO1","UL1_4_BCN2_R","RED BEACON LIGHT"]
["UL1_06_VFD1","SI0","SPARE"]
["UL1_06_VFD1","SI1","SPARE"]
["UL1_06_VFD1","SI2","SPARE"]
["UL1_06_VFD1","SI3","SPARE"]
["UL1_06_VFD1","SO0","SPARE"]
["UL1_07_VFD1","I0","UL1_7_VFD1_DISC","DISCONNECT AUX"]
["UL1_07_VFD1","I1","UL1_7_ENC1","ENCODER"]
["UL1_07_VFD1","I2","UL1_7_TPE1","TRACKING PHOTOEYE"]
["UL1_07_VFD1","I3","SPARE"]
["UL1_07_VFD1","IO0","UL1_9_S1_PB","START PUSHBUTTON"]
["UL1_07_VFD1","IO1","UL1_9_S1_PB_LT","START PUSHBUTTON LIGHT"]
["UL1_07_VFD1","SI0","SPARE"]
["UL1_07_VFD1","SI1","SPARE"]
["UL1_07_VFD1","SI2","SPARE"]
["UL1_07_VFD1","SI3","SPARE"]
["UL1_07_VFD1","SO0","SPARE"]
["UL1_08_VFD1","I0","UL1_8_VFD1_DISC","DISCONNECT AUX"]
["UL1_08_VFD1","I1","UL1_8_ENC1","ENCODER"]
["UL1_08_VFD1","I2","UL1_8_TPE1","TRACKING PHOTOEYE"]
["UL1_08_VFD1","I3","SPARE"]
["UL1_08_VFD1","IO0","UL1_9_JR1_PB","JAM RESET PUSHBUTTON","2025-07-01"]
["UL1_08_VFD1","IO1","UL1_9_JR1_PB_LT","JAM RESET PUSHBUTTON LIGHT","2025-07-01"]
["UL1_08_VFD1","SI0","SPARE"]
["UL1_08_VFD1","SI1","SPARE"]
["UL1_08_VFD1","SI2","SPARE"]
["UL1_08_VFD1","SI3","SPARE"]
["UL1_08_VFD1","SO0","SPARE"]
["UL1_09_VFD1","I0","UL1_9_VFD1_DISC","DISCONNECT AUX"]
["UL1_09_VFD1","I1","UL1_9_ENC1","ENCODER"]
["UL1_09_VFD1","I2","UL1_9_TPE1","TRACKING PHOTOEYE"]
["UL1_09_VFD1","I3","UL1_9_TPE2","TRACKING PHOTOEYE"]
["UL1_09_VFD1","IO0","UL1_9_BCN1_A","AMBER BEACON LIGHT","2025-07-01","UL1_9_BCN1_A","AMBER BEACON LIGHT"]
["UL1_09_VFD1","IO1","UL1_9_BCN1_R","RED BEACON LIGHT"]
["UL1_09_VFD1","SI0","UL1_9_EPC1","E-STOP PULLCORD"]
["UL1_09_VFD1","SI1","UL1_9_EPC1_2","E-STOP PULLCORD"]
["UL1_09_VFD1","SI2","UL1_9_EPC2","E-STOP PULLCORD"]
["UL1_09_VFD1","SI3","UL1_9_EPC2_2","E-STOP PULLCORD"]
["UL1_09_VFD1","SO0","UL1_9_BCN2_R","RED BEACON LIGHT"]
["UL1_10A_VFD1","I0","UL1_10A_VFD1_DISC","DISCONNECT AUX"]
["UL1_10A_VFD1","I1","UL1_9_TPE3","TRACKING PHOTOEYE"]
["UL1_10A_VFD1","I2","UL1_9_TPE4","TRACKING PHOTOEYE"]
["UL1_10A_VFD1","I3","UL1_9_TPE5","TRACKING PHOTOEYE"]
["UL1_10A_VFD1","IO0","UL1_9_S2_PB","START PUSHBUTTON"]
["UL1_10A_VFD1","IO1","UL1_9_S2_PB_LT","START PUSHBUTTON LIGHT"]
["UL1_10A_VFD1","SI0","SPARE"]
["UL1_10A_VFD1","SI1","SPARE"]
["UL1_10A_VFD1","SI2","SPARE"]
["UL1_10A_VFD1","SI3","SPARE"]
["UL1_10A_VFD1","SO0","SPARE"]
["UL1_10B_VFD1","I0","UL1_10B_VFD1_DISC","DISCONNECT AUX"]
["UL1_10B_VFD1","I1","SPARE"]
["UL1_10B_VFD1","I2","SPARE"]
["UL1_10B_VFD1","I3","SPARE"]
["UL1_10B_VFD1","IO0","SPARE"]
["UL1_10B_VFD1","IO1","SPARE"]
["UL1_10B_VFD1","SI0","SPARE"]
["UL1_10B_VFD1","SI1","SPARE"]
["UL1_10B_VFD1","SI2","SPARE"]
["UL1_10B_VFD1","SI3","SPARE"]
["UL1_10B_VFD1","SO0","SPARE"]
["UL1_11_VFD1","I0","UL1_11_VFD1_DISC","DISCONNECT AUX"]
["UL1_11_VFD1","I1","SPARE"]
["UL1_11_VFD1","I2","UL1_11_TPE1","TRACKING PHOTOEYE"]
["UL1_11_VFD1","I3","UL1_11_TPE2","TRACKING PHOTOEYE"]
["UL1_11_VFD1","IO0","SPARE"]
["UL1_11_VFD1","IO1","SPARE"]
["UL1_11_VFD1","SI0","SPARE"]
["UL1_11_VFD1","SI1","SPARE"]
["UL1_11_VFD1","SI2","SPARE"]
["UL1_11_VFD1","SI3","SPARE"]
["UL1_11_VFD1","SO0","SPARE"]
["UL1_12_VFD1","I0","UL1_12_VFD1_DISC","DISCONNECT AUX"]
["UL1_12_VFD1","I1","SPARE"]
["UL1_12_VFD1","I2","UL1_12_TPE1","TRACKING PHOTOEYE"]
["UL1_12_VFD1","I3","SPARE"]
["UL1_12_VFD1","IO0","SPARE"]
["UL1_12_VFD1","IO1","SPARE"]
["UL1_12_VFD1","SI0","SPARE"]
["UL1_12_VFD1","SI1","SPARE"]
["UL1_12_VFD1","SI2","SPARE"]
["UL1_12_VFD1","SI3","SPARE"]
["UL1_12_VFD1","SO0","SPARE"]
["UL1_13_VFD1","I0","UL1_13_VFD1_DISC","DISCONNECT AUX"]
["UL1_13_VFD1","I1","SPARE"]
["UL1_13_VFD1","I2","SPARE"]
["UL1_13_VFD1","I3","SPARE"]
["UL1_13_VFD1","IO0","SPARE"]
["UL1_13_VFD1","IO1","SPARE"]
["UL1_13_VFD1","SI0","SPARE"]
["UL1_13_VFD1","SI1","SPARE"]
["UL1_13_VFD1","SI2","SPARE"]
["UL1_13_VFD1","SI3","SPARE"]
["UL1_13_VFD1","SO0","SPARE"]
["UL10_01_VFD1","I0","UL10_1_VFD1_DISC","DISCONNECT AUX"]
["UL10_01_VFD1","I1","SPARE"]
["UL10_01_VFD1","I2","UL10_1_TPE1","TRACKING PHOTOEYE"]
["UL10_01_VFD1","I3","SPARE"]
["UL10_01_VFD1","IO0","SPARE"]
["UL10_01_VFD1","IO1","SPARE"]
["UL10_01_VFD1","SI0","UL10_1_EPC1","E-STOP PULLCORD"]
["UL10_01_VFD1","SI1","UL10_1_EPC1_2","E-STOP PULLCORD"]
["UL10_01_VFD1","SI2","UL10_1_EPC2","E-STOP PULLCORD"]
["UL10_01_VFD1","SI3","UL10_1_EPC2_2","E-STOP PULLCORD"]
["UL10_01_VFD1","SO0","SPARE"]
["UL10_2_FIO1","IO00","UL10_1_BCN1_R","RED BEACON LIGHT"]
["UL10_2_FIO1","IO01","SPARE"]
["UL10_2_FIO1","IO02","UL10_1_BCN2_R","RED BEACON LIGHT"]
["UL10_2_FIO1","IO03","SPARE"]
["UL10_2_FIO1","IO04","UL10_1_SS1_SPB","SS STATION START PUSHBUTTON","2025-07-01"]
["UL10_2_FIO1","IO05","UL10_1_SS1_SPB_LT","SS STATION START PUSHBUTTON LIGHT","2025-07-01"]
["UL10_2_FIO1","IO06","UL10_1_SS1_STPB","SS STATION STOP PUSHBUTTON","2025-07-01"]
["UL10_2_FIO1","IO07","SPARE"]
["UL10_2_FIO1","IO08","UL10_2_LPE1","LASEREYE"]
["UL10_2_FIO1","IO09","SPARE"]
["UL10_2_FIO1","IO10","UL10_2_LPE2","LASEREYE"]
["UL10_2_FIO1","IO11","SPARE"]
["UL10_2_FIO1","IO12","SPARE"]
["UL10_2_FIO1","IO13","SPARE"]
["UL10_2_FIO1","IO14","SPARE"]
["UL10_2_FIO1","IO15","SPARE"]
["UL10_02_VFD1","I0","UL10_2_VFD1_DISC","DISCONNECT AUX"]
["UL10_02_VFD1","I1","SPARE"]
["UL10_02_VFD1","I2","UL10_2_TPE1","TRACKING PHOTOEYE"]
["UL10_02_VFD1","I3","UL10_2_TPE2","TRACKING PHOTOEYE"]
["UL10_02_VFD1","IO0","SPARE"]
["UL10_02_VFD1","IO1","SPARE"]
["UL10_02_VFD1","SI0","SPARE"]
["UL10_02_VFD1","SI1","SPARE"]
["UL10_02_VFD1","SI2","SPARE"]
["UL10_02_VFD1","SI3","SPARE"]
["UL10_02_VFD1","SO0","SPARE"]
["UL10_03_VFD1","I0","UL10_3_VFD1_DISC","DISCONNECT AUX"]
["UL10_03_VFD1","I1","SPARE"]
["UL10_03_VFD1","I2","UL10_3_TPE1","TRACKING PHOTOEYE"]
["UL10_03_VFD1","I3","SPARE"]
["UL10_03_VFD1","IO0","UL10_3_BCN1_R","RED BEACON LIGHT"]
["UL10_03_VFD1","IO1","UL10_3_BCN2_R","RED BEACON LIGHT"]
["UL10_03_VFD1","SI0","UL10_3_EPC1","E-STOP PULLCORD"]
["UL10_03_VFD1","SI1","UL10_3_EPC1_2","E-STOP PULLCORD"]
["UL10_03_VFD1","SI2","UL10_3_EPC2","E-STOP PULLCORD"]
["UL10_03_VFD1","SI3","UL10_3_EPC2_2","E-STOP PULLCORD"]
["UL10_03_VFD1","SO0","SPARE"]
["UL10_04_VFD1","I0","UL10_4_VFD1_DISC","DISCONNECT AUX"]
["UL10_04_VFD1","I1","UL10_4_ENC1","ENCODER"]
["UL10_04_VFD1","I2","UL10_4_TPE1","TRACKING PHOTOEYE"]
["UL10_04_VFD1","I3","SPARE"]
["UL10_04_VFD1","IO0","UL10_3_S1_PB","START PUSHBUTTON"]
["UL10_04_VFD1","IO1","UL10_3_S1_PB_LT","START PUSHBUTTON LIGHT"]
["UL10_04_VFD1","SI0","SPARE"]
["UL10_04_VFD1","SI1","SPARE"]
["UL10_04_VFD1","SI2","SPARE"]
["UL10_04_VFD1","SI3","SPARE"]
["UL10_04_VFD1","SO0","SPARE"]
["UL10_05_VFD1","I0","UL10_5_VFD1_DISC","DISCONNECT AUX"]
["UL10_05_VFD1","I1","UL10_5_ENC1","ENCODER"]
["UL10_05_VFD1","I2","UL10_5_TPE1","TRACKING PHOTOEYE"]
["UL10_05_VFD1","I3","SPARE"]
["UL10_05_VFD1","IO0","UL10_3_S2_PB","START PUSHBUTTON"]
["UL10_05_VFD1","IO1","UL10_3_S2_PB_LT","START PUSHBUTTON LIGHT"]
["UL10_05_VFD1","SI0","SPARE"]
["UL10_05_VFD1","SI1","SPARE"]
["UL10_05_VFD1","SI2","SPARE"]
["UL10_05_VFD1","SI3","SPARE"]
["UL10_05_VFD1","SO0","SPARE"]
["UL10_06_VFD1","I0","UL10_6_VFD1_DISC","DISCONNECT AUX"]
["UL10_06_VFD1","I1","UL10_6_ENC1","ENCODER"]
["UL10_06_VFD1","I2","UL10_6_TPE1","TRACKING PHOTOEYE"]
["UL10_06_VFD1","I3","SPARE"]
["UL10_06_VFD1","IO0","SPARE"]
["UL10_06_VFD1","IO1","SPARE"]
["UL10_06_VFD1","SI0","SPARE"]
["UL10_06_VFD1","SI1","SPARE"]
["UL10_06_VFD1","SI2","SPARE"]
["UL10_06_VFD1","SI3","SPARE"]
["UL10_06_VFD1","SO0","SPARE"]
["UL10_07_VFD1","I0","UL10_7_VFD1_DISC","DISCONNECT AUX"]
["UL10_07_VFD1","I1","UL10_7_ENC1","ENCODER"]
["UL10_07_VFD1","I2","UL10_7_TPE1","TRACKING PHOTOEYE"]
["UL10_07_VFD1","I3","SPARE"]
["UL10_07_VFD1","IO0","SPARE"]
["UL10_07_VFD1","IO1","SPARE"]
["UL10_07_VFD1","SI0","SPARE"]
["UL10_07_VFD1","SI1","SPARE"]
["UL10_07_VFD1","SI2","SPARE"]
["UL10_07_VFD1","SI3","SPARE"]
["UL10_07_VFD1","SO0","SPARE"]
["UL10_08_VFD1","I0","UL10_8_VFD1_DISC","DISCONNECT AUX"]
["UL10_08_VFD1","I1","UL10_8_ENC1","ENCODER"]
["UL10_08_VFD1","I2","SPARE"]
["UL10_08_VFD1","I3","SPARE"]
["UL10_08_VFD1","IO0","SPARE"]
["UL10_08_VFD1","IO1","SPARE"]
["UL10_08_VFD1","SI0","SPARE"]
["UL10_08_VFD1","SI1","SPARE"]
["UL10_08_VFD1","SI2","SPARE"]
["UL10_08_VFD1","SI3","SPARE"]
["UL10_08_VFD1","SO0","SPARE"]
["UL10_09_VFD1","I0","UL10_9_VFD1_DISC","DISCONNECT AUX"]
["UL10_09_VFD1","I1","UL10_9_ENC1","ENCODER"]
["UL10_09_VFD1","I2","UL10_9_TPE1","TRACKING PHOTOEYE"]
["UL10_09_VFD1","I3","UL10_9_TPE2","TRACKING PHOTOEYE"]
["UL10_09_VFD1","IO0","SPARE"]
["UL10_09_VFD1","IO1","SPARE"]
["UL10_09_VFD1","SI0","SPARE"]
["UL10_09_VFD1","SI1","SPARE"]
["UL10_09_VFD1","SI2","SPARE"]
["UL10_09_VFD1","SI3","SPARE"]
["UL10_09_VFD1","SO0","SPARE"]
["UL10_10_VFD1","I0","UL10_10_VFD1_DISC","DISCONNECT AUX"]
["UL10_10_VFD1","I1","SPARE"]
["UL10_10_VFD1","I2","SPARE"]
["UL10_10_VFD1","I3","SPARE"]
["UL10_10_VFD1","IO0","UL1_9_JR2_PB","JAM RESET PUSHBUTTON"]
["UL10_10_VFD1","IO1","UL1_9_JR2_PB_LT","JAM RESET PUSHBUTTON LIGHT"]
["UL10_10_VFD1","SI0","SPARE"]
["UL10_10_VFD1","SI1","SPARE"]
["UL10_10_VFD1","SI2","SPARE"]
["UL10_10_VFD1","SI3","SPARE"]
["UL10_10_VFD1","SO0","SPARE"]
["UL11_3_FIO1","IO00","UL11_3_BCN1_R","RED BEACON LIGHT"]
["UL11_3_FIO1","IO01","SPARE"]
["UL11_3_FIO1","IO02","UL11_3_BCN2_R","RED BEACON LIGHT"]
["UL11_3_FIO1","IO03","SPARE"]
["UL11_3_FIO1","IO04","UL11_3_LPE1","LASEREYE"]
["UL11_3_FIO1","IO05","SPARE"]
["UL11_3_FIO1","IO06","UL11_3_LPE2","LASEREYE"]
["UL11_3_FIO1","IO07","SPARE"]
["UL11_3_FIO1","IO08","UL11_3_S1_PB","START PUSHBUTTON"]
["UL11_3_FIO1","IO09","UL11_3_S1_PB_LT","START PUSHBUTTON LIGHT"]
["UL11_3_FIO1","IO10","UL11_3_S2_PB","START PUSHBUTTON"]
["UL11_3_FIO1","IO11","UL11_3_S2_PB_LT","START PUSHBUTTON LIGHT"]
["UL11_3_FIO1","IO12","SPARE"]
["UL11_3_FIO1","IO13","SPARE"]
["UL11_3_FIO1","IO14","SPARE"]
["UL11_3_FIO1","IO15","SPARE"]
["UL11_03_VFD1","I0","UL11_3_VFD1_DISC","DISCONNECT AUX"]
["UL11_03_VFD1","I1","UL11_3_ENC1","ENCODER"]
["UL11_03_VFD1","I2","UL11_3_TPE1","TRACKING PHOTOEYE"]
["UL11_03_VFD1","I3","UL11_3_TPE2","TRACKING PHOTOEYE"]
["UL11_03_VFD1","IO0","SPARE"]
["UL11_03_VFD1","IO1","SPARE"]
["UL11_03_VFD1","SI0","UL11_3_EPC1","E-STOP PULLCORD"]
["UL11_03_VFD1","SI1","UL11_3_EPC1_2","E-STOP PULLCORD"]
["UL11_03_VFD1","SI2","UL11_3_EPC2","E-STOP PULLCORD"]
["UL11_03_VFD1","SI3","UL11_3_EPC2_2","E-STOP PULLCORD"]
["UL11_03_VFD1","SO0","SPARE"]
["UL11_04_VFD1","I0","UL11_4_VFD1_DISC","DISCONNECT AUX"]
["UL11_04_VFD1","I1","SPARE"]
["UL11_04_VFD1","I2","UL11_4_TPE1","TRACKING PHOTOEYE"]
["UL11_04_VFD1","I3","SPARE"]
["UL11_04_VFD1","IO0","UL11_4_BCN1_R","RED BEACON LIGHT"]
["UL11_04_VFD1","IO1","UL11_4_BCN2_R","RED BEACON LIGHT"]
["UL11_04_VFD1","SI0","UL11_4_EPC1","E-STOP PULLCORD"]
["UL11_04_VFD1","SI1","UL11_4_EPC1_2","E-STOP PULLCORD"]
["UL11_04_VFD1","SI2","UL11_4_EPC2","E-STOP PULLCORD"]
["UL11_04_VFD1","SI3","UL11_4_EPC2_2","E-STOP PULLCORD"]
["UL11_04_VFD1","SO0","UL11_1_STO1","E-STOP OK"]
["UL11_05_VFD1","I0","UL11_5_VFD1_DISC","DISCONNECT AUX"]
["UL11_05_VFD1","I1","UL11_5_ENC1","ENCODER"]
["UL11_05_VFD1","I2","UL11_5_TPE1","TRACKING PHOTOEYE"]
["UL11_05_VFD1","I3","SPARE"]
["UL11_05_VFD1","IO0","UL11_4_S1_PB","START PUSHBUTTON"]
["UL11_05_VFD1","IO1","UL11_4_S1_PB_LT","START PUSHBUTTON LIGHT"]
["UL11_05_VFD1","SI0","UL11_1_ESTOP1","ESTOP OK"]
["UL11_05_VFD1","SI1","SPARE"]
["UL11_05_VFD1","SI2","SPARE"]
["UL11_05_VFD1","SI3","SPARE"]
["UL11_05_VFD1","SO0","SPARE"]
["UL11_06_VFD1","I0","UL11_6_VFD1_DISC","DISCONNECT AUX"]
["UL11_06_VFD1","I1","UL11_6_ENC1","ENCODER"]
["UL11_06_VFD1","I2","UL11_6_TPE1","TRACKING PHOTOEYE"]
["UL11_06_VFD1","I3","SPARE"]
["UL11_06_VFD1","IO0","UL11_4_S2_PB","START PUSHBUTTON"]
["UL11_06_VFD1","IO1","UL11_4_S2_PB_LT","START PUSHBUTTON LIGHT"]
["UL11_06_VFD1","SI0","SPARE"]
["UL11_06_VFD1","SI1","SPARE"]
["UL11_06_VFD1","SI2","SPARE"]
["UL11_06_VFD1","SI3","SPARE"]
["UL11_06_VFD1","SO0","SPARE"]
["UL11_07_VFD1","I0","UL11_7_VFD1_DISC","DISCONNECT AUX"]
["UL11_07_VFD1","I1","UL11_7_ENC1","ENCODER"]
["UL11_07_VFD1","I2","UL11_7_TPE1","TRACKING PHOTOEYE"]
["UL11_07_VFD1","I3","SPARE"]
["UL11_07_VFD1","IO0","SPARE"]
["UL11_07_VFD1","IO1","SPARE"]
["UL11_07_VFD1","SI0","SPARE"]
["UL11_07_VFD1","SI1","SPARE"]
["UL11_07_VFD1","SI2","SPARE"]
["UL11_07_VFD1","SI3","SPARE"]
["UL11_07_VFD1","SO0","SPARE"]
["UL11_08_VFD1","I0","UL11_8_VFD1_DISC","DISCONNECT AUX"]
["UL11_08_VFD1","I1","UL11_8_ENC1","ENCODER"]
["UL11_08_VFD1","I2","UL11_8_TPE1","TRACKING PHOTOEYE"]
["UL11_08_VFD1","I3","UL11_9_TPE3","TRACKING PHOTOEYE"]
["UL11_08_VFD1","IO0","SPARE"]
["UL11_08_VFD1","IO1","SPARE"]
["UL11_08_VFD1","SI0","SPARE"]
["UL11_08_VFD1","SI1","SPARE"]
["UL11_08_VFD1","SI2","SPARE"]
["UL11_08_VFD1","SI3","SPARE"]
["UL11_08_VFD1","SO0","SPARE"]
["UL11_09_VFD1","I0","UL11_9_VFD1_DISC","DISCONNECT AUX"]
["UL11_09_VFD1","I1","UL11_9_ENC1","ENCODER"]
["UL11_09_VFD1","I2","UL11_9_TPE1","TRACKING PHOTOEYE"]
["UL11_09_VFD1","I3","UL11_9_TPE2","TRACKING PHOTOEYE"]
["UL11_09_VFD1","IO0","UL11_9_BCN1_A","AMBER BEACON LIGHT"]
["UL11_09_VFD1","IO1","UL11_9_BCN1_R","RED BEACON LIGHT"]
["UL11_09_VFD1","SI0","UL11_9_EPC1","E-STOP PULLCORD"]
["UL11_09_VFD1","SI1","UL11_9_EPC1_2","E-STOP PULLCORD"]
["UL11_09_VFD1","SI2","UL11_9_EPC2","E-STOP PULLCORD"]
["UL11_09_VFD1","SI3","UL11_9_EPC2_2","E-STOP PULLCORD"]
["UL11_09_VFD1","SO0","UL11_9_BCN2_R","RED BEACON LIGHT"]
["UL11_10A_VFD1","I0","UL11_10A_VFD1_DISC","DISCONNECT AUX"]
["UL11_10A_VFD1","I1","UL11_9_TPE4","TRACKING PHOTOEYE"]
["UL11_10A_VFD1","I2","UL11_9_TPE5","TRACKING PHOTOEYE"]
["UL11_10A_VFD1","I3","SPARE"]
["UL11_10A_VFD1","IO0","UL11_9_S1_PB","START PUSHBUTTON"]
["UL11_10A_VFD1","IO1","UL11_9_S1_PB_LT","START PUSHBUTTON LIGHT"]
["UL11_10A_VFD1","SI0","SPARE"]
["UL11_10A_VFD1","SI1","SPARE"]
["UL11_10A_VFD1","SI2","SPARE"]
["UL11_10A_VFD1","SI3","SPARE"]
["UL11_10A_VFD1","SO0","SPARE"]
["UL11_10B_VFD1","I0","UL11_10B_VFD1_DISC","DISCONNECT AUX"]
["UL11_10B_VFD1","I1","SPARE"]
["UL11_10B_VFD1","I2","SPARE"]
["UL11_10B_VFD1","I3","SPARE"]
["UL11_10B_VFD1","IO0","UL11_9_JR1_PB","JAM RESET PUSHBUTTON"]
["UL11_10B_VFD1","IO1","UL11_9_JR1_PB_LT","JAM RESET PUSHBUTTON LIGHT"]
["UL11_10B_VFD1","SI0","SPARE"]
["UL11_10B_VFD1","SI1","SPARE"]
["UL11_10B_VFD1","SI2","SPARE"]
["UL11_10B_VFD1","SI3","SPARE"]
["UL11_10B_VFD1","SO0","SPARE"]
["UL11_11_VFD1","I0","UL11_11_VFD1_DISC","DISCONNECT AUX"]
["UL11_11_VFD1","I1","UL11_11_ENC1","ENCODER"]
["UL11_11_VFD1","I2","UL11_11_TPE1","TRACKING PHOTOEYE"]
["UL11_11_VFD1","I3","UL11_11_TPE2","TRACKING PHOTOEYE"]
["UL11_11_VFD1","IO0","UL11_9_S2_PB","START PUSHBUTTON"]
["UL11_11_VFD1","IO1","UL11_9_S2_PB_LT","START PUSHBUTTON LIGHT"]
["UL11_11_VFD1","SI0","SPARE"]
["UL11_11_VFD1","SI1","SPARE"]
["UL11_11_VFD1","SI2","SPARE"]
["UL11_11_VFD1","SI3","SPARE"]
["UL11_11_VFD1","SO0","SPARE"]
["UL11_12_VFD1","I0","UL11_12_VFD1_DISC","DISCONNECT AUX"]
["UL11_12_VFD1","I1","UL11_12_ENC1","ENCODER"]
["UL11_12_VFD1","I2","UL11_12_TPE1","TRACKING PHOTOEYE"]
["UL11_12_VFD1","I3","SPARE"]
["UL11_12_VFD1","IO0","SPARE"]
["UL11_12_VFD1","IO1","SPARE"]
["UL11_12_VFD1","SI0","SPARE"]
["UL11_12_VFD1","SI1","SPARE"]
["UL11_12_VFD1","SI2","SPARE"]
["UL11_12_VFD1","SI3","SPARE"]
["UL11_12_VFD1","SO0","SPARE"]
["UL11_13_VFD1","I0","UL11_13_VFD1_DISC","DISCONNECT AUX"]
["UL11_13_VFD1","I1","SPARE"]
["UL11_13_VFD1","I2","UL11_13_TPE1","TRACKING PHOTOEYE"]
["UL11_13_VFD1","I3","SPARE"]
["UL11_13_VFD1","IO0","SPARE"]
["UL11_13_VFD1","IO1","SPARE"]
["UL11_13_VFD1","SI0","SPARE"]
["UL11_13_VFD1","SI1","SPARE"]
["UL11_13_VFD1","SI2","SPARE"]
["UL11_13_VFD1","SI3","SPARE"]
["UL11_13_VFD1","SO0","SPARE"]
["UL12_3_FIO1","IO00","UL12_3_BCN1_R","RED BEACON LIGHT"]
["UL12_3_FIO1","IO01","SPARE"]
["UL12_3_FIO1","IO02","UL12_3_BCN2_R","RED BEACON LIGHT"]
["UL12_3_FIO1","IO03","SPARE"]
["UL12_3_FIO1","IO04","UL12_3_LPE1","LASEREYE"]
["UL12_3_FIO1","IO05","SPARE"]
["UL12_3_FIO1","IO06","UL12_3_LPE2","LASEREYE"]
["UL12_3_FIO1","IO07","SPARE"]
["UL12_3_FIO1","IO08","UL12_3_S1_PB","START PUSHBUTTON"]
["UL12_3_FIO1","IO09","UL12_3_S1_PB_LT","START PUSHBUTTON LIGHT"]
["UL12_3_FIO1","IO10","UL12_3_S2_PB","START PUSHBUTTON"]
["UL12_3_FIO1","IO11","UL12_3_S2_PB_LT","START PUSHBUTTON LIGHT"]
["UL12_3_FIO1","IO12","SPARE"]
["UL12_3_FIO1","IO13","SPARE"]
["UL12_3_FIO1","IO14","SPARE"]
["UL12_3_FIO1","IO15","SPARE"]
["UL12_03_VFD1","I0","UL12_3_VFD1_DISC","DISCONNECT AUX"]
["UL12_03_VFD1","I1","UL12_3_ENC1","ENCODER"]
["UL12_03_VFD1","I2","UL12_3_TPE1","TRACKING PHOTOEYE"]
["UL12_03_VFD1","I3","UL12_3_TPE2","TRACKING PHOTOEYE"]
["UL12_03_VFD1","IO0","SPARE"]
["UL12_03_VFD1","IO1","SPARE"]
["UL12_03_VFD1","SI0","UL12_3_EPC1","E-STOP PULLCORD"]
["UL12_03_VFD1","SI1","UL12_3_EPC1_2","E-STOP PULLCORD"]
["UL12_03_VFD1","SI2","UL12_3_EPC2","E-STOP PULLCORD"]
["UL12_03_VFD1","SI3","UL12_3_EPC2_2","E-STOP PULLCORD"]
["UL12_03_VFD1","SO0","UL12_1_STO1","E-STOP OK"]
["UL12_04_VFD1","I0","UL12_4_VFD1_DISC","DISCONNECT AUX"]
["UL12_04_VFD1","I1","UL12_4_ENC1","ENCODER"]
["UL12_04_VFD1","I2","UL12_4_TPE1","TRACKING PHOTOEYE"]
["UL12_04_VFD1","I3","SPARE"]
["UL12_04_VFD1","IO0","UL12_4_BCN1_R","RED BEACON LIGHT"]
["UL12_04_VFD1","IO1","UL12_4_BCN2_R","RED BEACON LIGHT"]
["UL12_04_VFD1","SI0","UL12_4_EPC1","E-STOP PULLCORD"]
["UL12_04_VFD1","SI1","UL12_4_EPC1_2","E-STOP PULLCORD"]
["UL12_04_VFD1","SI2","UL12_4_EPC2","E-STOP PULLCORD"]
["UL12_04_VFD1","SI3","UL12_4_EPC2_2","E-STOP PULLCORD"]
["UL12_04_VFD1","SO0","SPARE"]
["UL12_05_VFD1","I0","UL12_5_VFD1_DISC","DISCONNECT AUX"]
["UL12_05_VFD1","I1","UL12_5_ENC1","ENCODER"]
["UL12_05_VFD1","I2","SPARE"]
["UL12_05_VFD1","I3","SPARE"]
["UL12_05_VFD1","IO0","UL12_4_S1_PB","START PUSHBUTTON"]
["UL12_05_VFD1","IO1","UL12_4_S1_PB_LT","START PUSHBUTTON LIGHT"]
["UL12_05_VFD1","SI0","UL12_1_ESTOP1","ESTOP OK","2025-07-15"]
["UL12_05_VFD1","SI1","SPARE"]
["UL12_05_VFD1","SI2","SPARE"]
["UL12_05_VFD1","SI3","SPARE"]
["UL12_05_VFD1","SO0","SPARE"]
["UL12_06_VFD1","I0","UL12_6_VFD1_DISC","DISCONNECT AUX"]
["UL12_06_VFD1","I1","UL12_6_ENC1","ENCODER"]
["UL12_06_VFD1","I2","UL12_6_TPE1","TRACKING PHOTOEYE"]
["UL12_06_VFD1","I3","UL12_6_TPE2","TRACKING PHOTOEYE"]
["UL12_06_VFD1","IO0","UL12_4_S2_PB","START PUSHBUTTON"]
["UL12_06_VFD1","IO1","UL12_4_S2_PB_LT","START PUSHBUTTON LIGHT"]
["UL12_06_VFD1","SI0","SPARE"]
["UL12_06_VFD1","SI1","SPARE"]
["UL12_06_VFD1","SI2","SPARE"]
["UL12_06_VFD1","SI3","SPARE"]
["UL12_06_VFD1","SO0","SPARE"]
["UL12_07_VFD1","I0","UL12_7_VFD1_DISC","DISCONNECT AUX"]
["UL12_07_VFD1","I1","UL12_7_ENC1","ENCODER"]
["UL12_07_VFD1","I2","UL12_7_TPE1","TRACKING PHOTOEYE"]
["UL12_07_VFD1","I3","SPARE"]
["UL12_07_VFD1","IO0","SPARE"]
["UL12_07_VFD1","IO1","SPARE"]
["UL12_07_VFD1","SI0","SPARE"]
["UL12_07_VFD1","SI1","SPARE"]
["UL12_07_VFD1","SI2","SPARE"]
["UL12_07_VFD1","SI3","SPARE"]
["UL12_07_VFD1","SO0","SPARE"]
["UL12_08_VFD1","I0","UL12_8_VFD1_DISC","DISCONNECT AUX"]
["UL12_08_VFD1","I1","UL12_8_ENC1","ENCODER"]
["UL12_08_VFD1","I2","UL12_8_TPE1","TRACKING PHOTOEYE"]
["UL12_08_VFD1","I3","SPARE"]
["UL12_08_VFD1","IO0","SPARE"]
["UL12_08_VFD1","IO1","SPARE"]
["UL12_08_VFD1","SI0","SPARE"]
["UL12_08_VFD1","SI1","SPARE"]
["UL12_08_VFD1","SI2","SPARE"]
["UL12_08_VFD1","SI3","SPARE"]
["UL12_08_VFD1","SO0","SPARE"]
["UL12_09_VFD1","I0","UL12_9_VFD1_DISC","DISCONNECT AUX"]
["UL12_09_VFD1","I1","UL12_9_ENC1","ENCODER"]
["UL12_09_VFD1","I2","UL12_9_TPE1","TRACKING PHOTOEYE"]
["UL12_09_VFD1","I3","SPARE"]
["UL12_09_VFD1","IO0","SPARE"]
["UL12_09_VFD1","IO1","SPARE"]
["UL12_09_VFD1","SI0","SPARE"]
["UL12_09_VFD1","SI1","SPARE"]
["UL12_09_VFD1","SI2","SPARE"]
["UL12_09_VFD1","SI3","SPARE"]
["UL12_09_VFD1","SO0","SPARE"]
["UL12_10_VFD1","I0","UL12_10_VFD1_DISC","DISCONNECT AUX"]
["UL12_10_VFD1","I1","SPARE"]
["UL12_10_VFD1","I2","SPARE"]
["UL12_10_VFD1","I3","SPARE"]
["UL12_10_VFD1","IO0","SPARE"]
["UL12_10_VFD1","IO1","SPARE"]
["UL12_10_VFD1","SI0","SPARE"]
["UL12_10_VFD1","SI1","SPARE"]
["UL12_10_VFD1","SI2","SPARE"]
["UL12_10_VFD1","SI3","SPARE"]
["UL12_10_VFD1","SO0","SPARE"]
["UL2_3_FIO1","IO00","UL2_3_BCN1_R","RED BEACON LIGHT"]
["UL2_3_FIO1","IO01","SPARE"]
["UL2_3_FIO1","IO02","UL2_3_BCN2_R","RED BEACON LIGHT"]
["UL2_3_FIO1","IO03","SPARE"]
["UL2_3_FIO1","IO04","UL2_3_LPE1","LASEREYE"]
["UL2_3_FIO1","IO05","SPARE"]
["UL2_3_FIO1","IO06","UL2_3_LPE2","LASEREYE"]
["UL2_3_FIO1","IO07","SPARE"]
["UL2_3_FIO1","IO08","UL2_3_S1_PB","START PUSHBUTTON"]
["UL2_3_FIO1","IO09","UL2_3_S1_PB_LT","START PUSHBUTTON LIGHT"]
["UL2_3_FIO1","IO10","UL2_3_S2_PB","START PUSHBUTTON"]
["UL2_3_FIO1","IO11","UL2_3_S2_PB_LT","START PUSHBUTTON LIGHT"]
["UL2_3_FIO1","IO12","SPARE"]
["UL2_3_FIO1","IO13","SPARE"]
["UL2_3_FIO1","IO14","SPARE"]
["UL2_3_FIO1","IO15","SPARE"]
["UL2_03_VFD1","I0","UL2_3_VFD1_DISC","DISCONNECT AUX"]
["UL2_03_VFD1","I1","UL2_3_ENC1","ENCODER"]
["UL2_03_VFD1","I2","UL2_3_TPE1","TRACKING PHOTOEYE"]
["UL2_03_VFD1","I3","UL2_3_TPE2","TRACKING PHOTOEYE"]
["UL2_03_VFD1","IO0","SPARE"]
["UL2_03_VFD1","IO1","SPARE"]
["UL2_03_VFD1","SI0","UL2_3_EPC1","E-STOP PULLCORD"]
["UL2_03_VFD1","SI1","UL2_3_EPC1_2","E-STOP PULLCORD"]
["UL2_03_VFD1","SI2","UL2_3_EPC2","E-STOP PULLCORD"]
["UL2_03_VFD1","SI3","UL2_3_EPC2_2","E-STOP PULLCORD"]
["UL2_03_VFD1","SO0","UL2_1_STO1","E-STOP OK"]
["UL2_04_VFD1","I0","UL2_4_VFD1_DISC","DISCONNECT AUX"]
["UL2_04_VFD1","I1","UL2_4_ENC1","ENCODER"]
["UL2_04_VFD1","I2","UL2_4_TPE1","TRACKING PHOTOEYE"]
["UL2_04_VFD1","I3","SPARE"]
["UL2_04_VFD1","IO0","UL2_4_BCN1_R","RED BEACON LIGHT"]
["UL2_04_VFD1","IO1","UL2_4_BCN2_R","RED BEACON LIGHT"]
["UL2_04_VFD1","SI0","UL2_4_EPC1","E-STOP PULLCORD"]
["UL2_04_VFD1","SI1","UL2_4_EPC1_2","E-STOP PULLCORD"]
["UL2_04_VFD1","SI2","UL2_4_EPC2","E-STOP PULLCORD"]
["UL2_04_VFD1","SI3","UL2_4_EPC2_2","E-STOP PULLCORD"]
["UL2_04_VFD1","SO0","SPARE"]
["UL2_05_VFD1","I0","UL2_5_VFD1_DISC","DISCONNECT AUX"]
["UL2_05_VFD1","I1","UL2_5_ENC1","ENCODER"]
["UL2_05_VFD1","I2","SPARE"]
["UL2_05_VFD1","I3","SPARE"]
["UL2_05_VFD1","IO0","UL2_4_S1_PB","START PUSHBUTTON"]
["UL2_05_VFD1","IO1","UL2_4_S1_PB_LT","START PUSHBUTTON LIGHT"]
["UL2_05_VFD1","SI0","UL2_1_ESTOP1","ESTOP OK"]
["UL2_05_VFD1","SI1","SPARE"]
["UL2_05_VFD1","SI2","SPARE"]
["UL2_05_VFD1","SI3","SPARE"]
["UL2_05_VFD1","SO0","SPARE"]
["UL2_06_VFD1","I0","UL2_6_VFD1_DISC","DISCONNECT AUX"]
["UL2_06_VFD1","I1","UL2_6_ENC1","ENCODER"]
["UL2_06_VFD1","I2","UL2_6_TPE1","TRACKING PHOTOEYE"]
["UL2_06_VFD1","I3","UL2_6_TPE2","TRACKING PHOTOEYE"]
["UL2_06_VFD1","IO0","UL2_4_S2_PB","START PUSHBUTTON"]
["UL2_06_VFD1","IO1","UL2_4_S2_PB_LT","START PUSHBUTTON LIGHT"]
["UL2_06_VFD1","SI0","SPARE"]
["UL2_06_VFD1","SI1","SPARE"]
["UL2_06_VFD1","SI2","SPARE"]
["UL2_06_VFD1","SI3","SPARE"]
["UL2_06_VFD1","SO0","SPARE"]
["UL2_07_VFD1","I0","UL2_7_VFD1_DISC","DISCONNECT AUX"]
["UL2_07_VFD1","I1","UL2_7_ENC1","ENCODER"]
["UL2_07_VFD1","I2","UL2_7_TPE1","TRACKING PHOTOEYE"]
["UL2_07_VFD1","I3","SPARE"]
["UL2_07_VFD1","IO0","SPARE"]
["UL2_07_VFD1","IO1","SPARE"]
["UL2_07_VFD1","SI0","SPARE"]
["UL2_07_VFD1","SI1","SPARE"]
["UL2_07_VFD1","SI2","SPARE"]
["UL2_07_VFD1","SI3","SPARE"]
["UL2_07_VFD1","SO0","SPARE"]
["UL2_08_VFD1","I0","UL2_8_VFD1_DISC","DISCONNECT AUX"]
["UL2_08_VFD1","I1","UL2_8_ENC1","ENCODER"]
["UL2_08_VFD1","I2","UL2_8_TPE1","TRACKING PHOTOEYE"]
["UL2_08_VFD1","I3","SPARE"]
["UL2_08_VFD1","IO0","SPARE"]
["UL2_08_VFD1","IO1","SPARE"]
["UL2_08_VFD1","SI0","SPARE"]
["UL2_08_VFD1","SI1","SPARE"]
["UL2_08_VFD1","SI2","SPARE"]
["UL2_08_VFD1","SI3","SPARE"]
["UL2_08_VFD1","SO0","SPARE"]
["UL2_09_VFD1","I0","UL2_9_VFD1_DISC","DISCONNECT AUX"]
["UL2_09_VFD1","I1","UL2_9_ENC1","ENCODER"]
["UL2_09_VFD1","I2","UL2_9_TPE1","TRACKING PHOTOEYE"]
["UL2_09_VFD1","I3","SPARE"]
["UL2_09_VFD1","IO0","SPARE"]
["UL2_09_VFD1","IO1","SPARE"]
["UL2_09_VFD1","SI0","SPARE"]
["UL2_09_VFD1","SI1","SPARE"]
["UL2_09_VFD1","SI2","SPARE"]
["UL2_09_VFD1","SI3","SPARE"]
["UL2_09_VFD1","SO0","SPARE"]
["UL2_10_VFD1","I0","UL2_10_VFD1_DISC","DISCONNECT AUX"]
["UL2_10_VFD1","I1","SPARE"]
["UL2_10_VFD1","I2","SPARE"]
["UL2_10_VFD1","I3","SPARE"]
["UL2_10_VFD1","IO0","SPARE"]
["UL2_10_VFD1","IO1","SPARE"]
["UL2_10_VFD1","SI0","SPARE"]
["UL2_10_VFD1","SI1","SPARE"]
["UL2_10_VFD1","SI2","SPARE"]
["UL2_10_VFD1","SI3","SPARE"]
["UL2_10_VFD1","SO0","SPARE"]
["UL3_01_VFD1","I0","UL3_1_VFD1_DISC","DISCONNECT AUX"]
["UL3_01_VFD1","I1","SPARE"]
["UL3_01_VFD1","I2","UL3_1_TPE1","TRACKING PHOTOEYE"]
["UL3_01_VFD1","I3","SPARE"]
["UL3_01_VFD1","IO0","SPARE"]
["UL3_01_VFD1","IO1","SPARE"]
["UL3_01_VFD1","SI0","UL3_1_EPC1","E-STOP PULLCORD"]
["UL3_01_VFD1","SI1","UL3_1_EPC1_2","E-STOP PULLCORD"]
["UL3_01_VFD1","SI2","UL3_1_EPC2","E-STOP PULLCORD"]
["UL3_01_VFD1","SI3","UL3_1_EPC2_2","E-STOP PULLCORD"]
["UL3_01_VFD1","SO0","SPARE"]
["UL3_2_FIO1","IO00","UL3_1_BCN1_R","RED BEACON LIGHT"]
["UL3_2_FIO1","IO01","UL3_1_BCN2_R","RED BEACON LIGHT"]
["UL3_2_FIO1","IO02","UL3_1_SS1_SPB","SS STATION START PUSHBUTTON","2025-07-01"]
["UL3_2_FIO1","IO03","UL3_1_SS1_SPB_LT","SS STATION START PUSHBUTTON LIGHT","2025-07-01"]
["UL3_2_FIO1","IO04","UL3_1_SS1_STPB","SS STATION STOP PUSHBUTTON","2025-07-01"]
["UL3_2_FIO1","IO05","SPARE"]
["UL3_2_FIO1","IO06","UL3_2_LPE1","LASEREYE"]
["UL3_2_FIO1","IO07","SPARE"]
["UL3_2_FIO1","IO08","UL3_2_LPE2","LASEREYE"]
["UL3_2_FIO1","IO09","SPARE"]
["UL3_2_FIO1","IO10","UL3_2_BCN1_R","RED BEACON LIGHT"]
["UL3_2_FIO1","IO11","UL3_2_BCN2_R","RED BEACON LIGHT"]
["UL3_2_FIO1","IO12","UL3_2_S1_PB","START PUSHBUTTON"]
["UL3_2_FIO1","IO13","UL3_2_S1_PB_LT","START PUSHBUTTON LIGHT"]
["UL3_2_FIO1","IO14","UL3_2_S2_PB","START PUSHBUTTON"]
["UL3_2_FIO1","IO15","UL3_2_S2_PB_LT","START PUSHBUTTON LIGHT"]
["UL3_02_VFD1","I0","UL3_2_VFD1_DISC","DISCONNECT AUX"]
["UL3_02_VFD1","I1","UL3_2_ENC1","ENCODER"]
["UL3_02_VFD1","I2","UL3_2_TPE1","TRACKING PHOTOEYE"]
["UL3_02_VFD1","I3","UL3_2_TPE2","TRACKING PHOTOEYE"]
["UL3_02_VFD1","IO0","SPARE"]
["UL3_02_VFD1","IO1","SPARE"]
["UL3_02_VFD1","SI0","UL3_2_EPC1","E-STOP PULLCORD"]
["UL3_02_VFD1","SI1","UL3_2_EPC1_2","E-STOP PULLCORD"]
["UL3_02_VFD1","SI2","UL3_2_EPC2","E-STOP PULLCORD"]
["UL3_02_VFD1","SI3","UL3_2_EPC2_2","E-STOP PULLCORD"]
["UL3_02_VFD1","SO0","SPARE"]
["UL3_03_VFD1","I0","UL3_3_VFD1_DISC","DISCONNECT AUX"]
["UL3_03_VFD1","I1","UL3_3_ENC1","ENCODER"]
["UL3_03_VFD1","I2","SPARE"]
["UL3_03_VFD1","I3","SPARE"]
["UL3_03_VFD1","IO0","SPARE"]
["UL3_03_VFD1","IO1","SPARE"]
["UL3_03_VFD1","SI0","SPARE"]
["UL3_03_VFD1","SI1","SPARE"]
["UL3_03_VFD1","SI2","SPARE"]
["UL3_03_VFD1","SI3","SPARE"]
["UL3_03_VFD1","SO0","SPARE"]
["UL3_04_VFD1","I0","UL3_4_VFD1_DISC","DISCONNECT AUX"]
["UL3_04_VFD1","I1","UL3_4_ENC1","ENCODER"]
["UL3_04_VFD1","I2","UL3_4_TPE1","TRACKING PHOTOEYE"]
["UL3_04_VFD1","I3","UL3_4_TPE2","TRACKING PHOTOEYE"]
["UL3_04_VFD1","IO0","SPARE"]
["UL3_04_VFD1","IO1","SPARE"]
["UL3_04_VFD1","SI0","SPARE"]
["UL3_04_VFD1","SI1","SPARE"]
["UL3_04_VFD1","SI2","SPARE"]
["UL3_04_VFD1","SI3","SPARE"]
["UL3_04_VFD1","SO0","SPARE"]
["UL3_05_VFD1","I0","UL3_5_VFD1_DISC","DISCONNECT AUX"]
["UL3_05_VFD1","I1","UL3_5_ENC1","ENCODER"]
["UL3_05_VFD1","I2","UL3_5_TPE1","TRACKING PHOTOEYE"]
["UL3_05_VFD1","I3","SPARE"]
["UL3_05_VFD1","IO0","SPARE"]
["UL3_05_VFD1","IO1","SPARE"]
["UL3_05_VFD1","SI0","SPARE"]
["UL3_05_VFD1","SI1","SPARE"]
["UL3_05_VFD1","SI2","SPARE"]
["UL3_05_VFD1","SI3","SPARE"]
["UL3_05_VFD1","SO0","SPARE"]
["UL3_06_VFD1","I0","UL3_6_VFD1_DISC","DISCONNECT AUX"]
["UL3_06_VFD1","I1","UL3_6_ENC1","ENCODER"]
["UL3_06_VFD1","I2","UL3_6_TPE1","TRACKING PHOTOEYE"]
["UL3_06_VFD1","I3","SPARE"]
["UL3_06_VFD1","IO0","SPARE"]
["UL3_06_VFD1","IO1","SPARE"]
["UL3_06_VFD1","SI0","SPARE"]
["UL3_06_VFD1","SI1","SPARE"]
["UL3_06_VFD1","SI2","SPARE"]
["UL3_06_VFD1","SI3","SPARE"]
["UL3_06_VFD1","SO0","SPARE"]
["UL3_07_VFD1","I0","UL3_7_VFD1_DISC","DISCONNECT AUX"]
["UL3_07_VFD1","I1","UL3_7_ENC1","ENCODER"]
["UL3_07_VFD1","I2","UL3_7_TPE1","TRACKING PHOTOEYE"]
["UL3_07_VFD1","I3","SPARE"]
["UL3_07_VFD1","IO0","SPARE"]
["UL3_07_VFD1","IO1","SPARE"]
["UL3_07_VFD1","SI0","SPARE"]
["UL3_07_VFD1","SI1","SPARE"]
["UL3_07_VFD1","SI2","SPARE"]
["UL3_07_VFD1","SI3","SPARE"]
["UL3_07_VFD1","SO0","SPARE"]
["UL3_08_VFD1","I0","UL3_8_VFD1_DISC","DISCONNECT AUX"]
["UL3_08_VFD1","I1","UL3_8_ENC1","ENCODER"]
["UL3_08_VFD1","I2","UL3_8_TPE1","TRACKING PHOTOEYE"]
["UL3_08_VFD1","I3","SPARE"]
["UL3_08_VFD1","IO0","SPARE"]
["UL3_08_VFD1","IO1","SPARE"]
["UL3_08_VFD1","SI0","SPARE"]
["UL3_08_VFD1","SI1","SPARE"]
["UL3_08_VFD1","SI2","SPARE"]
["UL3_08_VFD1","SI3","SPARE"]
["UL3_08_VFD1","SO0","SPARE"]
["UL3_09_VFD1","I0","UL3_9_VFD1_DISC","DISCONNECT AUX"]
["UL3_09_VFD1","I1","SPARE"]
["UL3_09_VFD1","I2","SPARE"]
["UL3_09_VFD1","I3","SPARE"]
["UL3_09_VFD1","IO0","SPARE"]
["UL3_09_VFD1","IO1","SPARE"]
["UL3_09_VFD1","SI0","SPARE"]
["UL3_09_VFD1","SI1","SPARE"]
["UL3_09_VFD1","SI2","SPARE"]
["UL3_09_VFD1","SI3","SPARE"]
["UL3_09_VFD1","SO0","SPARE"]
["UL4_3_FIO1","IO00","UL4_3_BCN1_R","RED BEACON LIGHT"]
["UL4_3_FIO1","IO01","SPARE"]
["UL4_3_FIO1","IO02","UL4_3_BCN2_R","RED BEACON LIGHT"]
["UL4_3_FIO1","IO03","SPARE"]
["UL4_3_FIO1","IO04","UL4_3_LPE1","LASEREYE"]
["UL4_3_FIO1","IO05","SPARE"]
["UL4_3_FIO1","IO06","UL4_3_LPE2","LASEREYE"]
["UL4_3_FIO1","IO07","SPARE"]
["UL4_3_FIO1","IO08","UL4_3_S1_PB","START PUSHBUTTON"]
["UL4_3_FIO1","IO09","UL4_3_S1_PB_LT","START PUSHBUTTON LIGHT"]
["UL4_3_FIO1","IO10","UL4_3_S2_PB","START PUSHBUTTON"]
["UL4_3_FIO1","IO11","UL4_3_S2_PB_LT","START PUSHBUTTON LIGHT"]
["UL4_3_FIO1","IO12","SPARE"]
["UL4_3_FIO1","IO13","SPARE"]
["UL4_3_FIO1","IO14","SPARE"]
["UL4_3_FIO1","IO15","SPARE"]
["UL4_03_VFD1","I0","UL4_3_VFD1_DISC","DISCONNECT AUX"]
["UL4_03_VFD1","I1","UL4_3_ENC1","ENCODER"]
["UL4_03_VFD1","I2","UL4_3_TPE1","TRACKING PHOTOEYE"]
["UL4_03_VFD1","I3","UL4_3_TPE2","TRACKING PHOTOEYE"]
["UL4_03_VFD1","IO0","SPARE"]
["UL4_03_VFD1","IO1","SPARE"]
["UL4_03_VFD1","SI0","UL4_3_EPC1","E-STOP PULLCORD"]
["UL4_03_VFD1","SI1","UL4_3_EPC1_2","E-STOP PULLCORD"]
["UL4_03_VFD1","SI2","UL4_3_EPC2","E-STOP PULLCORD"]
["UL4_03_VFD1","SI3","UL4_3_EPC2_2","E-STOP PULLCORD"]
["UL4_03_VFD1","SO0","UL4_1_STO1","E-STOP OK"]
["UL4_04_VFD1","I0","UL4_4_VFD1_DISC","DISCONNECT AUX"]
["UL4_04_VFD1","I1","UL4_4_ENC1","ENCODER"]
["UL4_04_VFD1","I2","UL4_4_TPE1","TRACKING PHOTOEYE"]
["UL4_04_VFD1","I3","SPARE"]
["UL4_04_VFD1","IO0","UL4_4_BCN1_R","RED BEACON LIGHT"]
["UL4_04_VFD1","IO1","UL4_4_BCN2_R","RED BEACON LIGHT"]
["UL4_04_VFD1","SI0","UL4_4_EPC1","E-STOP PULLCORD"]
["UL4_04_VFD1","SI1","UL4_4_EPC1_2","E-STOP PULLCORD"]
["UL4_04_VFD1","SI2","UL4_4_EPC2","E-STOP PULLCORD"]
["UL4_04_VFD1","SI3","UL4_4_EPC2_2","E-STOP PULLCORD"]
["UL4_04_VFD1","SO0","SPARE"]
["UL4_05_VFD1","I0","UL4_5_VFD1_DISC","DISCONNECT AUX"]
["UL4_05_VFD1","I1","UL4_5_ENC1","ENCODER"]
["UL4_05_VFD1","I2","UL4_5_TPE1","TRACKING PHOTOEYE"]
["UL4_05_VFD1","I3","SPARE"]
["UL4_05_VFD1","IO0","UL4_4_S1_PB","START PUSHBUTTON"]
["UL4_05_VFD1","IO1","UL4_4_S1_PB_LT","START PUSHBUTTON LIGHT"]
["UL4_05_VFD1","SI0","UL4_1_ESTOP1","ESTOP OK"]
["UL4_05_VFD1","SI1","SPARE"]
["UL4_05_VFD1","SI2","SPARE"]
["UL4_05_VFD1","SI3","SPARE"]
["UL4_05_VFD1","SO0","SPARE"]
["UL4_06_VFD1","I0","UL4_6_VFD1_DISC","DISCONNECT AUX"]
["UL4_06_VFD1","I1","UL4_6_ENC1","ENCODER"]
["UL4_06_VFD1","I2","UL4_6_TPE1","TRACKING PHOTOEYE"]
["UL4_06_VFD1","I3","SPARE"]
["UL4_06_VFD1","IO0","UL4_4_S2_PB","START PUSHBUTTON"]
["UL4_06_VFD1","IO1","UL4_4_S2_PB_LT","START PUSHBUTTON LIGHT"]
["UL4_06_VFD1","SI0","SPARE"]
["UL4_06_VFD1","SI1","SPARE"]
["UL4_06_VFD1","SI2","SPARE"]
["UL4_06_VFD1","SI3","SPARE"]
["UL4_06_VFD1","SO0","SPARE"]
["UL4_07_VFD1","I0","UL4_7_VFD1_DISC","DISCONNECT AUX"]
["UL4_07_VFD1","I1","UL4_7_ENC1","ENCODER"]
["UL4_07_VFD1","I2","UL4_7_TPE1","TRACKING PHOTOEYE"]
["UL4_07_VFD1","I3","SPARE"]
["UL4_07_VFD1","IO0","SPARE"]
["UL4_07_VFD1","IO1","SPARE"]
["UL4_07_VFD1","SI0","SPARE"]
["UL4_07_VFD1","SI1","SPARE"]
["UL4_07_VFD1","SI2","SPARE"]
["UL4_07_VFD1","SI3","SPARE"]
["UL4_07_VFD1","SO0","SPARE"]
["UL4_08_VFD1","I0","UL4_8_VFD1_DISC","DISCONNECT AUX"]
["UL4_08_VFD1","I1","UL4_8_ENC1","ENCODER"]
["UL4_08_VFD1","I2","UL4_8_TPE1","TRACKING PHOTOEYE"]
["UL4_08_VFD1","I3","SPARE"]
["UL4_08_VFD1","IO0","SPARE"]
["UL4_08_VFD1","IO1","SPARE"]
["UL4_08_VFD1","SI0","SPARE"]
["UL4_08_VFD1","SI1","SPARE"]
["UL4_08_VFD1","SI2","SPARE"]
["UL4_08_VFD1","SI3","SPARE"]
["UL4_08_VFD1","SO0","SPARE"]
["UL4_09_VFD1","I0","UL4_9_VFD1_DISC","DISCONNECT AUX"]
["UL4_09_VFD1","I1","UL4_9_ENC1","ENCODER"]
["UL4_09_VFD1","I2","UL4_9_TPE1","TRACKING PHOTOEYE"]
["UL4_09_VFD1","I3","UL4_9_TPE2","TRACKING PHOTOEYE"]
["UL4_09_VFD1","IO0","UL4_9_BCN1_A","AMBER BEACON LIGHT"]
["UL4_09_VFD1","IO1","UL4_9_BCN1_R","RED BEACON LIGHT"]
["UL4_09_VFD1","SI0","UL4_9_EPC1","E-STOP PULLCORD"]
["UL4_09_VFD1","SI1","UL4_9_EPC1_2","E-STOP PULLCORD"]
["UL4_09_VFD1","SI2","UL4_9_EPC2","E-STOP PULLCORD"]
["UL4_09_VFD1","SI3","UL4_9_EPC2_2","E-STOP PULLCORD"]
["UL4_09_VFD1","SO0","UL4_9_BCN2_R","RED BEACON LIGHT"]
["UL4_10A_VFD1","I0","UL4_10A_VFD1_DISC","DISCONNECT AUX"]
["UL4_10A_VFD1","I1","UL4_9_TPE3","TRACKING PHOTOEYE"]
["UL4_10A_VFD1","I2","UL4_9_TPE4","TRACKING PHOTOEYE"]
["UL4_10A_VFD1","I3","UL4_9_TPE5","TRACKING PHOTOEYE"]
["UL4_10A_VFD1","IO0","UL4_9_JR1_PB","JAM RESET PUSHBUTTON"]
["UL4_10A_VFD1","IO1","UL4_9_JR1_PB_LT","JAM RESET PUSHBUTTON LIGHT"]
["UL4_10A_VFD1","SI0","SPARE"]
["UL4_10A_VFD1","SI1","SPARE"]
["UL4_10A_VFD1","SI2","SPARE"]
["UL4_10A_VFD1","SI3","SPARE"]
["UL4_10A_VFD1","SO0","SPARE"]
["UL4_10B_VFD1","I0","UL4_10B_VFD1_DISC","DISCONNECT AUX"]
["UL4_10B_VFD1","I1","SPARE"]
["UL4_10B_VFD1","I2","SPARE"]
["UL4_10B_VFD1","I3","SPARE"]
["UL4_10B_VFD1","IO0","UL4_9_JR2_PB","JAM RESET PUSHBUTTON"]
["UL4_10B_VFD1","IO1","UL4_9_JR2_PB_LT","JAM RESET PUSHBUTTON LIGHT"]
["UL4_10B_VFD1","SI0","SPARE"]
["UL4_10B_VFD1","SI1","SPARE"]
["UL4_10B_VFD1","SI2","SPARE"]
["UL4_10B_VFD1","SI3","SPARE"]
["UL4_10B_VFD1","SO0","SPARE"]
["UL4_11_VFD1","I0","UL4_11_VFD1_DISC","DISCONNECT AUX"]
["UL4_11_VFD1","I1","SPARE"]
["UL4_11_VFD1","I2","UL4_11_TPE1","TRACKING PHOTOEYE"]
["UL4_11_VFD1","I3","UL4_11_TPE2","TRACKING PHOTOEYE"]
["UL4_11_VFD1","IO0","UL4_9_S1_PB","START PUSHBUTTON"]
["UL4_11_VFD1","IO1","UL4_9_S1_PB_LT","START PUSHBUTTON LIGHT"]
["UL4_11_VFD1","SI0","SPARE"]
["UL4_11_VFD1","SI1","SPARE"]
["UL4_11_VFD1","SI2","SPARE"]
["UL4_11_VFD1","SI3","SPARE"]
["UL4_11_VFD1","SO0","SPARE"]
["UL4_12_VFD1","I0","UL4_12_VFD1_DISC","DISCONNECT AUX"]
["UL4_12_VFD1","I1","SPARE"]
["UL4_12_VFD1","I2","UL4_12_TPE1","TRACKING PHOTOEYE"]
["UL4_12_VFD1","I3","SPARE"]
["UL4_12_VFD1","IO0","UL4_9_S2_PB","START PUSHBUTTON"]
["UL4_12_VFD1","IO1","UL4_9_S2_PB_LT","START PUSHBUTTON LIGHT"]
["UL4_12_VFD1","SI0","SPARE"]
["UL4_12_VFD1","SI1","SPARE"]
["UL4_12_VFD1","SI2","SPARE"]
["UL4_12_VFD1","SI3","SPARE"]
["UL4_12_VFD1","SO0","SPARE"]
["UL4_13_VFD1","I0","UL4_13_VFD1_DISC","DISCONNECT AUX"]
["UL4_13_VFD1","I1","SPARE"]
["UL4_13_VFD1","I2","SPARE"]
["UL4_13_VFD1","I3","SPARE"]
["UL4_13_VFD1","IO0","SPARE"]
["UL4_13_VFD1","IO1","SPARE"]
["UL4_13_VFD1","SI0","SPARE"]
["UL4_13_VFD1","SI1","SPARE"]
["UL4_13_VFD1","SI2","SPARE"]
["UL4_13_VFD1","SI3","SPARE"]
["UL4_13_VFD1","SO0","SPARE"]
["UL5_3_FIO1","IO00","UL5_3_BCN1_R","RED BEACON LIGHT"]
["UL5_3_FIO1","IO01","SPARE"]
["UL5_3_FIO1","IO02","UL5_3_BCN2_R","RED BEACON LIGHT"]
["UL5_3_FIO1","IO03","SPARE"]
["UL5_3_FIO1","IO04","UL5_3_LPE1","LASEREYE"]
["UL5_3_FIO1","IO05","SPARE"]
["UL5_3_FIO1","IO06","UL5_3_LPE2","LASEREYE"]
["UL5_3_FIO1","IO07","SPARE"]
["UL5_3_FIO1","IO08","UL5_3_S1_PB","START PUSHBUTTON"]
["UL5_3_FIO1","IO09","UL5_3_S1_PB_LT","START PUSHBUTTON LIGHT"]
["UL5_3_FIO1","IO10","UL5_3_S2_PB","START PUSHBUTTON"]
["UL5_3_FIO1","IO11","UL5_3_S2_PB_LT","START PUSHBUTTON LIGHT"]
["UL5_3_FIO1","IO12","SPARE"]
["UL5_3_FIO1","IO13","SPARE"]
["UL5_3_FIO1","IO14","SPARE"]
["UL5_3_FIO1","IO15","SPARE"]
["UL5_03_VFD1","I0","UL5_3_VFD1_DISC","DISCONNECT AUX"]
["UL5_03_VFD1","I1","UL5_3_ENC1","ENCODER"]
["UL5_03_VFD1","I2","UL5_3_TPE1","TRACKING PHOTOEYE"]
["UL5_03_VFD1","I3","UL5_3_TPE2","TRACKING PHOTOEYE"]
["UL5_03_VFD1","IO0","UL5_4_S1_PB","START PUSHBUTTON"]
["UL5_03_VFD1","IO1","UL5_4_S1_PB_LT","START PUSHBUTTON LIGHT"]
["UL5_03_VFD1","SI0","UL5_3_EPC1","E-STOP PULLCORD"]
["UL5_03_VFD1","SI1","UL5_3_EPC1_2","E-STOP PULLCORD"]
["UL5_03_VFD1","SI2","UL5_3_EPC2","E-STOP PULLCORD"]
["UL5_03_VFD1","SI3","UL5_3_EPC2_2","E-STOP PULLCORD"]
["UL5_03_VFD1","SO0","UL5_1_STO1","E-STOP OK"]
["UL5_04_VFD1","I0","UL5_4_VFD1_DISC","DISCONNECT AUX"]
["UL5_04_VFD1","I1","UL5_4_ENC1","ENCODER"]
["UL5_04_VFD1","I2","UL5_4_TPE1","TRACKING PHOTOEYE"]
["UL5_04_VFD1","I3","SPARE"]
["UL5_04_VFD1","IO0","UL5_4_BCN1_R","RED BEACON LIGHT"]
["UL5_04_VFD1","IO1","UL5_4_BCN2_R","RED BEACON LIGHT"]
["UL5_04_VFD1","SI0","UL5_4_EPC1","E-STOP PULLCORD"]
["UL5_04_VFD1","SI1","UL5_4_EPC1_2","E-STOP PULLCORD"]
["UL5_04_VFD1","SI2","UL5_4_EPC2","E-STOP PULLCORD"]
["UL5_04_VFD1","SI3","UL5_4_EPC2_2","E-STOP PULLCORD"]
["UL5_04_VFD1","SO0","SPARE"]
["UL5_05_VFD1","I0","UL5_5_VFD1_DISC","DISCONNECT AUX"]
["UL5_05_VFD1","I1","UL5_5_ENC1","ENCODER"]
["UL5_05_VFD1","I2","SPARE"]
["UL5_05_VFD1","I3","SPARE"]
["UL5_05_VFD1","IO0","UL5_4_S2_PB","START PUSHBUTTON"]
["UL5_05_VFD1","IO1","UL5_4_S2_PB_LT","START PUSHBUTTON LIGHT"]
["UL5_05_VFD1","SI0","UL5_1_ESTOP1","E-STOP OK"]
["UL5_05_VFD1","SI1","SPARE"]
["UL5_05_VFD1","SI2","SPARE"]
["UL5_05_VFD1","SI3","SPARE"]
["UL5_05_VFD1","SO0","SPARE"]
["UL5_06_VFD1","I0","UL5_6_VFD1_DISC","DISCONNECT AUX"]
["UL5_06_VFD1","I1","UL5_6_ENC1","ENCODER"]
["UL5_06_VFD1","I2","UL5_6_TPE1","TRACKING PHOTOEYE"]
["UL5_06_VFD1","I3","UL5_6_TPE2","TRACKING PHOTOEYE"]
["UL5_06_VFD1","IO0","SPARE"]
["UL5_06_VFD1","IO1","SPARE"]
["UL5_06_VFD1","SI0","SPARE"]
["UL5_06_VFD1","SI1","SPARE"]
["UL5_06_VFD1","SI2","SPARE"]
["UL5_06_VFD1","SI3","SPARE"]
["UL5_06_VFD1","SO0","SPARE"]
["UL5_07_VFD1","I0","UL5_7_VFD1_DISC","DISCONNECT AUX"]
["UL5_07_VFD1","I1","UL5_7_ENC1","ENCODER"]
["UL5_07_VFD1","I2","UL5_7_TPE1","TRACKING PHOTOEYE"]
["UL5_07_VFD1","I3","SPARE"]
["UL5_07_VFD1","IO0","SPARE"]
["UL5_07_VFD1","IO1","SPARE"]
["UL5_07_VFD1","SI0","SPARE"]
["UL5_07_VFD1","SI1","SPARE"]
["UL5_07_VFD1","SI2","SPARE"]
["UL5_07_VFD1","SI3","SPARE"]
["UL5_07_VFD1","SO0","SPARE"]
["UL5_08_VFD1","I0","UL5_8_VFD1_DISC","DISCONNECT AUX"]
["UL5_08_VFD1","I1","UL5_8_ENC1","ENCODER"]
["UL5_08_VFD1","I2","UL5_8_TPE1","TRACKING PHOTOEYE"]
["UL5_08_VFD1","I3","SPARE"]
["UL5_08_VFD1","IO0","SPARE"]
["UL5_08_VFD1","IO1","SPARE"]
["UL5_08_VFD1","SI0","SPARE"]
["UL5_08_VFD1","SI1","SPARE"]
["UL5_08_VFD1","SI2","SPARE"]
["UL5_08_VFD1","SI3","SPARE"]
["UL5_08_VFD1","SO0","SPARE"]
["UL5_09_VFD1","I0","UL5_9_VFD1_DISC","DISCONNECT AUX"]
["UL5_09_VFD1","I1","UL5_9_ENC1","ENCODER"]
["UL5_09_VFD1","I2","UL5_9_TPE1","TRACKING PHOTOEYE"]
["UL5_09_VFD1","I3","SPARE"]
["UL5_09_VFD1","IO0","SPARE"]
["UL5_09_VFD1","IO1","SPARE"]
["UL5_09_VFD1","SI0","SPARE"]
["UL5_09_VFD1","SI1","SPARE"]
["UL5_09_VFD1","SI2","SPARE"]
["UL5_09_VFD1","SI3","SPARE"]
["UL5_09_VFD1","SO0","SPARE"]
["UL5_10_VFD1","I0","UL5_10_VFD1_DISC","DISCONNECT AUX"]
["UL5_10_VFD1","I1","SPARE"]
["UL5_10_VFD1","I2","SPARE"]
["UL5_10_VFD1","I3","SPARE"]
["UL5_10_VFD1","IO0","SPARE"]
["UL5_10_VFD1","IO1","SPARE"]
["UL5_10_VFD1","SI0","SPARE"]
["UL5_10_VFD1","SI1","SPARE"]
["UL5_10_VFD1","SI2","SPARE"]
["UL5_10_VFD1","SI3","SPARE"]
["UL5_10_VFD1","SO0","SPARE"]
["UL6_01_VFD1","I0","UL6_1_VFD1_DISC","DISCONNECT AUX"]
["UL6_01_VFD1","I1","SPARE"]
["UL6_01_VFD1","I2","UL6_1_TPE1","TRACKING PHOTOEYE"]
["UL6_01_VFD1","I3","SPARE"]
["UL6_01_VFD1","IO0","SPARE"]
["UL6_01_VFD1","IO1","SPARE"]
["UL6_01_VFD1","SI0","UL6_1_EPC1","E-STOP PULLCORD"]
["UL6_01_VFD1","SI1","UL6_1_EPC1_2","E-STOP PULLCORD"]
["UL6_01_VFD1","SI2","UL6_1_EPC2","E-STOP PULLCORD"]
["UL6_01_VFD1","SI3","UL6_1_EPC2_2","E-STOP PULLCORD"]
["UL6_01_VFD1","SO0","SPARE"]
["UL6_2_FIO1","IO00","UL6_1_BCN1_R","RED BEACON LIGHT"]
["UL6_2_FIO1","IO01","UL6_1_BCN2_R","RED BEACON LIGHT"]
["UL6_2_FIO1","IO02","UL6_1_SS1_SPB","SS STATION START PUSHBUTTON","2025-07-01"]
["UL6_2_FIO1","IO03","UL6_1_SS1_SPB_LT","SS STATION START PUSHBUTTON LIGHT","2025-07-01"]
["UL6_2_FIO1","IO04","UL6_1_SS1_STPB","SS STATION STOP PUSHBUTTON","2025-07-01"]
["UL6_2_FIO1","IO05","SPARE"]
["UL6_2_FIO1","IO06","UL6_2_BCN1_R","RED BEACON LIGHT"]
["UL6_2_FIO1","IO07","UL6_2_BCN2_R","RED BEACON LIGHT"]
["UL6_2_FIO1","IO08","UL6_2_LPE1","LASEREYE"]
["UL6_2_FIO1","IO09","SPARE"]
["UL6_2_FIO1","IO10","UL6_2_LPE2","LASEREYE"]
["UL6_2_FIO1","IO11","SPARE"]
["UL6_2_FIO1","IO12","UL6_2_S1_PB","START PUSHBUTTON"]
["UL6_2_FIO1","IO13","UL6_2_S1_PB_LT","START PUSHBUTTON LIGHT"]
["UL6_2_FIO1","IO14","UL6_2_S2_PB","START PUSHBUTTON"]
["UL6_2_FIO1","IO15","UL6_2_S2_PB_LT","START PUSHBUTTON LIGHT"]
["UL6_02_VFD1","I0","UL6_2_VFD1_DISC","DISCONNECT AUX"]
["UL6_02_VFD1","I1","UL6_2_ENC1","ENCODER"]
["UL6_02_VFD1","I2","UL6_2_TPE1","TRACKING PHOTOEYE"]
["UL6_02_VFD1","I3","UL6_2_TPE2","TRACKING PHOTOEYE"]
["UL6_02_VFD1","IO0","SPARE"]
["UL6_02_VFD1","IO1","SPARE"]
["UL6_02_VFD1","SI0","UL6_2_EPC1","E-STOP PULLCORD"]
["UL6_02_VFD1","SI1","UL6_2_EPC1_2","E-STOP PULLCORD"]
["UL6_02_VFD1","SI2","UL6_2_EPC2","E-STOP PULLCORD"]
["UL6_02_VFD1","SI3","UL6_2_EPC2_2","E-STOP PULLCORD"]
["UL6_02_VFD1","SO0","SPARE"]
["UL6_03_VFD1","I0","UL6_3_VFD1_DISC","DISCONNECT AUX"]
["UL6_03_VFD1","I1","UL6_3_ENC1","ENCODER"]
["UL6_03_VFD1","I2","SPARE"]
["UL6_03_VFD1","I3","SPARE"]
["UL6_03_VFD1","IO0","SPARE"]
["UL6_03_VFD1","IO1","SPARE"]
["UL6_03_VFD1","SI0","SPARE"]
["UL6_03_VFD1","SI1","SPARE"]
["UL6_03_VFD1","SI2","SPARE"]
["UL6_03_VFD1","SI3","SPARE"]
["UL6_03_VFD1","SO0","SPARE"]
["UL6_04_VFD1","I0","UL6_4_VFD1_DISC","DISCONNECT AUX"]
["UL6_04_VFD1","I1","UL6_4_ENC1","ENCODER"]
["UL6_04_VFD1","I2","UL6_4_TPE1","TRACKING PHOTOEYE"]
["UL6_04_VFD1","I3","UL6_4_TPE2","TRACKING PHOTOEYE"]
["UL6_04_VFD1","IO0","SPARE"]
["UL6_04_VFD1","IO1","SPARE"]
["UL6_04_VFD1","SI0","SPARE"]
["UL6_04_VFD1","SI1","SPARE"]
["UL6_04_VFD1","SI2","SPARE"]
["UL6_04_VFD1","SI3","SPARE"]
["UL6_04_VFD1","SO0","SPARE"]
["UL6_05_VFD1","I0","UL6_5_VFD1_DISC","DISCONNECT AUX"]
["UL6_05_VFD1","I1","UL6_5_ENC1","ENCODER"]
["UL6_05_VFD1","I2","UL6_5_TPE1","TRACKING PHOTOEYE"]
["UL6_05_VFD1","I3","SPARE"]
["UL6_05_VFD1","IO0","SPARE"]
["UL6_05_VFD1","IO1","SPARE"]
["UL6_05_VFD1","SI0","SPARE"]
["UL6_05_VFD1","SI1","SPARE"]
["UL6_05_VFD1","SI2","SPARE"]
["UL6_05_VFD1","SI3","SPARE"]
["UL6_05_VFD1","SO0","SPARE"]
["UL6_06_VFD1","I0","UL6_6_VFD1_DISC","DISCONNECT AUX"]
["UL6_06_VFD1","I1","UL6_6_ENC1","ENCODER"]
["UL6_06_VFD1","I2","UL6_6_TPE1","TRACKING PHOTOEYE"]
["UL6_06_VFD1","I3","SPARE"]
["UL6_06_VFD1","IO0","SPARE"]
["UL6_06_VFD1","IO1","SPARE"]
["UL6_06_VFD1","SI0","SPARE"]
["UL6_06_VFD1","SI1","SPARE"]
["UL6_06_VFD1","SI2","SPARE"]
["UL6_06_VFD1","SI3","SPARE"]
["UL6_06_VFD1","SO0","SPARE"]
["UL6_07_VFD1","I0","UL6_7_VFD1_DISC","DISCONNECT AUX"]
["UL6_07_VFD1","I1","UL6_7_ENC1","ENCODER"]
["UL6_07_VFD1","I2","UL6_7_TPE1","TRACKING PHOTOEYE"]
["UL6_07_VFD1","I3","SPARE"]
["UL6_07_VFD1","IO0","SPARE"]
["UL6_07_VFD1","IO1","SPARE"]
["UL6_07_VFD1","SI0","SPARE"]
["UL6_07_VFD1","SI1","SPARE"]
["UL6_07_VFD1","SI2","SPARE"]
["UL6_07_VFD1","SI3","SPARE"]
["UL6_07_VFD1","SO0","SPARE"]
["UL6_08_VFD1","I0","UL6_8_VFD1_DISC","DISCONNECT AUX"]
["UL6_08_VFD1","I1","UL6_8_ENC1","ENCODER"]
["UL6_08_VFD1","I2","UL6_8_TPE1","TRACKING PHOTOEYE"]
["UL6_08_VFD1","I3","SPARE"]
["UL6_08_VFD1","IO0","SPARE"]
["UL6_08_VFD1","IO1","SPARE"]
["UL6_08_VFD1","SI0","SPARE"]
["UL6_08_VFD1","SI1","SPARE"]
["UL6_08_VFD1","SI2","SPARE"]
["UL6_08_VFD1","SI3","SPARE"]
["UL6_08_VFD1","SO0","SPARE"]
["UL6_09_VFD1","I0","UL6_9_VFD1_DISC","DISCONNECT AUX"]
["UL6_09_VFD1","I1","SPARE"]
["UL6_09_VFD1","I2","SPARE"]
["UL6_09_VFD1","I3","SPARE"]
["UL6_09_VFD1","IO0","SPARE"]
["UL6_09_VFD1","IO1","SPARE"]
["UL6_09_VFD1","SI0","SPARE"]
["UL6_09_VFD1","SI1","SPARE"]
["UL6_09_VFD1","SI2","SPARE"]
["UL6_09_VFD1","SI3","SPARE"]
["UL6_09_VFD1","SO0","SPARE"]
["UL7_3_FIO1","IO00","UL7_3_BCN1_R","RED BEACON LIGHT"]
["UL7_3_FIO1","IO01","SPARE"]
["UL7_3_FIO1","IO02","UL7_3_BCN2_R","RED BEACON LIGHT"]
["UL7_3_FIO1","IO03","SPARE"]
["UL7_3_FIO1","IO04","UL7_3_LPE1","LASEREYE"]
["UL7_3_FIO1","IO05","SPARE"]
["UL7_3_FIO1","IO06","UL7_3_LPE2","LASEREYE"]
["UL7_3_FIO1","IO07","SPARE"]
["UL7_3_FIO1","IO08","UL7_3_S1_PB","START PUSHBUTTON"]
["UL7_3_FIO1","IO09","UL7_3_S1_PB_LT","START PUSHBUTTON LIGHT"]
["UL7_3_FIO1","IO10","UL7_3_S2_PB","START PUSHBUTTON"]
["UL7_3_FIO1","IO11","UL7_3_S2_PB_LT","START PUSHBUTTON LIGHT"]
["UL7_3_FIO1","IO12","SPARE"]
["UL7_3_FIO1","IO13","SPARE"]
["UL7_3_FIO1","IO14","SPARE"]
["UL7_3_FIO1","IO15","SPARE"]
["UL7_03_VFD1","I0","UL7_3_VFD1_DISC","DISCONNECT AUX"]
["UL7_03_VFD1","I1","UL7_3_ENC1","ENCODER"]
["UL7_03_VFD1","I2","UL7_3_TPE1","TRACKING PHOTOEYE"]
["UL7_03_VFD1","I3","UL7_3_TPE2","TRACKING PHOTOEYE"]
["UL7_03_VFD1","IO0","UL7_4_S1_PB","START PUSHBUTTON"]
["UL7_03_VFD1","IO1","UL7_4_S1_PB_LT","START PUSHBUTTON LIGHT"]
["UL7_03_VFD1","SI0","UL7_3_EPC1","E-STOP PULLCORD"]
["UL7_03_VFD1","SI1","UL7_3_EPC1_2","E-STOP PULLCORD"]
["UL7_03_VFD1","SI2","UL7_3_EPC2","E-STOP PULLCORD"]
["UL7_03_VFD1","SI3","UL7_3_EPC2_2","E-STOP PULLCORD"]
["UL7_03_VFD1","SO0","UL7_1_STO1","E-STOP OK"]
["UL7_04_VFD1","I0","UL7_4_VFD1_DISC","DISCONNECT AUX"]
["UL7_04_VFD1","I1","UL7_4_ENC1","ENCODER"]
["UL7_04_VFD1","I2","UL7_4_TPE1","TRACKING PHOTOEYE"]
["UL7_04_VFD1","I3","SPARE"]
["UL7_04_VFD1","IO0","UL7_4_BCN1_R","RED BEACON LIGHT"]
["UL7_04_VFD1","IO1","UL7_4_BCN2_R","RED BEACON LIGHT"]
["UL7_04_VFD1","SI0","UL7_4_EPC1","E-STOP PULLCORD"]
["UL7_04_VFD1","SI1","UL7_4_EPC1_2","E-STOP PULLCORD"]
["UL7_04_VFD1","SI2","UL7_4_EPC2","E-STOP PULLCORD"]
["UL7_04_VFD1","SI3","UL7_4_EPC2_2","E-STOP PULLCORD"]
["UL7_04_VFD1","SO0","SPARE"]
["UL7_05_VFD1","I0","UL7_5_VFD1_DISC","DISCONNECT AUX"]
["UL7_05_VFD1","I1","UL7_5_ENC1","ENCODER"]
["UL7_05_VFD1","I2","UL7_5_TPE1","TRACKING PHOTOEYE"]
["UL7_05_VFD1","I3","SPARE"]
["UL7_05_VFD1","IO0","UL7_4_S2_PB","START PUSHBUTTON"]
["UL7_05_VFD1","IO1","UL7_4_S2_PB_LT","START PUSHBUTTON LIGHT"]
["UL7_05_VFD1","SI0","UL7_1_ESTOP1","ESTOP OK"]
["UL7_05_VFD1","SI1","SPARE"]
["UL7_05_VFD1","SI2","SPARE"]
["UL7_05_VFD1","SI3","SPARE"]
["UL7_05_VFD1","SO0","SPARE"]
["UL7_06_VFD1","I0","UL7_6_VFD1_DISC","DISCONNECT AUX"]
["UL7_06_VFD1","I1","UL7_6_ENC1","ENCODER"]
["UL7_06_VFD1","I2","UL7_6_TPE1","TRACKING PHOTOEYE"]
["UL7_06_VFD1","I3","SPARE"]
["UL7_06_VFD1","IO0","UL7_9_S1_PB","START PUSHBUTTON"]
["UL7_06_VFD1","IO1","UL7_9_S1_PB_LT","START PUSHBUTTON LIGHT"]
["UL7_06_VFD1","SI0","SPARE"]
["UL7_06_VFD1","SI1","SPARE"]
["UL7_06_VFD1","SI2","SPARE"]
["UL7_06_VFD1","SI3","SPARE"]
["UL7_06_VFD1","SO0","SPARE"]
["UL7_07_VFD1","I0","UL7_7_VFD1_DISC","DISCONNECT AUX"]
["UL7_07_VFD1","I1","UL7_7_ENC1","ENCODER"]
["UL7_07_VFD1","I2","UL7_7_TPE1","TRACKING PHOTOEYE"]
["UL7_07_VFD1","I3","SPARE"]
["UL7_07_VFD1","IO0","UL7_9_JR2_PB","JAM RESET PUSHBUTTON"]
["UL7_07_VFD1","IO1","UL7_9_JR2_PB_LT","JAM RESET PUSHBUTTON LIGHT"]
["UL7_07_VFD1","SI0","SPARE"]
["UL7_07_VFD1","SI1","SPARE"]
["UL7_07_VFD1","SI2","SPARE"]
["UL7_07_VFD1","SI3","SPARE"]
["UL7_07_VFD1","SO0","SPARE"]
["UL7_08_VFD1","I0","UL7_8_VFD1_DISC","DISCONNECT AUX"]
["UL7_08_VFD1","I1","UL7_8_ENC1","ENCODER"]
["UL7_08_VFD1","I2","UL7_8_TPE1","TRACKING PHOTOEYE"]
["UL7_08_VFD1","I3","SPARE"]
["UL7_08_VFD1","IO0","UL7_9_JR1_PB","JAM RESET PUSHBUTTON"]
["UL7_08_VFD1","IO1","UL7_9_JR1_PB_LT","JAM RESET PUSHBUTTON LIGHT"]
["UL7_08_VFD1","SI0","SPARE"]
["UL7_08_VFD1","SI1","SPARE"]
["UL7_08_VFD1","SI2","SPARE"]
["UL7_08_VFD1","SI3","SPARE"]
["UL7_08_VFD1","SO0","SPARE"]
["UL7_09_VFD1","I0","UL7_9_VFD1_DISC","DISCONNECT AUX"]
["UL7_09_VFD1","I1","SPARE"]
["UL7_09_VFD1","I2","UL7_9_TPE1","TRACKING PHOTOEYE"]
["UL7_09_VFD1","I3","UL7_9_TPE2","TRACKING PHOTOEYE"]
["UL7_09_VFD1","IO0","UL7_9_BCN1_A","AMBER BEACON LIGHT"]
["UL7_09_VFD1","IO1","UL7_9_BCN1_R","RED BEACON LIGHT"]
["UL7_09_VFD1","SI0","UL7_9_EPC1","E-STOP PULLCORD"]
["UL7_09_VFD1","SI1","UL7_9_EPC1_2","E-STOP PULLCORD"]
["UL7_09_VFD1","SI2","UL7_9_EPC2","E-STOP PULLCORD"]
["UL7_09_VFD1","SI3","UL7_9_EPC2_2","E-STOP PULLCORD"]
["UL7_09_VFD1","SO0","UL7_9_BCN2_R","RED BEACON LIGHT"]
["UL7_10A_VFD1","I0","UL7_10A_VFD1_DISC","DISCONNECT AUX"]
["UL7_10A_VFD1","I1","UL7_9_TPE4","TRACKING PHOTOEYE"]
["UL7_10A_VFD1","I2","UL7_9_TPE5","TRACKING PHOTOEYE"]
["UL7_10A_VFD1","I3","SPARE"]
["UL7_10A_VFD1","IO0","UL7_9_S2_PB","START PUSHBUTTON"]
["UL7_10A_VFD1","IO1","UL7_9_S2_PB_LT","START PUSHBUTTON LIGHT"]
["UL7_10A_VFD1","SI0","SPARE"]
["UL7_10A_VFD1","SI1","SPARE"]
["UL7_10A_VFD1","SI2","SPARE"]
["UL7_10A_VFD1","SI3","SPARE"]
["UL7_10A_VFD1","SO0","SPARE"]
["UL7_10B_VFD1","I0","UL7_10B_VFD1_DISC","DISCONNECT AUX"]
["UL7_10B_VFD1","I1","SPARE"]
["UL7_10B_VFD1","I2","SPARE"]
["UL7_10B_VFD1","I3","SPARE"]
["UL7_10B_VFD1","IO0","SPARE"]
["UL7_10B_VFD1","IO1","SPARE"]
["UL7_10B_VFD1","SI0","SPARE"]
["UL7_10B_VFD1","SI1","SPARE"]
["UL7_10B_VFD1","SI2","SPARE"]
["UL7_10B_VFD1","SI3","SPARE"]
["UL7_10B_VFD1","SO0","SPARE"]
["UL7_11_VFD1","I0","UL7_11_VFD1_DISC","DISCONNECT AUX"]
["UL7_11_VFD1","I1","SPARE"]
["UL7_11_VFD1","I2","UL7_11_TPE1","TRACKING PHOTOEYE"]
["UL7_11_VFD1","I3","UL7_11_TPE2","TRACKING PHOTOEYE"]
["UL7_11_VFD1","IO0","SPARE"]
["UL7_11_VFD1","IO1","SPARE"]
["UL7_11_VFD1","SI0","SPARE"]
["UL7_11_VFD1","SI1","SPARE"]
["UL7_11_VFD1","SI2","SPARE"]
["UL7_11_VFD1","SI3","SPARE"]
["UL7_11_VFD1","SO0","SPARE"]
["UL7_12_VFD1","I0","UL7_12_VFD1_DISC","DISCONNECT AUX"]
["UL7_12_VFD1","I1","SPARE"]
["UL7_12_VFD1","I2","UL7_12_TPE1","TRACKING PHOTOEYE"]
["UL7_12_VFD1","I3","SPARE"]
["UL7_12_VFD1","IO0","SPARE"]
["UL7_12_VFD1","IO1","SPARE"]
["UL7_12_VFD1","SI0","SPARE"]
["UL7_12_VFD1","SI1","SPARE"]
["UL7_12_VFD1","SI2","SPARE"]
["UL7_12_VFD1","SI3","SPARE"]
["UL7_12_VFD1","SO0","SPARE"]
["UL7_13_VFD1","I0","UL7_13_VFD1_DISC","DISCONNECT AUX"]
["UL7_13_VFD1","I1","SPARE"]
["UL7_13_VFD1","I2","SPARE"]
["UL7_13_VFD1","I3","SPARE"]
["UL7_13_VFD1","IO0","SPARE"]
["UL7_13_VFD1","IO1","SPARE"]
["UL7_13_VFD1","SI0","SPARE"]
["UL7_13_VFD1","SI1","SPARE"]
["UL7_13_VFD1","SI2","SPARE"]
["UL7_13_VFD1","SI3","SPARE"]
["UL7_13_VFD1","SO0","SPARE"]
["UL8_01_VFD1","I0","UL8_1_VFD1_DISC","DISCONNECT AUX"]
["UL8_01_VFD1","I1","SPARE"]
["UL8_01_VFD1","I2","UL8_1_TPE1","TRACKING PHOTOEYE"]
["UL8_01_VFD1","I3","SPARE"]
["UL8_01_VFD1","IO0","SPARE"]
["UL8_01_VFD1","IO1","SPARE"]
["UL8_01_VFD1","SI0","UL8_1_EPC1","E-STOP PULLCORD"]
["UL8_01_VFD1","SI1","UL8_1_EPC1_2","E-STOP PULLCORD"]
["UL8_01_VFD1","SI2","UL8_1_EPC2","E-STOP PULLCORD"]
["UL8_01_VFD1","SI3","UL8_1_EPC2_2","E-STOP PULLCORD"]
["UL8_01_VFD1","SO0","SPARE"]
["UL8_2_FIO1","IO00","UL8_1_BCN1_R","RED BEACON LIGHT"]
["UL8_2_FIO1","IO01","SPARE"]
["UL8_2_FIO1","IO02","UL8_1_BCN2_R","RED BEACON LIGHT"]
["UL8_2_FIO1","IO03","SPARE"]
["UL8_2_FIO1","IO04","UL8_1_SS1_SPB","SS STATION START PUSHBUTTON","2025-07-01"]
["UL8_2_FIO1","IO05","UL8_1_SS1_SPB_LT","SS STATION START PUSHBUTTON LIGHT","2025-07-01"]
["UL8_2_FIO1","IO06","UL8_1_SS1_STPB","SS STATION STOP PUSHBUTTON","2025-07-01"]
["UL8_2_FIO1","IO07","SPARE"]
["UL8_2_FIO1","IO08","UL8_2_LPE1","LASEREYE"]
["UL8_2_FIO1","IO09","SPARE"]
["UL8_2_FIO1","IO10","UL8_2_LPE2","LASEREYE"]
["UL8_2_FIO1","IO11","SPARE"]
["UL8_2_FIO1","IO12","SPARE"]
["UL8_2_FIO1","IO13","SPARE"]
["UL8_2_FIO1","IO14","SPARE"]
["UL8_2_FIO1","IO15","SPARE"]
["UL8_02_VFD1","I0","UL8_2_VFD1_DISC","DISCONNECT AUX"]
["UL8_02_VFD1","I1","SPARE"]
["UL8_02_VFD1","I2","UL8_2_TPE1","TRACKING PHOTOEYE"]
["UL8_02_VFD1","I3","UL8_2_TPE2","TRACKING PHOTOEYE"]
["UL8_02_VFD1","IO0","SPARE"]
["UL8_02_VFD1","IO1","SPARE"]
["UL8_02_VFD1","SI0","SPARE"]
["UL8_02_VFD1","SI1","SPARE"]
["UL8_02_VFD1","SI2","SPARE"]
["UL8_02_VFD1","SI3","SPARE"]
["UL8_02_VFD1","SO0","SPARE"]
["UL8_03_VFD1","I0","UL8_3_VFD1_DISC","DISCONNECT AUX"]
["UL8_03_VFD1","I1","UL8_3_ENC1","ENCODER"]
["UL8_03_VFD1","I2","UL8_3_TPE1","TRACKING PHOTOEYE"]
["UL8_03_VFD1","I3","SPARE"]
["UL8_03_VFD1","IO0","UL8_3_BCN1_R","RED BEACON LIGHT"]
["UL8_03_VFD1","IO1","UL8_3_BCN2_R","RED BEACON LIGHT"]
["UL8_03_VFD1","SI0","UL8_3_EPC1","E-STOP PULLCORD"]
["UL8_03_VFD1","SI1","UL8_3_EPC1_2","E-STOP PULLCORD"]
["UL8_03_VFD1","SI2","UL8_3_EPC2","E-STOP PULLCORD"]
["UL8_03_VFD1","SI3","UL8_3_EPC2_2","E-STOP PULLCORD"]
["UL8_03_VFD1","SO0","SPARE"]
["UL8_04_VFD1","I0","UL8_4_VFD1_DISC","DISCONNECT AUX"]
["UL8_04_VFD1","I1","UL8_4_ENC1","ENCODER"]
["UL8_04_VFD1","I2","SPARE"]
["UL8_04_VFD1","I3","SPARE"]
["UL8_04_VFD1","IO0","UL8_3_S1_PB","START PUSHBUTTON"]
["UL8_04_VFD1","IO1","UL8_3_S1_PB_LT","START PUSHBUTTON LIGHT"]
["UL8_04_VFD1","SI0","SPARE"]
["UL8_04_VFD1","SI1","SPARE"]
["UL8_04_VFD1","SI2","SPARE"]
["UL8_04_VFD1","SI3","SPARE"]
["UL8_04_VFD1","SO0","SPARE"]
["UL8_05_VFD1","I0","UL8_5_VFD1_DISC","DISCONNECT AUX"]
["UL8_05_VFD1","I1","UL8_5_ENC1","ENCODER"]
["UL8_05_VFD1","I2","UL8_5_TPE1","TRACKING PHOTOEYE"]
["UL8_05_VFD1","I3","UL8_5_TPE2","TRACKING PHOTOEYE"]
["UL8_05_VFD1","IO0","UL8_3_S2_PB","START PUSHBUTTON"]
["UL8_05_VFD1","IO1","UL8_3_S2_PB_LT","START PUSHBUTTON LIGHT"]
["UL8_05_VFD1","SI0","SPARE"]
["UL8_05_VFD1","SI1","SPARE"]
["UL8_05_VFD1","SI2","SPARE"]
["UL8_05_VFD1","SI3","SPARE"]
["UL8_05_VFD1","SO0","SPARE"]
["UL8_06_VFD1","I0","UL8_6_VFD1_DISC","DISCONNECT AUX"]
["UL8_06_VFD1","I1","UL8_6_ENC1","ENCODER"]
["UL8_06_VFD1","I2","UL8_6_TPE1","TRACKING PHOTOEYE"]
["UL8_06_VFD1","I3","SPARE"]
["UL8_06_VFD1","IO0","SPARE"]
["UL8_06_VFD1","IO1","SPARE"]
["UL8_06_VFD1","SI0","SPARE"]
["UL8_06_VFD1","SI1","SPARE"]
["UL8_06_VFD1","SI2","SPARE"]
["UL8_06_VFD1","SI3","SPARE"]
["UL8_06_VFD1","SO0","SPARE"]
["UL8_07_VFD1","I0","UL8_7_VFD1_DISC","DISCONNECT AUX"]
["UL8_07_VFD1","I1","UL8_7_ENC1","ENCODER"]
["UL8_07_VFD1","I2","UL8_7_TPE1","TRACKING PHOTOEYE"]
["UL8_07_VFD1","I3","SPARE"]
["UL8_07_VFD1","IO0","SPARE"]
["UL8_07_VFD1","IO1","SPARE"]
["UL8_07_VFD1","SI0","SPARE"]
["UL8_07_VFD1","SI1","SPARE"]
["UL8_07_VFD1","SI2","SPARE"]
["UL8_07_VFD1","SI3","SPARE"]
["UL8_07_VFD1","SO0","SPARE"]
["UL8_08_VFD1","I0","UL8_8_VFD1_DISC","DISCONNECT AUX"]
["UL8_08_VFD1","I1","UL8_8_ENC1","ENCODER"]
["UL8_08_VFD1","I2","UL8_8_TPE1","TRACKING PHOTOEYE"]
["UL8_08_VFD1","I3","SPARE"]
["UL8_08_VFD1","IO0","SPARE"]
["UL8_08_VFD1","IO1","SPARE"]
["UL8_08_VFD1","SI0","SPARE"]
["UL8_08_VFD1","SI1","SPARE"]
["UL8_08_VFD1","SI2","SPARE"]
["UL8_08_VFD1","SI3","SPARE"]
["UL8_08_VFD1","SO0","SPARE"]
["UL8_09_VFD1","I0","UL8_9_VFD1_DISC","DISCONNECT AUX"]
["UL8_09_VFD1","I1","SPARE"]
["UL8_09_VFD1","I2","SPARE"]
["UL8_09_VFD1","I3","SPARE"]
["UL8_09_VFD1","IO0","SPARE"]
["UL8_09_VFD1","IO1","SPARE"]
["UL8_09_VFD1","SI0","SPARE"]
["UL8_09_VFD1","SI1","SPARE"]
["UL8_09_VFD1","SI2","SPARE"]
["UL8_09_VFD1","SI3","SPARE"]
["UL8_09_VFD1","SO0","SPARE"]
["UL9_3_FIO1","IO00","UL9_3_BCN1_R","RED BEACON LIGHT"]
["UL9_3_FIO1","IO01","SPARE"]
["UL9_3_FIO1","IO02","UL9_3_BCN2_R","RED BEACON LIGHT"]
["UL9_3_FIO1","IO03","SPARE"]
["UL9_3_FIO1","IO04","UL9_3_LPE1","LASEREYE"]
["UL9_3_FIO1","IO05","SPARE"]
["UL9_3_FIO1","IO06","UL9_3_LPE2","LASEREYE"]
["UL9_3_FIO1","IO07","SPARE"]
["UL9_3_FIO1","IO08","UL9_3_S1_PB","START PUSHBUTTON"]
["UL9_3_FIO1","IO09","UL9_3_S1_PB_LT","START PUSHBUTTON LIGHT"]
["UL9_3_FIO1","IO10","UL9_3_S2_PB","START PUSHBUTTON"]
["UL9_3_FIO1","IO11","UL9_3_S2_PB_LT","START PUSHBUTTON LIGHT"]
["UL9_3_FIO1","IO12","SPARE"]
["UL9_3_FIO1","IO13","SPARE"]
["UL9_3_FIO1","IO14","SPARE"]
["UL9_3_FIO1","IO15","SPARE"]
["UL9_03_VFD1","I0","UL9_3_VFD1_DISC","DISCONNECT AUX"]
["UL9_03_VFD1","I1","UL9_3_ENC1","ENCODER"]
["UL9_03_VFD1","I2","UL9_3_TPE1","TRACKING PHOTOEYE"]
["UL9_03_VFD1","I3","UL9_3_TPE2","TRACKING PHOTOEYE"]
["UL9_03_VFD1","IO0","SPARE"]
["UL9_03_VFD1","IO1","SPARE"]
["UL9_03_VFD1","SI0","UL9_3_EPC1","E-STOP PULLCORD"]
["UL9_03_VFD1","SI1","UL9_3_EPC1_2","E-STOP PULLCORD"]
["UL9_03_VFD1","SI2","UL9_3_EPC2","E-STOP PULLCORD"]
["UL9_03_VFD1","SI3","UL9_3_EPC2_2","E-STOP PULLCORD"]
["UL9_03_VFD1","SO0","SPARE"]
["UL9_04_VFD1","I0","UL9_4_VFD1_DISC","DISCONNECT AUX"]
["UL9_04_VFD1","I1","UL9_4_ENC1","ENCODER"]
["UL9_04_VFD1","I2","UL9_4_TPE1","TRACKING PHOTOEYE"]
["UL9_04_VFD1","I3","SPARE"]
["UL9_04_VFD1","IO0","UL9_4_BCN1_R","RED BEACON LIGHT"]
["UL9_04_VFD1","IO1","UL9_4_BCN2_R","RED BEACON LIGHT"]
["UL9_04_VFD1","SI0","UL9_4_EPC1","E-STOP PULLCORD"]
["UL9_04_VFD1","SI1","UL9_4_EPC1_2","E-STOP PULLCORD"]
["UL9_04_VFD1","SI2","UL9_4_EPC2","E-STOP PULLCORD"]
["UL9_04_VFD1","SI3","UL9_4_EPC2_2","E-STOP PULLCORD"]
["UL9_04_VFD1","SO0","UL9_1_STO1","E-STOP OK"]
["UL9_05_VFD1","I0","UL9_5_VFD1_DISC","DISCONNECT AUX"]
["UL9_05_VFD1","I1","UL9_5_ENC1","ENCODER"]
["UL9_05_VFD1","I2","SPARE"]
["UL9_05_VFD1","I3","SPARE"]
["UL9_05_VFD1","IO0","UL9_4_S1_PB","START PUSHBUTTON"]
["UL9_05_VFD1","IO1","UL9_4_S1_PB_LT","START PUSHBUTTON LIGHT"]
["UL9_05_VFD1","SI0","UL9_1_ESTOP1","ESTOP OK"]
["UL9_05_VFD1","SI1","SPARE"]
["UL9_05_VFD1","SI2","SPARE"]
["UL9_05_VFD1","SI3","SPARE"]
["UL9_05_VFD1","SO0","SPARE"]
["UL9_06_VFD1","I0","UL9_6_VFD1_DISC","DISCONNECT AUX"]
["UL9_06_VFD1","I1","UL9_6_ENC1","ENCODER"]
["UL9_06_VFD1","I2","UL9_6_TPE1","TRACKING PHOTOEYE"]
["UL9_06_VFD1","I3","UL9_6_TPE2","TRACKING PHOTOEYE"]
["UL9_06_VFD1","IO0","UL9_4_S2_PB","START PUSHBUTTON"]
["UL9_06_VFD1","IO1","UL9_4_S2_PB_LT","START PUSHBUTTON LIGHT"]
["UL9_06_VFD1","SI0","SPARE"]
["UL9_06_VFD1","SI1","SPARE"]
["UL9_06_VFD1","SI2","SPARE"]
["UL9_06_VFD1","SI3","SPARE"]
["UL9_06_VFD1","SO0","SPARE"]
["UL9_07_VFD1","I0","UL9_7_VFD1_DISC","DISCONNECT AUX"]
["UL9_07_VFD1","I1","UL9_7_ENC1","ENCODER"]
["UL9_07_VFD1","I2","UL9_7_TPE1","TRACKING PHOTOEYE"]
["UL9_07_VFD1","I3","SPARE"]
["UL9_07_VFD1","IO0","SPARE"]
["UL9_07_VFD1","IO1","SPARE"]
["UL9_07_VFD1","SI0","SPARE"]
["UL9_07_VFD1","SI1","SPARE"]
["UL9_07_VFD1","SI2","SPARE"]
["UL9_07_VFD1","SI3","SPARE"]
["UL9_07_VFD1","SO0","SPARE"]
["UL9_08_VFD1","I0","UL9_8_VFD1_DISC","DISCONNECT AUX"]
["UL9_08_VFD1","I1","UL9_8_ENC1","ENCODER"]
["UL9_08_VFD1","I2","UL9_8_TPE1","TRACKING PHOTOEYE"]
["UL9_08_VFD1","I3","SPARE"]
["UL9_08_VFD1","IO0","SPARE"]
["UL9_08_VFD1","IO1","SPARE"]
["UL9_08_VFD1","SI0","SPARE"]
["UL9_08_VFD1","SI1","SPARE"]
["UL9_08_VFD1","SI2","SPARE"]
["UL9_08_VFD1","SI3","SPARE"]
["UL9_08_VFD1","SO0","SPARE"]
["UL9_09_VFD1","I0","UL9_9_VFD1_DISC","DISCONNECT AUX"]
["UL9_09_VFD1","I1","UL9_9_ENC1","ENCODER"]
["UL9_09_VFD1","I2","UL9_9_TPE1","TRACKING PHOTOEYE"]
["UL9_09_VFD1","I3","SPARE"]
["UL9_09_VFD1","IO0","SPARE"]
["UL9_09_VFD1","IO1","SPARE"]
["UL9_09_VFD1","SI0","SPARE"]
["UL9_09_VFD1","SI1","SPARE"]
["UL9_09_VFD1","SI2","SPARE"]
["UL9_09_VFD1","SI3","SPARE"]
["UL9_09_VFD1","SO0","SPARE"]
["UL9_10_VFD1","I0","UL9_10_VFD1_DISC","DISCONNECT AUX"]
["UL9_10_VFD1","I1","UL9_10_ENC1","ENCODER"]
["UL9_10_VFD1","I2","UL9_10_TPE1","TRACKING PHOTOEYE"]
["UL9_10_VFD1","I3","SPARE"]
["UL9_10_VFD1","IO0","SPARE"]
["UL9_10_VFD1","IO1","SPARE"]
["UL9_10_VFD1","SI0","SPARE"]
["UL9_10_VFD1","SI1","SPARE"]
["UL9_10_VFD1","SI2","SPARE"]
["UL9_10_VFD1","SI3","SPARE"]
["UL9_10_VFD1","SO0","SPARE"]
["UL9_11_VFD1","I0","UL9_11_VFD1_DISC","DISCONNECT AUX"]
["UL9_11_VFD1","I1","SPARE"]
["UL9_11_VFD1","I2","SPARE"]
["UL9_11_VFD1","I3","SPARE"]
["UL9_11_VFD1","IO0","SPARE"]
["UL9_11_VFD1","IO1","SPARE"]
["UL9_11_VFD1","SI0","SPARE"]
["UL9_11_VFD1","SI1","SPARE"]
["UL9_11_VFD1","SI2","SPARE"]
["UL9_11_VFD1","SI3","SPARE"]
["UL9_11_VFD1","SO0","SPARE"]
["UL1_13_FIO1","IO00","UL1_13_PE1","DEBRIS SENSOR"]
["UL1_13_FIO1","IO01"]
["UL1_13_FIO1","IO02","UL1_13_PE2","BELT ENGAGEMENT SENSOR"]
["UL1_13_FIO1","IO03"]
["UL1_13_FIO1","IO04","UL1_13_SOL1","DIVERT MODULE"]
["UL1_13_FIO1","IO05"]
["UL1_13_FIO1","IO06","UL1_13_SOL2","DIVERT MODULE"]
["UL1_13_FIO1","IO07"]
["UL1_13_FIO1","IO08","UL1_13_PE3","ENTRANCE PE"]
["UL1_13_FIO1","IO09"]
["UL1_13_FIO1","IO10","UL1_13_PE4","EXIT PE"]
["UL1_13_FIO1","IO11"]
["UL1_13_FIO1","IO12","UL1_13_SOL3","DIVERT MODULE"]
["UL1_13_FIO1","IO13"]
["UL1_13_FIO1","IO14","UL1_13_PE5","DEBRIS SENSOR"]
["UL1_13_FIO1","IO15"]
["UL4_13_FIO1","IO00","UL4_13_PE1","DEBRIS SENSOR"]
["UL4_13_FIO1","IO01"]
["UL4_13_FIO1","IO02","UL4_13_PE2","BELT ENGAGEMENT SENSOR"]
["UL4_13_FIO1","IO03"]
["UL4_13_FIO1","IO04","UL4_13_SOL1","DIVERT MODULE"]
["UL4_13_FIO1","IO05"]
["UL4_13_FIO1","IO06","UL4_13_SOL2","DIVERT MODULE"]
["UL4_13_FIO1","IO07"]
["UL4_13_FIO1","IO08","UL4_13_PE3","ENTRANCE PE"]
["UL4_13_FIO1","IO09"]
["UL4_13_FIO1","IO10","UL4_13_PE4","EXIT PE"]
["UL4_13_FIO1","IO11"]
["UL4_13_FIO1","IO12","UL4_13_SOL3","DIVERT MODULE"]
["UL4_13_FIO1","IO13"]
["UL4_13_FIO1","IO14","UL4_13_PE5","DEBRIS SENSOR"]
["UL4_13_FIO1","IO15"]
["UL7_13_FIO1","IO00","UL7_13_PE1","DEBRIS SENSOR"]
["UL7_13_FIO1","IO01"]
["UL7_13_FIO1","IO02","UL7_13_PE2","BELT ENGAGEMENT SENSOR"]
["UL7_13_FIO1","IO03"]
["UL7_13_FIO1","IO04","UL7_13_SOL1","DIVERT MODULE"]
["UL7_13_FIO1","IO05"]
["UL7_13_FIO1","IO06","UL7_13_SOL2","DIVERT MODULE"]
["UL7_13_FIO1","IO07"]
["UL7_13_FIO1","IO08","UL7_13_PE3","ENTRANCE PE"]
["UL7_13_FIO1","IO09"]
["UL7_13_FIO1","IO10","UL7_13_PE4","EXIT PE"]
["UL7_13_FIO1","IO11"]
["UL7_13_FIO1","IO12","UL7_13_SOL3","DIVERT MODULE"]
["UL7_13_FIO1","IO13"]
["UL7_13_FIO1","IO14","UL7_13_PE5","DEBRIS SENSOR"]
["UL7_13_FIO1","IO15"]
["UL11_13_FIO1","IO00","UL11_13_PE1","DEBRIS SENSOR"]
["UL11_13_FIO1","IO01"]
["UL11_13_FIO1","IO02","UL11_13_PE2","BELT ENGAGEMENT SENSOR"]
["UL11_13_FIO1","IO03"]
["UL11_13_FIO1","IO04","UL11_13_SOL1","DIVERT MODULE"]
["UL11_13_FIO1","IO05"]
["UL11_13_FIO1","IO06","UL11_13_SOL2","DIVERT MODULE"]
["UL11_13_FIO1","IO07"]
["UL11_13_FIO1","IO08","UL11_13_PE3","ENTRANCE PE"]
["UL11_13_FIO1","IO09"]
["UL11_13_FIO1","IO10","UL11_13_PE4","EXIT PE"]
["UL11_13_FIO1","IO11"]
["UL11_13_FIO1","IO12","UL11_13_SOL3","DIVERT MODULE"]
["UL11_13_FIO1","IO13"]
["UL11_13_FIO1","IO14","UL11_13_PE5","DEBRIS SENSOR"]
["UL11_13_FIO1","IO15"]
["PDP1_FIO1","IO00","PDP1_CB1 ","CIRCUIT BREAKER MONITORING"]
["PDP1_FIO1","IO01","PDP1_CB2","CIRCUIT BREAKER MONITORING"]
["PDP1_FIO1","IO02","PDP1_CB3","CIRCUIT BREAKER MONITORING"]
["PDP1_FIO1","IO03","PDP1_CB4","CIRCUIT BREAKER MONITORING"]
["PDP1_FIO1","IO04","PDP1_CB5","CIRCUIT BREAKER MONITORING",null,null,null,null,"UL2_1_STO1"]
["PDP1_FIO1","IO05",null,null,null,null,null,null,"E-STOP OK"]
["PDP1_FIO1","IO06","PDP1_CB6","CIRCUIT BREAKER MONITORING",null,null,null,null,"SEE 900.09 FOR TERMINATION DETAILS"]
["PDP1_FIO1","IO07"]
["PDP1_FIO1","IO08","PDP1_CB7","CIRCUIT BREAKER MONITORING"]
["PDP1_FIO1","IO09","PDP1_CB8","CIRCUIT BREAKER MONITORING",null,null,null,null,"UL2_1_ESTOP"]
["PDP1_FIO1","IO10","PDP1_CB9","CIRCUIT BREAKER MONITORING",null,null,null,null,"ESTOP OK"]
["PDP1_FIO1","IO11","PDP1_CB10","CIRCUIT BREAKER MONITORING",null,null,null,null,"SEE 900.02 FOR TERMINATION DETAILS"]
["PDP1_FIO1","IO12","PDP1_PWM1","PHASE MONITOR"]
["PDP1_FIO1","IO13","SPARE"]
["PDP1_FIO1","IO14","PDP1_FIOH1","HUB ARMOR BLOCK"]
["PDP1_FIO1","IO15","SPARE"]
["PDP1_FIOH1","IO00","PDP1_CB11","CIRCUIT BREAKER MONITORING"]
["PDP1_FIOH1","IO01","PDP1_CB12","CIRCUIT BREAKER MONITORING"]
["PDP1_FIOH1","IO02","PDP1_CB13","CIRCUIT BREAKER MONITORING"]
["PDP1_FIOH1","IO03","PDP1_CB14","CIRCUIT BREAKER MONITORING"]
["PDP1_FIOH1","IO04","PDP1_CB15","CIRCUIT BREAKER MONITORING"]
["PDP1_FIOH1","IO05","PDP1_CB16","CIRCUIT BREAKER MONITORING"]
["PDP1_FIOH1","IO06","PDP1_CB17","CIRCUIT BREAKER MONITORING"]
["PDP1_FIOH1","IO07","PDP1_CB18","CIRCUIT BREAKER MONITORING"]
["PDP1_FIOH1","IO08","PDP1_CB19","CIRCUIT BREAKER MONITORING"]
["PDP1_FIOH1","IO09","PDP1_CB20","CIRCUIT BREAKER MONITORING"]
["PDP1_FIOH1","IO10","PDP1_CB21","CIRCUIT BREAKER MONITORING"]
["PDP1_FIOH1","IO11","PDP1_CB22","CIRCUIT BREAKER MONITORING"]
["PDP1_FIOH1","IO12","PDP1_CB23","CIRCUIT BREAKER MONITORING"]
["PDP1_FIOH1","IO13","PDP1_CB24","CIRCUIT BREAKER MONITORING"]
["PDP1_FIOH1","IO14","PDP1_CB25","CIRCUIT BREAKER MONITORING"]
["PDP1_FIOH1","IO15","PDP1_CB26","CIRCUIT BREAKER MONITORING"]
["PDP2_FIO1","IO00","PDP2_CB1 ","CIRCUIT BREAKER MONITORING"]
["PDP2_FIO1","IO01","PDP2_CB2","CIRCUIT BREAKER MONITORING"]
["PDP2_FIO1","IO02","PDP2_CB3","CIRCUIT BREAKER MONITORING"]
["PDP2_FIO1","IO03","PDP2_CB4","CIRCUIT BREAKER MONITORING"]
["PDP2_FIO1","IO04","PDP2_CB5","CIRCUIT BREAKER MONITORING"]
["PDP2_FIO1","IO05"]
["PDP2_FIO1","IO06","PDP2_CB6","CIRCUIT BREAKER MONITORING"]
["PDP2_FIO1","IO07"]
["PDP2_FIO1","IO08","PDP2_CB7","CIRCUIT BREAKER MONITORING"]
["PDP2_FIO1","IO09","PDP2_CB8","CIRCUIT BREAKER MONITORING"]
["PDP2_FIO1","IO10","PDP2_CB9","CIRCUIT BREAKER MONITORING"]
["PDP2_FIO1","IO11","PDP2_CB10","CIRCUIT BREAKER MONITORING"]
["PDP2_FIO1","IO12","PDP2_PWM1","PHASE MONITOR"]
["PDP2_FIO1","IO13","SPARE"]
["PDP2_FIO1","IO14","PDP2_FIOH1","HUB ARMOR BLOCK"]
["PDP2_FIO1","IO15","SPARE"]
["PDP2_FIOH1","IO00","PDP2_CB11","CIRCUIT BREAKER MONITORING"]
["PDP2_FIOH1","IO01","PDP2_CB12","CIRCUIT BREAKER MONITORING"]
["PDP2_FIOH1","IO02","PDP2_CB13","CIRCUIT BREAKER MONITORING"]
["PDP2_FIOH1","IO03","PDP2_CB14","CIRCUIT BREAKER MONITORING"]
["PDP2_FIOH1","IO04","PDP2_CB15","CIRCUIT BREAKER MONITORING"]
["PDP2_FIOH1","IO05","PDP2_CB16","CIRCUIT BREAKER MONITORING"]
["PDP2_FIOH1","IO06","PDP2_CB17","CIRCUIT BREAKER MONITORING"]
["PDP2_FIOH1","IO07","PDP2_CB18","CIRCUIT BREAKER MONITORING"]
["PDP2_FIOH1","IO08","PDP2_CB19","CIRCUIT BREAKER MONITORING"]
["PDP2_FIOH1","IO09","PDP2_CB20","CIRCUIT BREAKER MONITORING"]
["PDP2_FIOH1","IO10","PDP2_CB21","CIRCUIT BREAKER MONITORING"]
["PDP2_FIOH1","IO11","PDP2_CB22","CIRCUIT BREAKER MONITORING"]
["PDP2_FIOH1","IO12","PDP2_CB23","CIRCUIT BREAKER MONITORING"]
["PDP2_FIOH1","IO13","PDP2_CB24","CIRCUIT BREAKER MONITORING"]
["PDP2_FIOH1","IO14","PDP2_CB25","CIRCUIT BREAKER MONITORING"]
["PDP2_FIOH1","IO15","PDP2_CB26","CIRCUIT BREAKER MONITORING"]
["PDP6_FIO1","IO00","PDP6_CB1 ","CIRCUIT BREAKER MONITORING"]
["PDP6_FIO1","IO01","PDP6_CB2","CIRCUIT BREAKER MONITORING"]
["PDP6_FIO1","IO02","PDP6_CB3","CIRCUIT BREAKER MONITORING"]
["PDP6_FIO1","IO03","PDP6_CB4","CIRCUIT BREAKER MONITORING"]
["PDP6_FIO1","IO04","PDP6_CB5","CIRCUIT BREAKER MONITORING"]
["PDP6_FIO1","IO05"]
["PDP6_FIO1","IO06","PDP6_CB6","CIRCUIT BREAKER MONITORING"]
["PDP6_FIO1","IO07"]
["PDP6_FIO1","IO08","PDP6_CB7","CIRCUIT BREAKER MONITORING"]
["PDP6_FIO1","IO09","PDP6_CB8","CIRCUIT BREAKER MONITORING"]
["PDP6_FIO1","IO10","PDP6_CB9","CIRCUIT BREAKER MONITORING"]
["PDP6_FIO1","IO11","PDP6_CB10","CIRCUIT BREAKER MONITORING"]
["PDP6_FIO1","IO12","PDP6_PWM1","PHASE MONITOR"]
["PDP6_FIO1","IO13","SPARE"]
["PDP6_FIO1","IO14","PDP6_FIOH1","HUB ARMOR BLOCK"]
["PDP6_FIO1","IO15","SPARE"]
["PDP6_FIOH1","IO00","PDP6_CB11","CIRCUIT BREAKER MONITORING"]
["PDP6_FIOH1","IO01","PDP6_CB12","CIRCUIT BREAKER MONITORING"]
["PDP6_FIOH1","IO02","PDP6_CB13","CIRCUIT BREAKER MONITORING"]
["PDP6_FIOH1","IO03","PDP6_CB14","CIRCUIT BREAKER MONITORING"]
["PDP6_FIOH1","IO04","PDP6_CB15","CIRCUIT BREAKER MONITORING"]
["PDP6_FIOH1","IO05","PDP6_CB16","CIRCUIT BREAKER MONITORING"]
["PDP6_FIOH1","IO06","PDP6_CB17","CIRCUIT BREAKER MONITORING"]
["PDP6_FIOH1","IO07","PDP6_CB18","CIRCUIT BREAKER MONITORING"]
["PDP6_FIOH1","IO08","PDP6_CB19","CIRCUIT BREAKER MONITORING"]
["PDP6_FIOH1","IO09","PDP6_CB20","CIRCUIT BREAKER MONITORING"]
["PDP6_FIOH1","IO10","PDP6_CB21","CIRCUIT BREAKER MONITORING"]
["PDP6_FIOH1","IO11","PDP6_CB22","CIRCUIT BREAKER MONITORING"]
["PDP6_FIOH1","IO12","PDP6_CB23","CIRCUIT BREAKER MONITORING"]
["PDP6_FIOH1","IO13","PDP6_CB24","CIRCUIT BREAKER MONITORING"]
["PDP6_FIOH1","IO14","PDP6_CB25","CIRCUIT BREAKER MONITORING"]
["PDP6_FIOH1","IO15","PDP6_CB26","CIRCUIT BREAKER MONITORING"]
[]
["SLOT5_IB16","I0","MCM01","S_PBLT START"]
["SLOT5_IB16","I1","MCM01","ST_PB STOP"]
["SLOT5_IB16","I2","MCM01","MF_PBLT MOTOR FAULT RESET"]
["SLOT5_IB16","I3","MCM01","JR_PBLT JAM RESET"]
["SLOT5_IB16","I4","MCM01","LAP_PBLT LOW AIR PRESSURE"]
["SLOT5_IB16","I5","MCM01","PBFR_PBLT POWER BRANCH FAULT RESET"]
["SLOT5_IB16","I6","MCM01","BATTERY_FAULT_UPS BATTERY FAULT"]
["SLOT5_IB16","I7","MCM01","ON_BATTERY ON BATTERY"]
["SLOT5_IB16","I8","MCM01","UPS_BATTERY_LOW UPS BATTERY LOW"]
["SLOT5_IB16","I9","MCM01","NAT_SWITCH ALARM NAT SWITCH"]
["SLOT5_IB16","I10","SPARE"]
["SLOT5_IB16","I11","SPARE"]
["SLOT5_IB16","I12","SPARE"]
["SLOT5_IB16","I13","SPARE"]
["SLOT5_IB16","I14","SPARE"]
["SLOT5_IB16","I15","SPARE"]
["SLOT6_OB16E","O0","MCM01","ES_LT EMERGENCY STOP ACTUATED"]
["SLOT6_OB16E","O1","MCM01","S_PBLT START LIGHT"]
["SLOT6_OB16E","O2","MCM01","MF_PBLT MOTOR FAULT LIGHT"]
["SLOT6_OB16E","O3","MCM01","JR_PBLT JAM RESTART LIGHT"]
["SLOT6_OB16E","O4","MCM01","LAP_PBLT LOW AIR PRESSURE LIGHT"]
["SLOT6_OB16E","O5","MCM01","PBFR_PBLT POWER BRANCH FAULT RESET LIGHT"]
["SLOT6_OB16E","O6","SPARE"]
["SLOT6_OB16E","O7","SPARE"]
["SLOT6_OB16E","O8","SPARE"]
["SLOT6_OB16E","O9","SPARE"]
["SLOT6_OB16E","O10","SPARE"]
["SLOT6_OB16E","O11","SPARE"]
["SLOT6_OB16E","O12","SPARE"]
["SLOT6_OB16E","O13","SPARE"]
["SLOT6_OB16E","O14","SPARE"]
["SLOT6_OB16E","O15","SPARE"]
["SLOT7_IB16S","I0","MCM01","FIRE_ALARM FIRE ALARM"]
["SLOT7_IB16S","I1","SPARE"]
["SLOT7_IB16S","I2","MCM01","ES_PB ES_PB_CH1"]
["SLOT7_IB16S","I3","MCM01","ES_PB ES_PB_CH2"]
["SLOT7_IB16S","I4","SPARE"]
["SLOT7_IB16S","I5","SPARE"]
["SLOT7_IB16S","I6","SPARE"]
["SLOT7_IB16S","I7","SPARE"]
["SLOT7_IB16S","I8","SPARE"]
["SLOT7_IB16S","I9","SPARE"]
["SLOT7_IB16S","I10","SPARE"]
["SLOT7_IB16S","I11","SPARE"]
["SLOT7_IB16S","I12","SPARE"]
["SLOT7_IB16S","I13","SPARE"]
["SLOT7_IB16S","I14","SPARE"]
["SLOT7_IB16S","I15","SPARE"]