{"text_format":"1","workbook":"xlsx","n_sheets":10,"sheets":["Templates","Devices","Instructions","IO Assignment MCM01","NETWORK1","NETWORK","Part number","MCM01_DESC","Sheet2","MCM01_DESC_V2"],"not_rendered":{"charts":0,"images":10,"macros":1,"external_links":0,"defined_names":7,"comments":3,"pivot_tables":0},"unopened":[],"bounds":{"document_bytes":16777216,"sheet_cells":100000,"rows_first":2000,"rows_last":500,"rows_between":2000,"halvings":0,"cell_chars":16384,"cell_head_chars":4096},"cells_cut":0,"cells_raw":0,"read":"whole","date_system":"1900"}

{"sheet":"Templates","index":0,"n_rows":19,"n_cols":3,"rows_kept":19,"cut":false,"hidden":false,"merged":[]}
[]
["VFD IO TEMPLATE",null,"FIO IO Template"]
["I0",null,"IO00"]
["I1",null,"IO01"]
["I2",null,"IO02"]
["I3",null,"IO03"]
["IO0",null,"IO04"]
["IO1",null,"IO05"]
["SI0",null,"IO06"]
["SI1",null,"IO07"]
["SI2",null,"IO08"]
["SI3",null,"IO09"]
["SO0",null,"IO10"]
[null,null,"IO11"]
[null,null,"IO12"]
[null,null,"IO13"]
[null,null,"IO14"]
[null,null,"IO15"]
[null,null,"IO16"]

{"sheet":"Devices","index":1,"n_rows":992,"n_cols":9,"rows_kept":992,"cut":false,"hidden":false,"merged":[]}
[null,null,null,null,null,null,null,"Which MCM we assign?","MCM01"]
["PS1_1_BCN1_R"]
["PS1_1_BCN2_R"]
["PS1_1_DISC"]
["PS1_1_EPC1"]
["PS1_1_EPC1_2"]
["PS1_1_EPC2"]
["PS1_1_EPC2_2"]
["PS1_1_S1_PB"]
["PS1_1_S1_PB_LT"]
["PS1_1_S2_PB"]
["PS1_1_S2_PB_LT"]
["PS1_1_VFD1"]
["PS1_2_DISC"]
["PS1_2_TPE1"]
["PS1_2_TPE2"]
["PS1_2_VFD1"]
["PS1_3_DISC"]
["PS1_3_VFD1"]
["PS1_4_DISC"]
["PS1_4_TPE1"]
["PS1_4_TPE2"]
["PS1_4_VFD1"]
["PS1_5_BCN1_R"]
["PS1_5_BCN2_R"]
["PS1_5_DISC"]
["PS1_5_EPC1"]
["PS1_5_EPC1_2"]
["PS1_5_EPC2"]
["PS1_5_EPC2_2"]
{"$rows_left_out":963}
{"sheet":"Instructions","index":2,"n_rows":116,"n_cols":2,"rows_kept":116,"cut":false,"hidden":false,"merged":[]}
[]
["1. ","Put all device tags to cell A2"]
[]
[]
[]
[]
[]
[]
[]
[]
[]
[]
[]
[]
[]
[]
[]
[]
[]
[]
[]
[]
[]
[]
[]
[]
[]
[]
[]
[]
{"$rows_left_out":87}
{"sheet":"IO Assignment MCM01","index":3,"n_rows":2062,"n_cols":11,"rows_kept":2062,"cut":false,"hidden":false,"merged":[[776,6,830,6],[1902,5,1965,5],[1966,4,2061,4]]}
["Controller name","Signal type","Address name","Assigned device","Unassigned Device",null,null,null,null,null,"MCM01_DESC_V2"]
["PS1_01_VFD1","I0","PS1_01_VFD1_I0","PS1_1_VFD1_DISC"]
["PS1_01_VFD1","I1","PS1_01_VFD1_I1"]
["PS1_01_VFD1","I2","PS1_01_VFD1_I2"]
["PS1_01_VFD1","I3","PS1_01_VFD1_I3"]
["PS1_01_VFD1","IO0","PS1_01_VFD1_IO0","PS1_1_S1_PB"]
["PS1_01_VFD1","IO1","PS1_01_VFD1_IO1","PS1_1_S1_PB_LT"]
["PS1_01_VFD1","SI0","PS1_01_VFD1_SI0","PS1_1_EPC1"]
["PS1_01_VFD1","SI1","PS1_01_VFD1_SI1","PS1_1_EPC1_2"]
["PS1_01_VFD1","SI2","PS1_01_VFD1_SI2","PS1_1_EPC2"]
["PS1_01_VFD1","SI3","PS1_01_VFD1_SI3","PS1_1_EPC2_2"]
["PS1_01_VFD1","SO0","PS1_01_VFD1_SO0"]
["PS1_02_VFD1","I0","PS1_02_VFD1_I0","PS1_2_VFD1_DISC"]
["PS1_02_VFD1","I1","PS1_02_VFD1_I1"]
["PS1_02_VFD1","I2","PS1_02_VFD1_I2","PS1_2_TPE1"]
["PS1_02_VFD1","I3","PS1_02_VFD1_I3","PS1_2_TPE2"]
["PS1_02_VFD1","IO0","PS1_02_VFD1_IO0","PS1_1_BCN2_R"]
["PS1_02_VFD1","IO1","PS1_02_VFD1_IO1","PS1_1_BCN2_H"]
["PS1_02_VFD1","SI0","PS1_02_VFD1_SI0"]
["PS1_02_VFD1","SI1","PS1_02_VFD1_SI1"]
["PS1_02_VFD1","SI2","PS1_02_VFD1_SI2"]
["PS1_02_VFD1","SI3","PS1_02_VFD1_SI3"]
["PS1_02_VFD1","SO0","PS1_02_VFD1_SO0","PS1_1_BCN1_R"]
["PS1_03_VFD1","I0","PS1_03_VFD1_I0","PS1_3_VFD1_DISC"]
["PS1_03_VFD1","I1","PS1_03_VFD1_I1"]
["PS1_03_VFD1","I2","PS1_03_VFD1_I2"]
["PS1_03_VFD1","I3","PS1_03_VFD1_I3"]
["PS1_03_VFD1","IO0","PS1_03_VFD1_IO0","PS1_1_S2_PB"]
["PS1_03_VFD1","IO1","PS1_03_VFD1_IO1","PS1_1_S2_PB_LT"]
["PS1_03_VFD1","SI0","PS1_03_VFD1_SI0"]
{"$rows_left_out":2033}
{"sheet":"NETWORK1","index":4,"n_rows":188,"n_cols":19,"rows_kept":188,"cut":false,"hidden":false,"merged":[[87,11,90,11],[149,3,161,3],[149,4,161,4],[92,3,112,3],[92,4,112,4],[174,3,187,3],[174,4,187,4],[162,3,173,3],[162,4,173,4],[113,3,133,3],[113,4,133,4],[134,3,148,3],[134,4,148,4],[53,3,72,3],[53,4,72,4],[38,3,52,3],[38,4,52,4],[73,3,91,3],[73,4,91,4],[1,5,1,11],[1,3,1,4],[18,3,37,3],[18,4,37,4],[3,3,17,3],[3,4,17,4]]}
[null,"MCM01"]
["SLOT0","1756-L83ES","IP","RING",null,"STAR"]
["SLOT1","1756-N2",null,"DPM","IP","VFD NAME","VFD PART NUMBER","IP","PDP","DPM","HP","VFD PART NUMBER",null,null,null,{"$f":"_xlfn.CONCAT(Q3,\"_VFD1\")","v":"PS1_1_VFD1"},"PS1_1",2,{"$f":"VLOOKUP(R3,'Part number'!$C$1:$D$13,2,FALSE)","v":"35S-6D2-P101"}]
["SLOT2","1756-EN4TR","11.200.1.1","UL1_4_DPM1","11.200.1.2","UL1_1_EX1",{"$f":"VLOOKUP(F4,$P$3:$S$176,4,FALSE)","v":"CALJAN"},"11.200.1.30","PDP01","DPM1_UL1_4_P1",{"$f":"VLOOKUP(G4,'Part number'!$B$2:$C$13,2,0)","v":"EXTENDO"},null,null,"MCM01","PDP1",{"$f":"_xlfn.CONCAT(Q4,\"_VFD1\")","v":"PS1_2_VFD1"},"PS1_2",2,{"$f":"VLOOKUP(R4,'Part number'!$C$1:$D$13,2,FALSE)","v":"35S-6D2-P101"}]
["SLOT3","1756-N2",null,null,null,"UL1_3_VFD1","35S-6D4-P111","11.200.1.31","PDP01","DPM1_UL1_4_P2",{"$f":"VLOOKUP(G5,'Part number'!$B$2:$C$13,2,0)","v":5},null,null,null,"PDP2",{"$f":"_xlfn.CONCAT(Q5,\"_VFD1\")","v":"PS1_3_VFD1"},"PS1_3",2,{"$f":"VLOOKUP(R5,'Part number'!$C$1:$D$13,2,FALSE)","v":"35S-6D2-P101"}]
["SLOT4","1756-N2",null,null,null,"UL1_4_VFD1","35S-6D4-P111","11.200.1.32","PDP01","DPM1_UL1_4_P3",{"$f":"VLOOKUP(G6,'Part number'!$B$2:$C$13,2,0)","v":5},null,null,null,"PDP6",{"$f":"_xlfn.CONCAT(Q6,\"_VFD1\")","v":"PS1_4_VFD1"},"PS1_4",7.5,{"$f":"VLOOKUP(R6,'Part number'!$C$1:$D$13,2,FALSE)","v":"35S-6D5-P111"}]
["SLOT5","1756-IB16",null,null,null,"UL1_5_VFD1","35S-6D3-P101","11.200.1.33","PDP01","DPM1_UL1_4_P4",{"$f":"VLOOKUP(G7,'Part number'!$B$2:$C$13,2,0)","v":3},null,null,null,null,"PS1_4_DPM1","PS1_4_DPM1","DPM",{"$f":"VLOOKUP(R7,'Part number'!$C$1:$D$13,2,FALSE)","v":{"$error":"#N/A"}}]
["SLOT6","1756-OB16E",null,null,null,"UL1_6_VFD1","35S-6D3-P101","11.200.1.34","PDP01","DPM1_UL1_4_P5",{"$f":"VLOOKUP(G8,'Part number'!$B$2:$C$13,2,0)","v":3},null,null,null,null,{"$f":"_xlfn.CONCAT(Q8,\"_VFD1\")","v":"PS1_5_VFD1"},"PS1_5",5,{"$f":"VLOOKUP(R8,'Part number'!$C$1:$D$13,2,FALSE)","v":"35S-6D4-P111"}]
["SLOT7","1756-IB16S",null,null,null,"UL1_7_VFD1","35S-6D3-P101","11.200.1.35","PDP01","DPM1_UL1_4_P6",{"$f":"VLOOKUP(G9,'Part number'!$B$2:$C$13,2,0)","v":3},null,null,null,null,"PS2_1_VFD1","PS2_1",2,{"$f":"VLOOKUP(R9,'Part number'!$C$1:$D$13,2,FALSE)","v":"35S-6D2-P101"}]
["SLOT8","1756-N2",null,null,null,"UL1_8_VFD1","35S-6D3-P101","11.200.1.36","PDP01","DPM1_UL1_4_P7",{"$f":"VLOOKUP(G10,'Part number'!$B$2:$C$13,2,0)","v":3},null,null,null,null,"PS2_2_VFD1","PS2_2",3,{"$f":"VLOOKUP(R10,'Part number'!$C$1:$D$13,2,FALSE)","v":"35S-6D3-P101"}]
["SLOT9","1756-N2",null,null,null,"UL1_9_VFD1","35S-6D4-P111","11.200.1.37","PDP01","DPM1_UL1_4_P8",{"$f":"VLOOKUP(G11,'Part number'!$B$2:$C$13,2,0)","v":5},null,null,null,null,"PS2_3_VFD1","PS2_3",5,{"$f":"VLOOKUP(R11,'Part number'!$C$1:$D$13,2,FALSE)","v":"35S-6D4-P111"}]
[null,null,null,null,null,"UL1_10A_VFD1","35S-6D3-P101","11.200.1.38","PDP01","DPM1_UL1_4_P9",{"$f":"VLOOKUP(G12,'Part number'!$B$2:$C$13,2,0)","v":3},null,null,null,null,"PS2_4_VFD1","PS2_4",2,{"$f":"VLOOKUP(R12,'Part number'!$C$1:$D$13,2,FALSE)","v":"35S-6D2-P101"}]
[null,null,null,null,null,"UL1_10B_VFD1","35S-6D3-P101","11.200.1.39","PDP01","DPM1_UL1_4_P10",{"$f":"VLOOKUP(G13,'Part number'!$B$2:$C$13,2,0)","v":3},null,null,null,null,"PS2_5_VFD1","PS2_5",7.5,{"$f":"VLOOKUP(R13,'Part number'!$C$1:$D$13,2,FALSE)","v":"35S-6D5-P111"}]
["DPM COUNT",11,null,null,null,"UL1_11_VFD1","35S-6D2-P101","11.200.1.40","PDP01","DPM1_UL1_4_P11",{"$f":"VLOOKUP(G14,'Part number'!$B$2:$C$13,2,0)","v":2},null,null,null,null,"PS2_6_VFD1","PS2_6",3,{"$f":"VLOOKUP(R14,'Part number'!$C$1:$D$13,2,FALSE)","v":"35S-6D3-P101"}]
[null,null,null,null,null,"UL1_12_VFD1","35S-6D2-P101","11.200.1.41","PDP01","DPM1_UL1_4_P12",{"$f":"VLOOKUP(G15,'Part number'!$B$2:$C$13,2,0)","v":2},null,null,null,null,"PS3_1_VFD1","PS3_1",2,{"$f":"VLOOKUP(R15,'Part number'!$C$1:$D$13,2,FALSE)","v":"35S-6D2-P101"}]
[null,null,null,null,null,"UL1_13_VFD1","35S-6D4-P111","11.200.1.42","PDP01","DPM1_UL1_4_P13",{"$f":"VLOOKUP(G16,'Part number'!$B$2:$C$13,2,0)","v":5},null,null,null,null,"PS3_10_VFD1","PS3_10",5,{"$f":"VLOOKUP(R16,'Part number'!$C$1:$D$13,2,FALSE)","v":"35S-6D4-P111"}]
[null,null,null,null,null,"UL1_3_FIO1","5032-8IOLM12DR","11.200.1.43","PDP01","DPM1_UL1_4_P14",{"$f":"VLOOKUP(G17,'Part number'!$B$2:$C$13,2,0)","v":"FIO"},null,null,null,null,"PS3_11_VFD1","PS3_11",3,{"$f":"VLOOKUP(R17,'Part number'!$C$1:$D$13,2,FALSE)","v":"35S-6D3-P101"}]
[null,null,null,null,null,"UL1_13_FIO1","5032-8IOLM12DR","11.200.1.216",null,null,null,null,"ADDED 5/26",null,null,"PS3_12_VFD1","PS3_12",3,{"$f":"VLOOKUP(R18,'Part number'!$C$1:$D$13,2,FALSE)","v":"35S-6D3-P101"}]
[null,null,null,"UL2_4_DPM1","11.200.1.3","UL2_1_EX1",{"$f":"VLOOKUP(F19,$P$3:$S$176,4,FALSE)","v":"CALJAN"},"11.200.1.44","PDP01","DPM2_UL2_4_P1",{"$f":"VLOOKUP(G19,'Part number'!$B$2:$C$13,2,0)","v":"EXTENDO"},null,null,null,null,"PS3_2_VFD1","PS3_2",3,{"$f":"VLOOKUP(R19,'Part number'!$C$1:$D$13,2,FALSE)","v":"35S-6D3-P101"}]
[null,null,null,null,null,"UL2_3_VFD1","35S-6D4-P111","11.200.1.45","PDP01","DPM2_UL2_4_P2",{"$f":"VLOOKUP(G20,'Part number'!$B$2:$C$13,2,0)","v":5},null,null,null,null,"PS3_3_VFD1","PS3_3",3,{"$f":"VLOOKUP(R20,'Part number'!$C$1:$D$13,2,FALSE)","v":"35S-6D3-P101"}]
[null,null,null,null,null,"UL2_4_VFD1","35S-6D4-P111","11.200.1.46","PDP01","DPM2_UL2_4_P3",{"$f":"VLOOKUP(G21,'Part number'!$B$2:$C$13,2,0)","v":5},null,null,null,null,"PS3_4_VFD1","PS3_4",2,{"$f":"VLOOKUP(R21,'Part number'!$C$1:$D$13,2,FALSE)","v":"35S-6D2-P101"}]
[null,null,null,null,null,"UL2_5_VFD1","35S-6D2-P101","11.200.1.47","PDP01","DPM2_UL2_4_P4",{"$f":"VLOOKUP(G22,'Part number'!$B$2:$C$13,2,0)","v":2},null,null,null,null,"PS3_5_VFD1","PS3_5",5,{"$f":"VLOOKUP(R22,'Part number'!$C$1:$D$13,2,FALSE)","v":"35S-6D4-P111"}]
[null,null,null,null,null,"UL2_6_VFD1","35S-6D3-P101","11.200.1.48","PDP01","DPM2_UL2_4_P5",{"$f":"VLOOKUP(G23,'Part number'!$B$2:$C$13,2,0)","v":3},null,null,null,null,"PS3_6_VFD1","PS3_6",5,{"$f":"VLOOKUP(R23,'Part number'!$C$1:$D$13,2,FALSE)","v":"35S-6D4-P111"}]
[null,null,null,null,null,"UL2_7_VFD1","35S-6D3-P101","11.200.1.49","PDP01","DPM2_UL2_4_P6",{"$f":"VLOOKUP(G24,'Part number'!$B$2:$C$13,2,0)","v":3},null,null,null,null,"PS3_6_DPM1","PS3_6_DPM1","DPM",{"$f":"VLOOKUP(R24,'Part number'!$C$1:$D$13,2,FALSE)","v":{"$error":"#N/A"}}]
[null,null,null,null,null,"UL2_8_VFD1","35S-6D3-P101","11.200.1.50","PDP01","DPM2_UL2_4_P7",{"$f":"VLOOKUP(G25,'Part number'!$B$2:$C$13,2,0)","v":3},null,null,null,null,{"$f":"_xlfn.CONCAT(Q25,\"_VFD1\")","v":"PS3_7_VFD1"},"PS3_7",10,{"$f":"VLOOKUP(R25,'Part number'!$C$1:$D$13,2,FALSE)","v":"35S-6D6-P111"}]
[null,null,null,null,null,"UL2_9_VFD1","35S-6D3-P101","11.200.1.51","PDP01","DPM2_UL2_4_P8",{"$f":"VLOOKUP(G26,'Part number'!$B$2:$C$13,2,0)","v":3},null,null,null,null,"PS3_8_VFD1","PS3_8",3,{"$f":"VLOOKUP(R26,'Part number'!$C$1:$D$13,2,FALSE)","v":"35S-6D3-P101"}]
[null,null,null,null,null,"UL2_10_VFD1","35S-6D2-P101","11.200.1.52","PDP01","DPM2_UL2_4_P9",{"$f":"VLOOKUP(G27,'Part number'!$B$2:$C$13,2,0)","v":2},null,null,null,null,"PS3_9_VFD1","PS3_9",5,{"$f":"VLOOKUP(R27,'Part number'!$C$1:$D$13,2,FALSE)","v":"35S-6D4-P111"}]
[null,null,null,null,null,"UL3_1_VFD1","35S-6D2-P101","11.200.1.53","PDP01","DPM2_UL2_4_P10",{"$f":"VLOOKUP(G28,'Part number'!$B$2:$C$13,2,0)","v":2},null,null,null,null,"PS4_1_VFD1","PS4_1",2,{"$f":"VLOOKUP(R28,'Part number'!$C$1:$D$13,2,FALSE)","v":"35S-6D2-P101"}]
[null,null,null,null,null,"UL3_2_VFD1","35S-6D5-P111","11.200.1.54","PDP01","DPM2_UL2_4_P11",{"$f":"VLOOKUP(G29,'Part number'!$B$2:$C$13,2,0)","v":7.5},null,null,null,null,"PS4_10_VFD1","PS4_10",10,{"$f":"VLOOKUP(R29,'Part number'!$C$1:$D$13,2,FALSE)","v":"35S-6D6-P111"}]
[null,null,null,null,null,"UL3_3_VFD1","35S-6D2-P101","11.200.1.55","PDP01","DPM2_UL2_4_P12",{"$f":"VLOOKUP(G30,'Part number'!$B$2:$C$13,2,0)","v":2},null,null,null,null,"PS4_11_VFD1","PS4_11",5,{"$f":"VLOOKUP(R30,'Part number'!$C$1:$D$13,2,FALSE)","v":"35S-6D4-P111"}]
{"$rows_left_out":159}
{"sheet":"NETWORK","index":5,"n_rows":186,"n_cols":5,"rows_kept":186,"cut":false,"hidden":false,"merged":[]}
["DPM","DPM_IP","Name","PartNumber","IP"]
["UL1_4_DPM1","11.200.1.2","UL1_1_EX1","CALJAN","11.200.1.30"]
["UL1_4_DPM1","11.200.1.2","UL1_3_VFD1","35S-6D4-P111","11.200.1.31"]
["UL1_4_DPM1","11.200.1.2","UL1_4_VFD1","35S-6D4-P111","11.200.1.32"]
["UL1_4_DPM1","11.200.1.2","UL1_5_VFD1","35S-6D3-P101","11.200.1.33"]
["UL1_4_DPM1","11.200.1.2","UL1_6_VFD1","35S-6D3-P101","11.200.1.34"]
["UL1_4_DPM1","11.200.1.2","UL1_7_VFD1","35S-6D3-P101","11.200.1.35"]
["UL1_4_DPM1","11.200.1.2","UL1_8_VFD1","35S-6D3-P101","11.200.1.36"]
["UL1_4_DPM1","11.200.1.2","UL1_9_VFD1","35S-6D4-P111","11.200.1.37"]
["UL1_4_DPM1","11.200.1.2","UL1_10A_VFD1","35S-6D3-P101","11.200.1.38"]
["UL1_4_DPM1","11.200.1.2","UL1_10B_VFD1","35S-6D3-P101","11.200.1.39"]
["UL1_4_DPM1","11.200.1.2","UL1_11_VFD1","35S-6D2-P101","11.200.1.40"]
["UL1_4_DPM1","11.200.1.2","UL1_12_VFD1","35S-6D2-P101","11.200.1.41"]
["UL1_4_DPM1","11.200.1.2","UL1_13_VFD1","35S-6D4-P111","11.200.1.42"]
["UL1_4_DPM1","11.200.1.2","UL1_3_FIO1","5032-8IOLM12DR","11.200.1.43"]
["UL1_4_DPM1","11.200.1.2","UL1_13_FIO1","5032-8IOLM12DR","11.200.1.216"]
["UL2_4_DPM1","11.200.1.3","UL2_1_EX1","CALJAN","11.200.1.44"]
["UL2_4_DPM1","11.200.1.3","UL2_3_VFD1","35S-6D4-P111","11.200.1.45"]
["UL2_4_DPM1","11.200.1.3","UL2_4_VFD1","35S-6D4-P111","11.200.1.46"]
["UL2_4_DPM1","11.200.1.3","UL2_5_VFD1","35S-6D2-P101","11.200.1.47"]
["UL2_4_DPM1","11.200.1.3","UL2_6_VFD1","35S-6D3-P101","11.200.1.48"]
["UL2_4_DPM1","11.200.1.3","UL2_7_VFD1","35S-6D3-P101","11.200.1.49"]
["UL2_4_DPM1","11.200.1.3","UL2_8_VFD1","35S-6D3-P101","11.200.1.50"]
["UL2_4_DPM1","11.200.1.3","UL2_9_VFD1","35S-6D3-P101","11.200.1.51"]
["UL2_4_DPM1","11.200.1.3","UL2_10_VFD1","35S-6D2-P101","11.200.1.52"]
["UL2_4_DPM1","11.200.1.3","UL3_1_VFD1","35S-6D2-P101","11.200.1.53"]
["UL2_4_DPM1","11.200.1.3","UL3_2_VFD1","35S-6D5-P111","11.200.1.54"]
["UL2_4_DPM1","11.200.1.3","UL3_3_VFD1","35S-6D2-P101","11.200.1.55"]
["UL2_4_DPM1","11.200.1.3","UL3_4_VFD1","35S-6D2-P101","11.200.1.56"]
["UL2_4_DPM1","11.200.1.3","UL3_5_VFD1","35S-6D3-P101","11.200.1.57"]
{"$rows_left_out":157}
{"sheet":"Part number","index":6,"n_rows":13,"n_cols":4,"rows_kept":13,"cut":false,"hidden":false,"merged":[]}
[null,"PART NUMBER","HP","PART NUMBER"]
[null,"35S-6D2-P101",2,"35S-6D2-P101"]
[null,"35S-6D3-P101",3,"35S-6D3-P101"]
[null,"35S-6D4-P111",5,"35S-6D4-P111"]
[null,"35S-6D5-P111",7.5,"35S-6D5-P111"]
[null,"35S-6D6-P111",10,"35S-6D6-P111"]
[null,"25B-D024N104",15,"25B-D024N104"]
[null,"25B-D030N104",20,"25B-D030N104"]
[null,"25B-D043N114 ",30,"25B-D043N114 "]
[null,"CALJAN","EXTENDO","CALJAN"]
[null,"PIONEER","TIPPER","PIONEER"]
[null,"ZMX-3DE2500HF-Q7-AMZCHD","ZMX","ZMX-3DE2500HF-Q7-AMZCHD"]
[null,"5032-8IOLM12DR","FIO","5032-8IOLM12DR"]

{"sheet":"MCM01_DESC","index":7,"n_rows":1909,"n_cols":11,"rows_kept":1909,"cut":false,"hidden":false,"merged":[[26,8,30,8],[1,8,5,8],[6,8,10,8],[11,8,15,8],[16,8,20,8],[21,8,25,8],[86,8,90,8],[31,8,35,8],[36,8,40,8],[41,8,45,8],[46,8,50,8],[51,8,55,8],[56,8,60,8],[61,8,65,8],[66,8,70,8],[71,8,75,8],[76,8,80,8],[81,8,85,8],[146,8,150,8],[91,8,95,8],[96,8,100,8],[101,8,105,8],[106,8,110,8],[111,8,115,8],[116,8,120,8],[121,8,125,8],[126,8,130,8],[131,8,135,8],[136,8,140,8],[141,8,145,8],[206,8,210,8],[151,8,155,8],[156,8,160,8],[161,8,165,8],[166,8,170,8],[171,8,175,8],[176,8,180,8],[181,8,185,8],[186,8,190,8],[191,8,195,8],[196,8,200,8],[201,8,205,8]]}
["TAGNAME","ADDR","TERM","TERMDESC","DESCA","DESCB",null,"CONTROLLERS"]
["PS1_01_VFD1","PS1_01_VFD1_I0","I0",null,"PS1_1_VFD1_DISC","DISCONNECT AUX",null,"PS1_01_VFD1",600]
["PS1_01_VFD1","PS1_01_VFD1_I1","I1",null,"SPARE",null,null,"PS1_02_VFD1"]
["PS1_01_VFD1","PS1_01_VFD1_I2","I2",null,"SPARE",null,null,"PS1_03_VFD1"]
["PS1_01_VFD1","PS1_01_VFD1_I3","I3",null,"SPARE",null,null,"PS1_04_VFD1"]
["PS1_01_VFD1","PS1_01_VFD1_IO0","IO0",null,"PS1_1_S1_PB","START PUSHBUTTON"]
["PS1_01_VFD1","PS1_01_VFD1_IO1","IO1",null,"PS1_1_S1_PB_LT","START PUSHBUTTON LIGHT",null,"PS1_05_VFD1",601]
["PS1_01_VFD1","PS1_01_VFD1_SI0","SI0",null,"PS1_1_EPC1","E-STOP PULLCORD",null,"PS2_01_VFD1"]
["PS1_01_VFD1","PS1_01_VFD1_SI1","SI1",null,"PS1_1_EPC1_2","E-STOP PULLCORD",null,"PS2_02_VFD1"]
["PS1_01_VFD1","PS1_01_VFD1_SI2","SI2",null,"PS1_1_EPC2","E-STOP PULLCORD",null,"PS2_03_VFD1"]
["PS1_01_VFD1","PS1_01_VFD1_SI3","SI3",null,"PS1_1_EPC2_2","E-STOP PULLCORD"]
["PS1_01_VFD1","PS1_01_VFD1_SO0","SO0",null,"SPARE",null,null,"PS2_04_VFD1",602]
["PS1_02_VFD1","PS1_02_VFD1_I0","I0",null,"PS1_2_VFD1_DISC","DISCONNECT AUX",null,"PS2_05_VFD1"]
["PS1_02_VFD1","PS1_02_VFD1_I1","I1",null,"SPARE",null,null,"PS2_06_VFD1"]
["PS1_02_VFD1","PS1_02_VFD1_I2","I2",null,"PS1_2_TPE1","TRACKING PHOTOEYE",null,"PS3_01_VFD1"]
["PS1_02_VFD1","PS1_02_VFD1_I3","I3",null,"PS1_2_TPE2","TRACKING PHOTOEYE"]
["PS1_02_VFD1","PS1_02_VFD1_IO0","IO0",null,"PS1_1_BCN1_R","RED BEACON LIGHT",null,"PS3_02_VFD1",603]
["PS1_02_VFD1","PS1_02_VFD1_IO1","IO1",null,"PS1_1_BCN2_R","RED BEACON LIGHT",null,"PS3_03_VFD1"]
["PS1_02_VFD1","PS1_02_VFD1_SI0","SI0",null,"SPARE",null,null,"PS3_04_VFD1"]
["PS1_02_VFD1","PS1_02_VFD1_SI1","SI1",null,"SPARE",null,null,"PS3_05_VFD1"]
["PS1_02_VFD1","PS1_02_VFD1_SI2","SI2",null,"SPARE"]
["PS1_02_VFD1","PS1_02_VFD1_SI3","SI3",null,"SPARE",null,null,"PS3_06_VFD1",604]
["PS1_02_VFD1","PS1_02_VFD1_SO0","SO0",null,"SPARE",null,null,"PS3_07_VFD1"]
["PS1_03_VFD1","PS1_03_VFD1_I0","I0",null,"PS1_3_VFD1_DISC","DISCONNECT AUX",null,"PS3_08_VFD1"]
["PS1_03_VFD1","PS1_03_VFD1_I1","I1",null,"SPARE",null,null,"PS3_09_VFD1"]
["PS1_03_VFD1","PS1_03_VFD1_I2","I2",null,"SPARE"]
["PS1_03_VFD1","PS1_03_VFD1_I3","I3",null,"SPARE",null,null,"PS3_10_VFD1",605]
["PS1_03_VFD1","PS1_03_VFD1_IO0","IO0",null,"PS1_1_S2_PB","START PUSHBUTTON",null,"PS3_11_VFD1"]
["PS1_03_VFD1","PS1_03_VFD1_IO1","IO1",null,"PS1_1_S2_PB_LT","START PUSHBUTTON LIGHT",null,"PS3_12_VFD1"]
["PS1_03_VFD1","PS1_03_VFD1_SI0","SI0",null,"SPARE",null,null,"PS4_01_VFD1"]
{"$rows_left_out":1880}
{"sheet":"Sheet2","index":8,"n_rows":168,"n_cols":4,"rows_kept":168,"cut":false,"hidden":false,"merged":[[0,1,3,1],[4,1,7,1],[8,1,11,1],[12,1,15,1],[88,1,91,1],[76,1,79,1],[16,1,19,1],[20,1,23,1],[24,1,27,1],[28,1,31,1],[32,1,35,1],[36,1,39,1],[40,1,43,1],[44,1,47,1],[48,1,51,1],[52,1,55,1],[92,1,95,1],[96,1,99,1],[100,1,103,1],[80,1,83,1],[84,1,87,1],[56,1,59,1],[60,1,63,1],[64,1,67,1],[68,1,71,1],[72,1,75,1],[164,1,167,1],[104,1,107,1],[108,1,111,1],[112,1,115,1],[116,1,119,1],[120,1,123,1],[124,1,127,1],[128,1,131,1],[132,1,135,1],[136,1,139,1],[140,1,143,1],[144,1,147,1],[148,1,151,1],[152,1,155,1],[156,1,159,1],[160,1,163,1]]}
["PS1_01_VFD1",600,null,"PS4_02_VFD1"]
["PS1_02_VFD1",null,null,"PS4_03_VFD1"]
["PS1_03_VFD1",null,null,"PS4_04_VFD1"]
["PS1_04_VFD1",null,null,"PS4_05_VFD1"]
["PS1_05_VFD1",601,null,"PS4_02_VFD1"]
["PS2_01_VFD1",null,null,"PS4_03_VFD1"]
["PS2_02_VFD1",null,null,"PS4_04_VFD1"]
["PS2_03_VFD1",null,null,"PS4_05_VFD1"]
["PS2_04_VFD1",602,null,"PS4_02_VFD1"]
["PS2_05_VFD1",null,null,"PS4_03_VFD1"]
["PS2_06_VFD1",null,null,"PS4_04_VFD1"]
["PS3_01_VFD1",null,null,"PS4_05_VFD1"]
["PS3_02_VFD1",603,null,"PS4_02_VFD1"]
["PS3_03_VFD1",null,null,"PS4_03_VFD1"]
["PS3_04_VFD1",null,null,"PS4_04_VFD1"]
["PS3_05_VFD1",null,null,"PS4_05_VFD1"]
["PS3_06_VFD1",604,null,"PS4_02_VFD1"]
["PS3_07_VFD1",null,null,"PS4_03_VFD1"]
["PS3_08_VFD1",null,null,"PS4_04_VFD1"]
["PS3_09_VFD1",null,null,"PS4_05_VFD1"]
["PS3_10_VFD1",605,null,"PS4_02_VFD1"]
["PS3_11_VFD1",null,null,"PS4_03_VFD1"]
["PS3_12_VFD1",null,null,"PS4_04_VFD1"]
["PS4_01_VFD1",null,null,"PS4_05_VFD1"]
["PS4_02_VFD1",606,null,"PS4_02_VFD1"]
["PS4_03_VFD1",null,null,"PS4_03_VFD1"]
["PS4_04_VFD1",null,null,"PS4_04_VFD1"]
["PS4_05_VFD1",null,null,"PS4_05_VFD1"]
["PS4_06_VFD1",607,null,"PS4_02_VFD1"]
["PS4_07_VFD1",null,null,"PS4_03_VFD1"]
{"$rows_left_out":139}
{"sheet":"MCM01_DESC_V2","index":9,"n_rows":2107,"n_cols":9,"rows_kept":2107,"cut":false,"hidden":false,"merged":[]}
["TAGNAME","TERM","DESCA","DESCB",null,"CONTROLLERS"]
["PS1_01_VFD1","I0","PS1_1_VFD1_DISC","DISCONNECT AUX",null,"PS1_01_VFD1"]
["PS1_01_VFD1","I1","SPARE",null,null,"PS1_02_VFD1"]
["PS1_01_VFD1","I2","SPARE",null,null,"PS1_03_VFD1"]
["PS1_01_VFD1","I3","SPARE",null,null,"PS1_04_VFD1"]
["PS1_01_VFD1","IO0","PS1_1_S1_PB","START PUSHBUTTON"]
["PS1_01_VFD1","IO1","PS1_1_S1_PB_LT","START PUSHBUTTON LIGHT",null,"PS1_05_VFD1"]
["PS1_01_VFD1","SI0","PS1_1_EPC1","E-STOP PULLCORD",null,"PS2_01_VFD1"]
["PS1_01_VFD1","SI1","PS1_1_EPC1_2","E-STOP PULLCORD",null,"PS2_02_VFD1"]
["PS1_01_VFD1","SI2","PS1_1_EPC2","E-STOP PULLCORD",null,"PS2_03_VFD1"]
["PS1_01_VFD1","SI3","PS1_1_EPC2_2","E-STOP PULLCORD"]
["PS1_01_VFD1","SO0","SPARE",null,null,"PS2_04_VFD1"]
["PS1_02_VFD1","I0","PS1_2_VFD1_DISC","DISCONNECT AUX",null,"PS2_05_VFD1"]
["PS1_02_VFD1","I1","SPARE",null,null,"PS2_06_VFD1"]
["PS1_02_VFD1","I2","PS1_2_TPE1","TRACKING PHOTOEYE",null,"PS3_01_VFD1"]
["PS1_02_VFD1","I3","PS1_2_TPE2","TRACKING PHOTOEYE"]
["PS1_02_VFD1","IO0","PS1_1_BCN1_R","RED BEACON LIGHT",null,"PS3_02_VFD1"]
["PS1_02_VFD1","IO1","PS1_1_BCN2_R","RED BEACON LIGHT",null,"PS3_03_VFD1"]
["PS1_02_VFD1","SI0","SPARE",null,null,"PS3_04_VFD1"]
["PS1_02_VFD1","SI1","SPARE",null,null,"PS3_05_VFD1"]
["PS1_02_VFD1","SI2","SPARE"]
["PS1_02_VFD1","SI3","SPARE",null,null,"PS3_06_VFD1"]
["PS1_02_VFD1","SO0","SPARE",null,null,"PS3_07_VFD1"]
["PS1_03_VFD1","I0","PS1_3_VFD1_DISC","DISCONNECT AUX",null,"PS3_08_VFD1"]
["PS1_03_VFD1","I1","SPARE",null,null,"PS3_09_VFD1"]
["PS1_03_VFD1","I2","SPARE"]
["PS1_03_VFD1","I3","SPARE",null,null,"PS3_10_VFD1"]
["PS1_03_VFD1","IO0","PS1_1_S2_PB","START PUSHBUTTON",null,"PS3_11_VFD1"]
["PS1_03_VFD1","IO1","PS1_1_S2_PB_LT","START PUSHBUTTON LIGHT",null,"PS3_12_VFD1"]
["PS1_03_VFD1","SI0","SPARE",null,null,"PS4_01_VFD1"]
{"$rows_left_out":2077}