{"text_format":"1","workbook":"xlsx","n_sheets":9,"sheets":["Templates","Devices","Instructions","NETWORK","Part Number","IO Assignment MCM02","MCM02_DESC","DESC_PLC","NETWORK_PLC"],"not_rendered":{"charts":0,"images":10,"macros":1,"external_links":0,"defined_names":5,"comments":3,"pivot_tables":0},"unopened":[],"bounds":{"document_bytes":16777216,"sheet_cells":100000,"rows_first":2000,"rows_last":500,"rows_between":2000,"halvings":0,"cell_chars":16384,"cell_head_chars":4096},"cells_cut":0,"cells_raw":0,"read":"whole","date_system":"1900"}

{"sheet":"Templates","index":0,"n_rows":19,"n_cols":3,"rows_kept":19,"cut":false,"hidden":false,"merged":[]}
[]
["VFD IO TEMPLATE",null,"FIO IO Template"]
["I0",null,"IO00"]
["I1",null,"IO01"]
["I2",null,"IO02"]
["I3",null,"IO03"]
["IO0",null,"IO04"]
["IO1",null,"IO05"]
["SI0",null,"IO06"]
["SI1",null,"IO07"]
["SI2",null,"IO08"]
["SI3",null,"IO09"]
["SO0",null,"IO10"]
[null,null,"IO11"]
[null,null,"IO12"]
[null,null,"IO13"]
[null,null,"IO14"]
[null,null,"IO15"]
[null,null,"IO16"]

{"sheet":"Devices","index":1,"n_rows":827,"n_cols":9,"rows_kept":827,"cut":false,"hidden":false,"merged":[]}
[null,null,null,null,null,null,null,"Which MCM we assign?","MCM02"]
["PS5_1_BCN1_R"]
["PS5_1_DISC"]
["PS5_1_EPC1"]
["PS5_1_EPC1_2"]
["PS5_1_EPC2"]
["PS5_1_EPC2_2"]
["PS5_1_S1_PB"]
["PS5_1_S1_PB_LT"]
["PS5_1_S2_PB"]
["PS5_1_S2_PB_LT"]
["PS5_1_VFD1"]
["PS5_10_DISC"]
["PS5_10_JR1_PB"]
["PS5_10_JR1_PB_LT"]
["PS5_10_TPE1"]
["PS5_10_TPE2"]
["PS5_10_VFD1"]
["PS5_11_BCN1_A"]
["PS5_11_DISC"]
["PS5_11_JR1_PB"]
["PS5_11_JR1_PB_LT"]
["PS5_11_VFD1"]
["PS5_12_DISC"]
["PS5_12_FIO1"]
["PS5_12_TPE1"]
["PS5_12_TPE2"]
["PS5_12_VFD1"]
["PS5_13_DISC"]
["PS5_13_TPE1"]
["PS5_13_VFD1"]
["PS5_2_BCN1_A"]
["PS5_2_BCN1_R"]
["PS5_2_DISC"]
["PS5_2_TPE1"]
["PS5_2_TPE2"]
["PS5_2_VFD1"]
["PS5_3_DISC"]
["PS5_3_VFD1"]
["PS5_4_DISC"]
["PS5_4_TPE1"]
["PS5_4_TPE2"]
["PS5_4_VFD1"]
["PS5_5_DISC"]
["PS5_5_TPE1"]
["PS5_5_VFD1"]
["PS5_6_BCN1_A"]
["PS5_6_DISC"]
["PS5_6_JR1_PB"]
["PS5_6_JR1_PB_LT"]
["PS5_6_VFD1"]
["PS5_7_DISC"]
["PS5_7_TPE1"]
["PS5_7_VFD1"]
["PS5_8_DISC"]
["PS5_8_TPE1"]
["PS5_8_TPE2"]
["PS5_8_VFD1"]
["PS5_9_BCN1_A"]
["PS5_9_DISC"]
["PS5_9_JR1_PB"]
["PS5_9_JR1_PB_LT"]
["PS5_9_JR2_PB"]
["PS5_9_JR2_PB_LT"]
["PS5_9_VFD1"]
["PS6_1_BCN1_R"]
["PS6_1_DISC"]
["PS6_1_EPC1"]
["PS6_1_EPC1_2"]
["PS6_1_EPC2"]
["PS6_1_EPC2_2"]
["PS6_1_S1_PB"]
["PS6_1_S1_PB_LT"]
["PS6_1_S2_PB"]
["PS6_1_S2_PB_LT"]
["PS6_1_VFD1"]
["PS6_10_DISC"]
["PS6_10_TPE1"]
["PS6_10_TPE2"]
["PS6_10_VFD1"]
["PS6_11_BCN1_A"]
["PS6_11_DISC"]
["PS6_11_JR1_PB"]
["PS6_11_JR1_PB_LT"]
["PS6_11_VFD1"]
["PS6_12_DISC"]
["PS6_12_TPE1"]
["PS6_12_TPE2"]
["PS6_12_VFD1"]
["PS6_13_DISC"]
["PS6_13_VFD1"]
["PS6_2_BCN2_A"]
["PS6_2_BCN2_R"]
["PS6_2_DISC"]
["PS6_2_TPE1"]
["PS6_2_TPE2"]
["PS6_2_VFD1"]
["PS6_3_DISC"]
["PS6_3_VFD1"]
["PS6_4_DISC"]
["PS6_4_TPE1"]
["PS6_4_TPE2"]
["PS6_4_VFD1"]
["PS6_5_DISC"]
["PS6_5_TPE1"]
["PS6_5_VFD1"]
["PS6_6_BCN1_A"]
["PS6_6_DISC"]
["PS6_6_JR1_PB"]
["PS6_6_JR1_PB_LT"]
["PS6_6_VFD1"]
["PS6_7_DISC"]
["PS6_7_TPE1"]
["PS6_7_VFD1"]
["PS6_8_BCN1_A"]
["PS6_8_DISC"]
["PS6_8_JR1_PB"]
["PS6_8_JR1_PB_LT"]
["PS6_8_TPE1"]
["PS6_8_TPE2"]
["PS6_8_VFD1"]
["PS6_9_DISC"]
["PS6_9_JR1_PB"]
["PS6_9_JR1_PB_LT"]
["PS6_9_VFD1"]
["PS7_1_BCN1_R"]
["PS7_1_DISC"]
["PS7_1_EPC1"]
["PS7_1_EPC1_2"]
["PS7_1_EPC2"]
["PS7_1_EPC2_2"]
["PS7_1_S1_PB"]
["PS7_1_S1_PB_LT"]
["PS7_1_S2_PB"]
["PS7_1_S2_PB_LT"]
["PS7_1_VFD1"]
["PS7_10_DISC"]
["PS7_10_TPE1"]
["PS7_10_VFD1"]
["PS7_11_BCN1_A"]
["PS7_11_DISC"]
["PS7_11_JR1_PB"]
["PS7_11_JR1_PB_LT"]
["PS7_11_VFD1"]
["PS7_12_DISC"]
["PS7_12_TPE1"]
["PS7_12_TPE2"]
["PS7_12_VFD1"]
["PS7_13_BCN1_A"]
["PS7_13_DISC"]
["PS7_13_JR1_PB"]
["PS7_13_JR1_PB_LT"]
["PS7_13_VFD1"]
["PS7_14_DISC"]
["PS7_14_TPE1"]
["PS7_14_TPE2"]
["PS7_14_VFD1"]
["PS7_2_BCN1_A"]
["PS7_2_BCN1_R"]
["PS7_2_DISC"]
["PS7_2_TPE1"]
["PS7_2_TPE2"]
["PS7_2_VFD1"]
["PS7_3_DISC"]
["PS7_3_VFD1"]
["PS7_4_DISC"]
["PS7_4_TPE1"]
["PS7_4_TPE2"]
["PS7_4_VFD1"]
["PS7_5_DISC"]
["PS7_5_TPE1"]
["PS7_5_VFD1"]
["PS7_6_DISC"]
["PS7_6_TPE1"]
["PS7_6_VFD1"]
["PS7_7_DISC"]
["PS7_7_TPE1"]
["PS7_7_VFD1"]
["PS7_8_DISC"]
["PS7_8_TPE1"]
["PS7_8_VFD1"]
["PS7_9_BCN1_R"]
["PS7_9_BCN2_R"]
["PS7_9_DISC"]
["PS7_9_EPC1"]
["PS7_9_EPC1_2"]
["PS7_9_EPC2"]
["PS7_9_EPC2_2"]
["PS7_9_S1_PB"]
["PS7_9_S1_PB_LT"]
["PS7_9_S2_PB"]
["PS7_9_S2_PB_LT"]
["PS7_9_TPE1"]
["PS7_9_VFD1"]
["UL13_1_BCN1_R"]
["UL13_1_BCN2_R"]
["UL13_1_DISC"]
["UL13_1_EPC1"]
["UL13_1_EPC1_2"]
["UL13_1_EPC2"]
["UL13_1_EPC2_2"]
["UL13_1_SS1_SPB"]
["UL13_1_SS1_STPB"]
["UL13_1_SS1_STPB_LT"]
["UL13_1_TPE1"]
["UL13_1_VFD1"]
["UL13_10_DISC"]
["UL13_10_ENC1"]
["UL13_10_TPE1"]
["UL13_10_TPE2"]
["UL13_10_VFD1"]
["UL13_11_DISC"]
["UL13_11_ENC1"]
["UL13_11_TPE1"]
["UL13_11_VFD1"]
["UL13_12_DISC"]
["UL13_12_VFD1"]
["UL13_2_DISC"]
["UL13_2_FIO1"]
["UL13_2_LPE1"]
["UL13_2_LPE2"]
["UL13_2_TPE1"]
["UL13_2_VFD1"]
["UL13_3_DISC"]
["UL13_3_TPE1"]
["UL13_3_VFD1"]
["UL13_4_BCN1_R"]
["UL13_4_BCN2_R"]
["UL13_4_DISC"]
["UL13_4_ENC1"]
["UL13_4_EPC1"]
["UL13_4_EPC1_2"]
["UL13_4_EPC2"]
["UL13_4_EPC2_2"]
["UL13_4_S1_PB"]
["UL13_4_S1_PB_LT"]
["UL13_4_S2_PB"]
["UL13_4_S2_PB_LT"]
["UL13_4_TPE1"]
["UL13_4_VFD1"]
["UL13_5_DISC"]
["UL13_5_ENC1"]
["UL13_5_TPE1"]
["UL13_5_VFD1"]
["UL13_6_ENC1"]
["UL13_6_TPE1"]
["UL13_6_VFD"]
["UL13_6_VFD_DISC"]
["UL13_7_DISC"]
["UL13_7_ENC1"]
["UL13_7_TPE1"]
["UL13_7_VFD1"]
["UL13_8_BCN1_A"]
["UL13_8_BCN1_R"]
["UL13_8_BCN2_R"]
["UL13_8_DISC"]
["UL13_8_ENC1"]
["UL13_8_EPC1"]
["UL13_8_EPC1_2"]
["UL13_8_EPC2"]
["UL13_8_EPC2_2"]
["UL13_8_JR1_PB"]
["UL13_8_JR1_PB_LT"]
["UL13_8_JR2_PB"]
["UL13_8_JR2_PB_LT"]
["UL13_8_S1_PB"]
["UL13_8_S1_PB_LT"]
["UL13_8_S2_PB"]
["UL13_8_S2_PB_LT"]
["UL13_8_TPE1"]
["UL13_8_TPE2"]
["UL13_8_TPE3"]
["UL13_8_TPE4"]
["UL13_8_TPE5"]
["UL13_8_VFD1"]
["UL13_9A_DISC"]
["UL13_9A_VFD1"]
["UL13_9B_DISC"]
["UL13_9B_VFD1"]
["UL14_10_DISC"]
["UL14_10_VFD1"]
["UL14_3_BCN1_R"]
["UL14_3_BCN2_R"]
["UL14_3_DISC"]
["UL14_3_ENC1"]
["UL14_3_EPC1"]
["UL14_3_EPC1_2"]
["UL14_3_EPC2"]
["UL14_3_EPC2_2"]
["UL14_3_FIO1"]
["UL14_3_LPE1"]
["UL14_3_LPE2"]
["UL14_3_S1_PB"]
["UL14_3_S1_PB_LT"]
["UL14_3_S2_PB"]
["UL14_3_S2_PB_LT"]
["UL14_3_TPE1"]
["UL14_3_TPE2"]
["UL14_3_VFD1"]
["UL14_4_BCN1_R"]
["UL14_4_BCN2_R"]
["UL14_4_DISC"]
["UL14_4_ENC1"]
["UL14_4_EPC1"]
["UL14_4_EPC1_2"]
["UL14_4_EPC2"]
["UL14_4_EPC2_2"]
["UL14_4_S1_PB"]
["UL14_4_S1_PB_LT"]
["UL14_4_S2_PB"]
["UL14_4_S2_PB_LT"]
["UL14_4_TPE1"]
["UL14_4_VFD1"]
["UL14_5_DISC"]
["UL14_5_ENC1"]
["UL14_5_TPE1"]
["UL14_5_VFD1"]
["UL14_6_DISC"]
["UL14_6_ENC1"]
["UL14_6_VFD1"]
["UL14_7_ENC1"]
["UL14_7_TPE1"]
["UL14_7_TPE2"]
["UL14_8_DISC"]
["UL14_8_ENC1"]
["UL14_8_TPE1"]
["UL14_8_VFD1"]
["UL14_9_DISC"]
["UL14_9_ENC1"]
["UL14_9_TPE1"]
["UL14_9_VFD1"]
["UL15_10_DISC"]
["UL15_10_ENC1"]
["UL15_10_TPE1"]
["UL15_10_VFD1"]
["UL15_11_DISC"]
["UL15_11_ENC1"]
["UL15_11_VFD1"]
["UL15_3_BCN1_R"]
["UL15_3_BCN2_R"]
["UL15_3_DISC"]
["UL15_3_ENC1"]
["UL15_3_EPC1"]
["UL15_3_EPC1_2"]
["UL15_3_EPC2"]
["UL15_3_EPC2_2"]
["UL15_3_FIO1"]
["UL15_3_LPE1"]
["UL15_3_LPE2"]
["UL15_3_S1_PB"]
["UL15_3_S1_PB_LT"]
["UL15_3_S2_PB"]
["UL15_3_S2_PB_LT"]
["UL15_3_TPE1"]
["UL15_3_TPE2"]
["UL15_3_VFD1"]
["UL15_4_BCN1_R"]
["UL15_4_BCN2_R"]
["UL15_4_DISC"]
["UL15_4_ENC1"]
["UL15_4_EPC1"]
["UL15_4_EPC1_2"]
["UL15_4_EPC2"]
["UL15_4_EPC2_2"]
["UL15_4_S1_PB"]
["UL15_4_S1_PB_LT"]
["UL15_4_S2_PB"]
["UL15_4_S2_PB_LT"]
["UL15_4_TPE1"]
["UL15_4_VFD1"]
["UL15_5_DISC"]
["UL15_5_ENC1"]
["UL15_5_VFD1"]
["UL15_6_DISC"]
["UL15_6_ENC1"]
["UL15_6_TPE1"]
["UL15_6_TPE2"]
["UL15_6_VFD1"]
["UL15_7_DISC"]
["UL15_7_ENC1"]
["UL15_7_TPE1"]
["UL15_7_VFD1"]
["UL15_8_DISC"]
["UL15_8_ENC1"]
["UL15_8_TPE1"]
["UL15_8_VFD1"]
["UL15_9_DISC"]
["UL15_9_ENC1"]
["UL15_9_TPE1"]
["UL15_9_VFD1"]
["UL16_1_DISC"]
["UL16_1_EPC1"]
["UL16_1_EPC1_2"]
["UL16_1_EPC2"]
["UL16_1_EPC2_2"]
["UL16_1_SS1_SPB"]
["UL16_1_SS1_STPB"]
["UL16_1_SS1_STPB_LT"]
["UL16_1_TPE1"]
["UL16_1_VFD1"]
["UL16_2_BCN1_R"]
["UL16_2_BCN2_R"]
["UL16_2_BCN3_R"]
["UL16_2_BCN4_R"]
["UL16_2_DISC"]
["UL16_2_ENC1"]
["UL16_2_EPC1"]
["UL16_2_EPC1_2"]
["UL16_2_EPC2"]
["UL16_2_EPC2_2"]
["UL16_2_FIO1"]
["UL16_2_LPE1"]
["UL16_2_LPE2"]
["UL16_2_S1_PB"]
["UL16_2_S1_PB_LT"]
["UL16_2_S2_PB"]
["UL16_2_S2_PB_LT"]
["UL16_2_TPE1"]
["UL16_2_TPE2"]
["UL16_2_VFD1"]
["UL16_3_DISC"]
["UL16_3_TPE1"]
["UL16_3_TPE2"]
["UL16_3_VFD1"]
["UL16_4_DISC"]
["UL16_4_ENC1"]
["UL16_4_TPE1"]
["UL16_4_VFD1"]
["UL16_5_DISC"]
["UL16_5_ENC1"]
["UL16_5_VFD1"]
["UL16_6_DISC"]
["UL16_6_ENC1"]
["UL16_6_TPE1"]
["UL16_6_TPE2"]
["UL16_6_VFD1"]
["UL16_7_DISC"]
["UL16_7_ENC1"]
["UL16_7_TPE1"]
["UL16_7_VFD1"]
["UL16_8_DISC"]
["UL16_8_ENC1"]
["UL16_8_TPE1"]
["UL16_8_VFD1"]
["UL16_9_DISC"]
["UL16_9_VFD1"]
["UL17_10_DISC"]
["UL17_10_VFD1"]
["UL17_3_BCN1_R"]
["UL17_3_BCN2_R"]
["UL17_3_DISC"]
["UL17_3_ENC1"]
["UL17_3_EPC1"]
["UL17_3_EPC1_2"]
["UL17_3_EPC2"]
["UL17_3_EPC2_2"]
["UL17_3_FIO1"]
["UL17_3_LPE1"]
["UL17_3_LPE2"]
["UL17_3_S1_PB"]
["UL17_3_S1_PB_LT"]
["UL17_3_S2_PB"]
["UL17_3_S2_PB_LT"]
["UL17_3_TPE1"]
["UL17_3_VFD1"]
["UL17_4_BCN1_R"]
["UL17_4_BCN2_R"]
["UL17_4_DISC"]
["UL17_4_ENC1"]
["UL17_4_EPC1"]
["UL17_4_EPC1_2"]
["UL17_4_EPC2"]
["UL17_4_EPC2_2"]
["UL17_4_S1_PB"]
["UL17_4_S1_PB_LT"]
["UL17_4_S2_PB"]
["UL17_4_S2_PB_LT"]
["UL17_4_TPE1"]
["UL17_4_VFD1"]
["UL17_5_DISC"]
["UL17_5_ENC1"]
["UL17_5_TPE1"]
["UL17_5_VFD1"]
["UL17_6_DISC"]
["UL17_6_ENC1"]
["UL17_6_VFD1"]
["UL17_7_DISC"]
["UL17_7_ENC1"]
["UL17_7_TPE1"]
["UL17_7_TPE2"]
["UL17_7_VFD1"]
["UL17_8_DISC"]
["UL17_8_ENC1"]
["UL17_8_TPE1"]
["UL17_8_VFD1"]
["UL17_9_DISC"]
["UL17_9_ENC1"]
["UL17_9_TPE1"]
["UL17_9_VFD1"]
["UL18_10_BCN1_A"]
["UL18_10_BCN1_R"]
["UL18_10_BCN2_R"]
["UL18_10_DISC"]
["UL18_10_ENC1"]
["UL18_10_EPC1"]
["UL18_10_EPC1_2"]
["UL18_10_EPC2"]
["UL18_10_EPC2_2"]
["UL18_10_JR1_PB"]
["UL18_10_JR1_PB_LT"]
["UL18_10_JR2_PB"]
["UL18_10_JR2_PB_LT"]
["UL18_10_JR3_PB"]
["UL18_10_JR3_PB_LT"]
["UL18_10_S1_PB"]
["UL18_10_S1_PB_LT"]
["UL18_10_S2_PB"]
["UL18_10_S2_PB_LT"]
["UL18_10_TPE1"]
["UL18_10_TPE2"]
["UL18_10_TPE3"]
["UL18_10_TPE4"]
["UL18_10_TPE5"]
["UL18_10_VFD1"]
["UL18_11_DISC"]
["UL18_11_ENC1"]
["UL18_11_VFD1"]
["UL18_12_DISC"]
["UL18_12_ENC1"]
["UL18_12_TPE1"]
["UL18_12_TPE2"]
["UL18_12_VFD1"]
["UL18_13A_DISC"]
["UL18_13A_VFD1"]
["UL18_13B_DISC"]
["UL18_13B_VFD1"]
["UL18_14_DISC"]
["UL18_14_ENC1"]
["UL18_14_TPE1"]
["UL18_14_TPE2"]
["UL18_14_VFD1"]
["UL18_15_DISC"]
["UL18_15_ENC1"]
["UL18_15_TPE1"]
["UL18_15_VFD1"]
["UL18_16_DISC"]
["UL18_16_VFD1"]
["UL18_3_BCN1_R"]
["UL18_3_BCN2_R"]
["UL18_3_DISC"]
["UL18_3_ENC1"]
["UL18_3_EPC1"]
["UL18_3_EPC1_2"]
["UL18_3_EPC2"]
["UL18_3_EPC2_2"]
["UL18_3_FIO1"]
["UL18_3_LPE1"]
["UL18_3_LPE2"]
["UL18_3_S1_PB"]
["UL18_3_S1_PB_LT"]
["UL18_3_S2_PB"]
["UL18_3_S2_PB_LT"]
["UL18_3_TPE1"]
["UL18_3_TPE2"]
["UL18_3_VFD1"]
["UL18_4_BCN1_R"]
["UL18_4_BCN2_R"]
["UL18_4_DISC"]
["UL18_4_ENC1"]
["UL18_4_EPC1"]
["UL18_4_EPC1_2"]
["UL18_4_EPC2"]
["UL18_4_EPC2_2"]
["UL18_4_S1_PB"]
["UL18_4_S1_PB_LT"]
["UL18_4_S2_PB"]
["UL18_4_S2_PB_LT"]
["UL18_4_TPE1"]
["UL18_4_VFD1"]
["UL18_5_DISC"]
["UL18_5_ENC1"]
["UL18_5_TPE1"]
["UL18_5_VFD1"]
["UL18_6_DISC"]
["UL18_6_ENC1"]
["UL18_6_VFD1"]
["UL18_7_DISC"]
["UL18_7_ENC1"]
["UL18_7_TPE1"]
["UL18_7_TPE2"]
["UL18_7_VFD1"]
["UL18_8_DISC"]
["UL18_8_ENC1"]
["UL18_8_TPE1"]
["UL18_8_VFD1"]
["UL18_9_DISC"]
["UL18_9_ENC1"]
["UL18_9_TPE1"]
["UL18_9_VFD1"]
["UL19_1_BCN1_R"]
["UL19_1_BCN2_R"]
["UL19_1_DISC"]
["UL19_1_EPC1"]
["UL19_1_EPC1_2"]
["UL19_1_EPC2"]
["UL19_1_EPC2_2"]
["UL19_1_SS1_SPB"]
["UL19_1_SS1_STPB"]
["UL19_1_SS1_STPB_LT"]
["UL19_1_TPE1"]
["UL19_1_VFD1"]
["UL19_2_BCN1_R"]
["UL19_2_BCN2_R"]
["UL19_2_DISC"]
["UL19_2_ENC1"]
["UL19_2_EPC1"]
["UL19_2_EPC1_2"]
["UL19_2_EPC2"]
["UL19_2_EPC2_2"]
["UL19_2_LPE1"]
["UL19_2_LPE2"]
["UL19_2_S1_PB"]
["UL19_2_S1_PB_LT"]
["UL19_2_S2_PB"]
["UL19_2_S2_PB_LT"]
["UL19_2_TPE1"]
["UL19_2_TPE2"]
["UL19_2_VFD1"]
["UL19_3_DISC"]
["UL19_3_ENC1"]
["UL19_3_VFD1"]
["UL19_4_DISC"]
["UL19_4_ENC1"]
["UL19_4_TPE1"]
["UL19_4_TPE2"]
["UL19_4_VFD1"]
["UL19_5_DISC"]
["UL19_5_ENC1"]
["UL19_5_TPE1"]
["UL19_5_VFD1"]
["UL19_6_DISC"]
["UL19_6_ENC1"]
["UL19_6_TPE1"]
["UL19_6_VFD1"]
["UL19_7_DISC"]
["UL19_7_ENC1"]
["UL19_7_TPE1"]
["UL19_7_VFD1"]
["UL19_8_DISC"]
["UL19_8_ENC1"]
["UL19_8_TPE1"]
["UL19_8_VFD1"]
["UL19_9_DISC"]
["UL19_9_VFD1"]
["UL20_10_DISC"]
["UL20_10_ENC1"]
["UL20_10_TPE1"]
["UL20_10_VFD1"]
["UL20_11_DISC"]
["UL20_11_VFD1"]
["UL20_3_BCN1_R"]
["UL20_3_BCN2_R"]
["UL20_3_DISC"]
["UL20_3_ENC1"]
["UL20_3_EPC1"]
["UL20_3_EPC1_2"]
["UL20_3_EPC2"]
["UL20_3_EPC2_2"]
["UL20_3_FIO1"]
["UL20_3_LPE1"]
["UL20_3_LPE2"]
["UL20_3_S1_PB"]
["UL20_3_S1_PB_LT"]
["UL20_3_S2_PB"]
["UL20_3_S2_PB_LT"]
["UL20_3_TPE1"]
["UL20_3_TPE2"]
["UL20_3_VFD1"]
["UL20_4_BCN1_R"]
["UL20_4_BCN2_R"]
["UL20_4_DISC"]
["UL20_4_ENC1"]
["UL20_4_EPC1"]
["UL20_4_EPC1_2"]
["UL20_4_EPC2"]
["UL20_4_EPC2_2"]
["UL20_4_S1_PB"]
["UL20_4_S1_PB_LT"]
["UL20_4_S2_PB"]
["UL20_4_S2_PB_LT"]
["UL20_4_VFD1"]
["UL20_44_TPE1"]
["UL20_5_DISC"]
["UL20_5_ENC1"]
["UL20_5_VFD1"]
["UL20_6_DISC"]
["UL20_6_ENC1"]
["UL20_6_TPE1"]
["UL20_6_TPE2"]
["UL20_6_VFD1"]
["UL20_7_DISC"]
["UL20_7_ENC1"]
["UL20_7_TPE1"]
["UL20_7_VFD1"]
["UL20_8_DISC"]
["UL20_8_ENC1"]
["UL20_8_TPE1"]
["UL20_8_VFD1"]
["UL20_9_DISC"]
["UL20_9_ENC1"]
["UL20_9_TPE1"]
["UL20_9_VFD1"]
["UL21_10_DISC"]
["UL21_10_ENC1"]
["UL21_10_TPE1"]
["UL21_10_VFD1"]
["UL21_11_BCN1_A"]
["UL21_11_BCN1_R"]
["UL21_11_BCN2_R"]
["UL21_11_DISC"]
["UL21_11_ENC1"]
["UL21_11_EPC1"]
["UL21_11_EPC1_2"]
["UL21_11_EPC2"]
["UL21_11_EPC2_2"]
["UL21_11_JR1_PB"]
["UL21_11_JR1_PB_LT"]
["UL21_11_JR2_PB"]
["UL21_11_JR2_PB_LT"]
["UL21_11_S1_PB"]
["UL21_11_S1_PB_LT"]
["UL21_11_S2_PB"]
["UL21_11_S2_PB_LT"]
["UL21_11_TPE1"]
["UL21_11_TPE2"]
["UL21_11_TPE3"]
["UL21_11_TPE4"]
["UL21_11_TPE5"]
["UL21_11_VFD1"]
["UL21_12_DISC"]
["UL21_12_ENC1"]
["UL21_12_VFD1"]
["UL21_13_BCN1_R"]
["UL21_13_BCN2_R"]
["UL21_13_DISC"]
["UL21_13_ENC1"]
["UL21_13_EPC1"]
["UL21_13_EPC1_2"]
["UL21_13_EPC2"]
["UL21_13_EPC2_2"]
["UL21_13_S1_PB"]
["UL21_13_S1_PB_LT"]
["UL21_13_S2_PB"]
["UL21_13_S2_PB_LT"]
["UL21_13_TPE1"]
["UL21_13_TPE2"]
["UL21_13_VFD1"]
["UL21_14A_DISC"]
["UL21_14A_VFD1"]
["UL21_14B_DISC"]
["UL21_14B_VFD1"]
["UL21_15_DISC"]
["UL21_15_ENC1"]
["UL21_15_TPE1"]
["UL21_15_TPE2"]
["UL21_15_VFD1"]
["UL21_16_DISC"]
["UL21_16_ENC1"]
["UL21_16_TPE1"]
["UL21_16_VFD1"]
["UL21_17_DISC"]
["UL21_17_VFD1"]
["UL21_3_BCN1_R"]
["UL21_3_BCN2_R"]
["UL21_3_DISC"]
["UL21_3_ENC1"]
["UL21_3_EPC1"]
["UL21_3_EPC1_2"]
["UL21_3_EPC2"]
["UL21_3_EPC2_2"]
["UL21_3_FIO1"]
["UL21_3_LPE1"]
["UL21_3_LPE2"]
["UL21_3_S1_PB"]
["UL21_3_S1_PB_LT"]
["UL21_3_S2_PB"]
["UL21_3_S2_PB_LT"]
["UL21_3_TPE1"]
["UL21_3_TPE2"]
["UL21_3_VFD1"]
["UL21_4_BCN1_R"]
["UL21_4_BCN2_R"]
["UL21_4_DISC"]
["UL21_4_ENC1"]
["UL21_4_EPC1"]
["UL21_4_EPC1_2"]
["UL21_4_EPC2"]
["UL21_4_EPC2_2"]
["UL21_4_S1_PB"]
["UL21_4_S1_PB_LT"]
["UL21_4_S2_PB"]
["UL21_4_S2_PB_LT"]
["UL21_4_TPE1"]
["UL21_4_VFD1"]
["UL21_5_BCN1_A"]
["UL21_5_DISC"]
["UL21_5_ENC1"]
["UL21_5_JR1_PB"]
["UL21_5_JR1_PB_LT"]
["UL21_5_VFD1"]
["UL21_6_DISC"]
["UL21_6_ENC1"]
["UL21_6_TPE1"]
["UL21_6_TPE2"]
["UL21_6_VFD1"]
["UL21_7_DISC"]
["UL21_7_ENC1"]
["UL21_7_TPE1"]
["UL21_7_VFD1"]
["UL21_8_DISC"]
["UL21_8_ENC1"]
["UL21_8_TPE1"]
["UL21_8_VFD1"]
["UL21_9_DISC"]
["UL21_9_ENC1"]
["UL21_9_TPE1"]
["UL21_9_VFD1"]

{"sheet":"Instructions","index":2,"n_rows":116,"n_cols":2,"rows_kept":116,"cut":false,"hidden":false,"merged":[]}
[]
["1. ","Put all device tags to cell A2"]
[]
[]
[]
[]
[]
[]
[]
[]
[]
[]
[]
[]
[]
[]
[]
[]
[]
[]
[]
[]
[]
[]
[]
[]
[]
[]
[]
[]
[]
[]
[]
[]
[]
[]
["2.","In cell I1 write MCM number"]
[]
[]
[]
[]
[]
[]
[]
[]
[]
["3. ","Click on \"Add Disconnects\" button. "]
[]
[]
[]
[]
[]
[]
[]
[]
[]
["4. ","Replace all _VFD1_DISC with _DISC. Without this point it will generate IO points for _VFD1_DISC device"]
[]
[]
[]
[]
[]
[]
[]
[]
[]
[]
[]
["5. ","Click on \"Split SS station\". This will split all _SS to SS_STPB, SS_SPB and SS_STPB_LT"]
[]
[]
[]
[]
[]
[]
[]
[]
["6. ","Click on \"Split start PB\". This will split all _S and _JR to _S_PB, _S_PB_LT, JR_PB and JR_PB_LT"]
[]
[]
[]
[]
[]
[]
[]
[]
["7.","Click on \"Duplicate EPC Tag\". This will add duplicate for all EPC and add _2 to copy"]
[]
[]
[]
[]
[]
[]
[]
[]
[]
["8.","Click on \"Create Assignment table template\". This will add new sheet with name \"IO Assignment MCM01 and fill with VFD and FIO names and their adresses"]
[]
[]
[]
[]
[]
[]
[]
[]
[]
["9.","Click on \"Assign Devices to VFD\". This will add device tags to correspond VFD IO. Works for Disc, TPE, JPE, EPC, ENC"]
[]
[]
[]
[]
[]
[]
[]
[]
["10. ","All Unassigned Pushbuttons and lights fill manually and all devices, that couldn't filled to VFD also will be here."]

{"sheet":"NETWORK","index":3,"n_rows":163,"n_cols":23,"rows_kept":163,"cut":false,"hidden":false,"merged":[[149,3,162,3],[149,4,162,4],[136,3,148,3],[136,4,148,4],[3,3,26,3],[3,4,26,4],[59,3,80,3],[59,4,80,4],[102,3,122,3],[102,4,122,4],[27,3,38,3],[27,4,38,4],[123,3,135,3],[123,4,135,4],[1,5,1,7],[120,8,121,8],[39,3,58,3],[39,4,58,4],[76,8,79,8],[123,2,135,2],[81,3,101,3],[81,4,101,4],[81,2,101,2],[1,3,1,4]]}
[null,"MCM07"]
["SLOT0","1756-L83ES","IP","RING",null,"STAR",null,null,null,null,null,null,null,null,null,null,null,null,null,"VFD",null,"HP","PART NUMBER"]
["SLOT1","1756-N2",null,"DPM","IP","VFD NAME","VFD PART NUMBER","IP",null,null,null,null,null,null,null,"UL13_8_DPM1",{"$f":"_xlfn.CONCAT(P3,\"_ENET\")","v":"UL13_8_DPM1_ENET"},"UL13_8_DPM1_ENET",null,{"$f":"_xlfn.CONCAT(U3,\"_VFD1\")","v":"UL13_1_VFD1"},"UL13_1",2,{"$f":"VLOOKUP(V3,'Part Number'!$C$1:$D$13,2,FALSE)","v":"35S-6D2-P101"}]
["SLOT2","1756-EN4TR","11.200.1.1","UL13_8_DPM1","11.200.1.2","UL13_1_VFD1","35S-6D2-P101","11.200.1.30",null,null,null,null,null,null,null,"UL15_4_DPM1",{"$f":"_xlfn.CONCAT(P4,\"_ENET\")","v":"UL15_4_DPM1_ENET"},"UL15_4_DPM1_ENET",null,{"$f":"_xlfn.CONCAT(U4,\"_VFD1\")","v":"UL13_2_VFD1"},"UL13_2",7.5,{"$f":"VLOOKUP(V4,'Part Number'!$C$1:$D$13,2,FALSE)","v":"35S-6D5-P111"}]
["SLOT3","1756-N2",null,null,null,"UL13_2_VFD1","35S-6D5-P111","11.200.1.31",null,null,null,null,null,null,null,"UL16_2_DPM1","UL16_2_DPM1_ENET","UL16_2_DPM1_ENET",null,"UL13_3_VFD1","UL13_3",3,{"$f":"VLOOKUP(V5,'Part Number'!$C$1:$D$13,2,FALSE)","v":"35S-6D3-P101"}]
["SLOT4","1756-N2",null,null,null,"UL13_3_VFD1","35S-6D3-P101","11.200.1.32",null,null,null,null,null,null,null,"UL18_4_DPM1","UL18_4_DPM1_ENET","UL18_4_DPM1_ENET",null,"UL13_4_VFD1","UL13_4",3,{"$f":"VLOOKUP(V6,'Part Number'!$C$1:$D$13,2,FALSE)","v":"35S-6D3-P101"}]
["SLOT5","1756-IB16",null,null,null,"UL13_4_VFD1","35S-6D3-P101","11.200.1.33",null,null,null,null,null,null,null,"UL19_2_DPM1","UL19_2_DPM1_ENET","UL19_2_DPM1_ENET",null,"UL13_5_VFD1","UL13_5",3,{"$f":"VLOOKUP(V7,'Part Number'!$C$1:$D$13,2,FALSE)","v":"35S-6D3-P101"}]
["SLOT6","1756-OB16E",null,null,null,"UL13_5_VFD1","35S-6D3-P101","11.200.1.34",null,null,null,null,null,null,null,"UL21_11_DPM1","UL21_11_DPM1_ENET","UL21_11_DPM1_ENET",null,"UL13_6_VFD1","UL13_6",3,{"$f":"VLOOKUP(V8,'Part Number'!$C$1:$D$13,2,FALSE)","v":"35S-6D3-P101"}]
["SLOT7","1756-IB16S",null,null,null,"UL13_6_VFD1","35S-6D3-P101","11.200.1.35",null,null,null,null,null,null,null,"PS5_7_DPM1","PS5_7_DPM1_ENET","PS5_7_DPM1_ENET",null,"UL13_7_VFD1","UL13_7",3,{"$f":"VLOOKUP(V9,'Part Number'!$C$1:$D$13,2,FALSE)","v":"35S-6D3-P101"}]
["SLOT8","1756-N2",null,null,null,"UL13_7_VFD1","35S-6D3-P101","11.200.1.36",null,null,null,null,null,null,null,"PS6_7_DPM1","PS6_7_DPM1_ENET","PS6_7_DPM1_ENET",null,"UL13_8_VFD1","UL13_8",5,{"$f":"VLOOKUP(V10,'Part Number'!$C$1:$D$13,2,FALSE)","v":"35S-6D4-P111"}]
["SLOT9","1756-N2",null,null,null,"UL13_8_VFD1","35S-6D4-P111","11.200.1.37",null,null,null,null,null,null,null,"PS7_7_DPM1","PS7_7_DPM1_ENET","PS7_7_DPM1_ENET",null,"UL13_9A_VFD1","UL13_9A",3,{"$f":"VLOOKUP(V11,'Part Number'!$C$1:$D$13,2,FALSE)","v":"35S-6D3-P101"}]
[null,null,null,null,null,"UL13_9A_VFD1","35S-6D3-P101","11.200.1.38",null,null,null,null,null,null,null,null,null,null,null,"UL13_9B_VFD1","UL13_9B",3,{"$f":"VLOOKUP(V12,'Part Number'!$C$1:$D$13,2,FALSE)","v":"35S-6D3-P101"}]
[null,null,null,null,null,"UL13_9B_VFD1","35S-6D3-P101","11.200.1.39",null,null,null,null,null,null,null,null,null,null,null,"UL13_10_VFD1","UL13_10",2,{"$f":"VLOOKUP(V13,'Part Number'!$C$1:$D$13,2,FALSE)","v":"35S-6D2-P101"}]
["DPM COUNT",9,null,null,null,"UL13_10_VFD1","35S-6D2-P101","11.200.1.40",null,null,null,null,null,null,null,null,null,null,null,"UL13_11_VFD1","UL13_11",2,{"$f":"VLOOKUP(V14,'Part Number'!$C$1:$D$13,2,FALSE)","v":"35S-6D2-P101"}]
[null,null,null,null,null,"UL13_11_VFD1","35S-6D2-P101","11.200.1.41",null,null,null,null,null,null,null,null,null,null,null,"UL13_12_VFD1","UL13_12",5,{"$f":"VLOOKUP(V15,'Part Number'!$C$1:$D$13,2,FALSE)","v":"35S-6D4-P111"}]
[null,null,null,null,null,"UL13_12_VFD1","35S-6D4-P111","11.200.1.42","add",null,null,null,null,null,null,null,null,null,null,"UL14_3_VFD1","UL14_3",5,{"$f":"VLOOKUP(V16,'Part Number'!$C$1:$D$13,2,FALSE)","v":"35S-6D4-P111"}]
[null,null,null,null,null,"UL14_1_EX1","CALJAN","11.200.1.43",null,null,null,null,null,null,null,null,null,null,null,"UL14_4_VFD1","UL14_4",5,{"$f":"VLOOKUP(V17,'Part Number'!$C$1:$D$13,2,FALSE)","v":"35S-6D4-P111"}]
[null,null,null,null,null,"UL14_3_VFD1","35S-6D4-P111","11.200.1.44",null,null,null,null,null,null,null,null,null,null,null,"UL14_5_VFD1","UL14_5",3,{"$f":"VLOOKUP(V18,'Part Number'!$C$1:$D$13,2,FALSE)","v":"35S-6D3-P101"}]
[null,null,null,null,null,"UL14_4_VFD1","35S-6D4-P111","11.200.1.45",null,null,null,null,null,null,null,null,null,null,null,"UL14_6_VFD1","UL14_6",2,{"$f":"VLOOKUP(V19,'Part Number'!$C$1:$D$13,2,FALSE)","v":"35S-6D2-P101"}]
[null,null,null,null,null,"UL14_5_VFD1","35S-6D3-P101","11.200.1.46",null,null,null,null,null,null,null,null,null,null,null,"UL14_7_VFD1","UL14_7",3,{"$f":"VLOOKUP(V20,'Part Number'!$C$1:$D$13,2,FALSE)","v":"35S-6D3-P101"}]
[null,null,null,null,null,"UL14_6_VFD1","35S-6D2-P101","11.200.1.47",null,null,null,null,null,null,null,null,null,null,null,"UL14_8_VFD1","UL14_8",3,{"$f":"VLOOKUP(V21,'Part Number'!$C$1:$D$13,2,FALSE)","v":"35S-6D3-P101"}]
[null,null,null,null,null,"UL14_7_VFD1","35S-6D3-P101","11.200.1.48",null,null,null,null,null,null,null,null,null,null,null,"UL14_9_VFD1","UL14_9",3,{"$f":"VLOOKUP(V22,'Part Number'!$C$1:$D$13,2,FALSE)","v":"35S-6D3-P101"}]
[null,null,null,null,null,"UL14_8_VFD1","35S-6D3-P101","11.200.1.49",null,null,null,null,null,null,null,null,null,null,null,"UL14_10_VFD1","UL14_10",2,{"$f":"VLOOKUP(V23,'Part Number'!$C$1:$D$13,2,FALSE)","v":"35S-6D2-P101"}]
[null,null,null,null,null,"UL14_9_VFD1","35S-6D3-P101","11.200.1.50",null,null,null,null,null,null,null,null,null,null,null,"UL15_3_VFD1","UL15_3",5,{"$f":"VLOOKUP(V24,'Part Number'!$C$1:$D$13,2,FALSE)","v":"35S-6D4-P111"}]
[null,null,null,null,null,"UL14_10_VFD1","35S-6D2-P101","11.200.1.51",null,null,null,null,null,null,null,null,null,null,null,"UL15_4_VFD1","UL15_4",5,{"$f":"VLOOKUP(V25,'Part Number'!$C$1:$D$13,2,FALSE)","v":"35S-6D4-P111"}]
[null,null,null,null,null,"UL13_2_FIO1","5032-8IOLM12DR","11.200.1.52","name change",null,null,null,null,null,null,null,null,null,null,"UL15_5_VFD1","UL15_5",2,{"$f":"VLOOKUP(V26,'Part Number'!$C$1:$D$13,2,FALSE)","v":"35S-6D2-P101"}]
[null,null,null,null,null,"UL14_3_FIO1","5032-8IOLM12DR","11.200.1.53","name change",null,null,null,null,null,null,null,null,null,null,"UL15_6_VFD1","UL15_6",3,{"$f":"VLOOKUP(V27,'Part Number'!$C$1:$D$13,2,FALSE)","v":"35S-6D3-P101"}]
[null,null,null,"UL15_4_DPM1","11.200.1.3","UL15_1_EX1","CALJAN","11.200.1.54",null,null,null,null,null,null,null,null,null,null,null,"UL15_7_VFD1","UL15_7",3,{"$f":"VLOOKUP(V28,'Part Number'!$C$1:$D$13,2,FALSE)","v":"35S-6D3-P101"}]
[null,null,null,null,null,"UL15_3_VFD1","35S-6D4-P111","11.200.1.55",null,null,null,null,null,null,null,null,null,null,null,"UL15_8_VFD1","UL15_8",3,{"$f":"VLOOKUP(V29,'Part Number'!$C$1:$D$13,2,FALSE)","v":"35S-6D3-P101"}]
[null,null,null,null,null,"UL15_4_VFD1","35S-6D4-P111","11.200.1.56",null,null,null,null,null,null,null,null,null,null,null,"UL15_9_VFD1","UL15_9",3,{"$f":"VLOOKUP(V30,'Part Number'!$C$1:$D$13,2,FALSE)","v":"35S-6D3-P101"}]
[null,null,null,null,null,"UL15_5_VFD1","35S-6D2-P101","11.200.1.57",null,null,null,null,null,null,null,null,null,null,null,"UL15_10_VFD1","UL15_10",3,{"$f":"VLOOKUP(V31,'Part Number'!$C$1:$D$13,2,FALSE)","v":"35S-6D3-P101"}]
[null,null,null,null,null,"UL15_6_VFD1","35S-6D3-P101","11.200.1.58",null,null,null,null,null,null,null,null,null,null,null,"UL15_11_VFD1","UL15_11",2,{"$f":"VLOOKUP(V32,'Part Number'!$C$1:$D$13,2,FALSE)","v":"35S-6D2-P101"}]
[null,null,null,null,null,"UL15_7_VFD1","35S-6D3-P101","11.200.1.59",null,null,null,null,null,null,null,null,null,null,null,"UL16_1_VFD1","UL16_1",2,{"$f":"VLOOKUP(V33,'Part Number'!$C$1:$D$13,2,FALSE)","v":"35S-6D2-P101"}]
[null,null,null,null,null,"UL15_8_VFD1","35S-6D3-P101","11.200.1.60",null,null,null,null,null,null,null,null,null,null,null,"UL16_2_VFD1","UL16_2",7.5,{"$f":"VLOOKUP(V34,'Part Number'!$C$1:$D$13,2,FALSE)","v":"35S-6D5-P111"}]
[null,null,null,null,null,"UL15_9_VFD1","35S-6D3-P101","11.200.1.61",null,null,null,null,null,null,null,null,null,null,null,"UL16_3_VFD1","UL16_3",3,{"$f":"VLOOKUP(V35,'Part Number'!$C$1:$D$13,2,FALSE)","v":"35S-6D3-P101"}]
[null,null,null,null,null,"UL15_10_VFD1","35S-6D3-P101","11.200.1.62",null,null,null,null,null,null,null,null,null,null,null,"UL16_4_VFD1","UL16_4",3,{"$f":"VLOOKUP(V36,'Part Number'!$C$1:$D$13,2,FALSE)","v":"35S-6D3-P101"}]
[null,null,null,null,null,"UL15_11_VFD1","35S-6D2-P101","11.200.1.63",null,null,null,null,null,null,null,null,null,null,null,"UL16_5_VFD1","UL16_5",2,{"$f":"VLOOKUP(V37,'Part Number'!$C$1:$D$13,2,FALSE)","v":"35S-6D2-P101"}]
[null,null,null,null,null,"UL15_3_FIO1","5032-8IOLM12DR","11.200.1.64","name change",null,null,null,null,null,null,null,null,null,null,"UL16_6_VFD1","UL16_6",3,{"$f":"VLOOKUP(V38,'Part Number'!$C$1:$D$13,2,FALSE)","v":"35S-6D3-P101"}]
[null,null,null,null,null,"UL13_12_FIO1","5032-8IOLM12DR","11.200.1.196","ADDED 5-26",null,null,null,null,null,null,null,null,null,null,"UL16_7_VFD1","UL16_7",3,{"$f":"VLOOKUP(V39,'Part Number'!$C$1:$D$13,2,FALSE)","v":"35S-6D3-P101"}]
[null,null,null,"UL16_2_DPM1","11.200.1.4","UL16_1_VFD1","35S-6D2-P101","11.200.1.65",null,null,null,null,null,null,null,null,null,null,null,"UL16_8_VFD1","UL16_8",3,{"$f":"VLOOKUP(V40,'Part Number'!$C$1:$D$13,2,FALSE)","v":"35S-6D3-P101"}]
[null,null,null,null,null,"UL16_2_VFD1","35S-6D5-P111","11.200.1.66",null,null,null,null,null,null,null,null,null,null,null,"UL16_9_VFD1","UL16_9",2,{"$f":"VLOOKUP(V41,'Part Number'!$C$1:$D$13,2,FALSE)","v":"35S-6D2-P101"}]
[null,null,null,null,null,"UL16_3_VFD1","35S-6D3-P101","11.200.1.67","add",null,null,null,null,null,null,null,null,null,null,"UL17_3_VFD1","UL17_3",5,{"$f":"VLOOKUP(V42,'Part Number'!$C$1:$D$13,2,FALSE)","v":"35S-6D4-P111"}]
[null,null,null,null,null,"UL16_4_VFD1","35S-6D3-P101","11.200.1.68",null,null,null,null,null,null,null,null,null,null,null,"UL17_4_VFD1","UL17_4",5,{"$f":"VLOOKUP(V43,'Part Number'!$C$1:$D$13,2,FALSE)","v":"35S-6D4-P111"}]
[null,null,null,null,null,"UL16_5_VFD1","35S-6D2-P101","11.200.1.69",null,null,null,null,null,null,null,null,null,null,null,"UL17_5_VFD1","UL17_5",3,{"$f":"VLOOKUP(V44,'Part Number'!$C$1:$D$13,2,FALSE)","v":"35S-6D3-P101"}]
[null,null,null,null,null,"UL16_6_VFD1","35S-6D3-P101","11.200.1.70",null,null,null,null,null,null,null,null,null,null,null,"UL17_6_VFD1","UL17_6",2,{"$f":"VLOOKUP(V45,'Part Number'!$C$1:$D$13,2,FALSE)","v":"35S-6D2-P101"}]
[null,null,null,null,null,"UL16_7_VFD1","35S-6D3-P101","11.200.1.71",null,null,null,null,null,null,null,null,null,null,null,"UL17_7_VFD1","UL17_7",3,{"$f":"VLOOKUP(V46,'Part Number'!$C$1:$D$13,2,FALSE)","v":"35S-6D3-P101"}]
[null,null,null,null,null,"UL16_8_VFD1","35S-6D3-P101","11.200.1.72",null,null,null,null,null,null,null,null,null,null,null,"UL17_8_VFD1","UL17_8",3,{"$f":"VLOOKUP(V47,'Part Number'!$C$1:$D$13,2,FALSE)","v":"35S-6D3-P101"}]
[null,null,null,null,null,"UL16_9_VFD1","35S-6D2-P101","11.200.1.73",null,null,null,null,null,null,null,null,null,null,null,"UL17_9_VFD1","UL17_9",3,{"$f":"VLOOKUP(V48,'Part Number'!$C$1:$D$13,2,FALSE)","v":"35S-6D3-P101"}]
[null,null,null,null,null,"UL17_1_EX1","CALJAN","11.200.1.74",null,null,null,null,null,null,null,null,null,null,null,"UL17_10_VFD1","UL17_10",2,{"$f":"VLOOKUP(V49,'Part Number'!$C$1:$D$13,2,FALSE)","v":"35S-6D2-P101"}]
[null,null,null,null,null,"UL17_3_VFD1","35S-6D4-P111","11.200.1.75",null,null,null,null,null,null,null,null,null,null,null,"UL18_3_VFD1","UL18_3",5,{"$f":"VLOOKUP(V50,'Part Number'!$C$1:$D$13,2,FALSE)","v":"35S-6D4-P111"}]
[null,null,null,null,null,"UL17_4_VFD1","35S-6D4-P111","11.200.1.76",null,null,null,null,null,null,null,null,null,null,null,"UL18_4_VFD1","UL18_4",5,{"$f":"VLOOKUP(V51,'Part Number'!$C$1:$D$13,2,FALSE)","v":"35S-6D4-P111"}]
[null,null,null,null,null,"UL17_5_VFD1","35S-6D3-P101","11.200.1.77",null,null,null,null,null,null,null,null,null,null,null,"UL18_5_VFD1","UL18_5",3,{"$f":"VLOOKUP(V52,'Part Number'!$C$1:$D$13,2,FALSE)","v":"35S-6D3-P101"}]
[null,null,null,null,null,"UL17_6_VFD1","35S-6D2-P101","11.200.1.78",null,null,null,null,null,null,null,null,null,null,null,"UL18_6_VFD1","UL18_6",5,{"$f":"VLOOKUP(V53,'Part Number'!$C$1:$D$13,2,FALSE)","v":"35S-6D4-P111"}]
[null,null,null,null,null,"UL17_7_VFD1","35S-6D3-P101","11.200.1.79",null,null,null,null,null,null,null,null,null,null,null,"UL18_7_VFD1","UL18_7",3,{"$f":"VLOOKUP(V54,'Part Number'!$C$1:$D$13,2,FALSE)","v":"35S-6D3-P101"}]
[null,null,null,null,null,"UL17_8_VFD1","35S-6D3-P101","11.200.1.80",null,null,null,null,null,null,null,null,null,null,null,"UL18_8_VFD1","UL18_8",3,{"$f":"VLOOKUP(V55,'Part Number'!$C$1:$D$13,2,FALSE)","v":"35S-6D3-P101"}]
[null,null,null,null,null,"UL17_9_VFD1","35S-6D3-P101","11.200.1.81",null,null,null,null,null,null,null,null,null,null,null,"UL18_9_VFD1","UL18_9",3,{"$f":"VLOOKUP(V56,'Part Number'!$C$1:$D$13,2,FALSE)","v":"35S-6D3-P101"}]
[null,null,null,null,null,"UL17_10_VFD1","35S-6D2-P101","11.200.1.82",null,null,null,null,null,null,null,null,null,null,null,"UL18_10_VFD1","UL18_10",5,{"$f":"VLOOKUP(V57,'Part Number'!$C$1:$D$13,2,FALSE)","v":"35S-6D4-P111"}]
[null,null,null,null,null,"UL16_2_FIO1","5032-8IOLM12DR","11.200.1.83","name change",null,null,null,null,null,null,null,null,null,null,"UL18_11_VFD1","UL18_11",5,{"$f":"VLOOKUP(V58,'Part Number'!$C$1:$D$13,2,FALSE)","v":"35S-6D4-P111"}]
[null,null,null,null,null,"UL17_3_FIO1","5032-8IOLM12DR","11.200.1.84","name change",null,null,null,null,null,null,null,null,null,null,"UL18_12_VFD1","UL18_12",3,{"$f":"VLOOKUP(V59,'Part Number'!$C$1:$D$13,2,FALSE)","v":"35S-6D3-P101"}]
[null,null,null,"UL18_4_DPM1","11.200.1.5","UL18_1_EX1","CALJAN","11.200.1.85",null,null,null,null,null,null,null,null,null,null,null,"UL18_13A_VFD1","UL18_13A",3,{"$f":"VLOOKUP(V60,'Part Number'!$C$1:$D$13,2,FALSE)","v":"35S-6D3-P101"}]
[null,null,null,null,null,"UL18_3_VFD1","35S-6D4-P111","11.200.1.86",null,null,null,null,null,null,null,null,null,null,null,"UL18_13B_VFD1","UL18_13B",3,{"$f":"VLOOKUP(V61,'Part Number'!$C$1:$D$13,2,FALSE)","v":"35S-6D3-P101"}]
[null,null,null,null,null,"UL18_4_VFD1","35S-6D4-P111","11.200.1.87",null,null,null,null,null,null,null,null,null,null,null,"UL18_14_VFD1","UL18_14",2,{"$f":"VLOOKUP(V62,'Part Number'!$C$1:$D$13,2,FALSE)","v":"35S-6D2-P101"}]
[null,null,null,null,null,"UL18_5_VFD1","35S-6D3-P101","11.200.1.88",null,null,null,null,null,null,null,null,null,null,null,"UL18_15_VFD1","UL18_15",2,{"$f":"VLOOKUP(V63,'Part Number'!$C$1:$D$13,2,FALSE)","v":"35S-6D2-P101"}]
[null,null,null,null,null,"UL18_6_VFD1","35S-6D4-P111","11.200.1.89",null,null,null,null,null,null,null,null,null,null,null,"UL18_16_VFD1","UL18_16",5,{"$f":"VLOOKUP(V64,'Part Number'!$C$1:$D$13,2,FALSE)","v":"35S-6D4-P111"}]
[null,null,null,null,null,"UL18_7_VFD1","35S-6D3-P101","11.200.1.90",null,null,null,null,null,null,null,null,null,null,null,"UL13_8_DPM1_VFD1","UL13_8_DPM1","DPM",{"$f":"VLOOKUP(V65,'Part Number'!$C$1:$D$13,2,FALSE)","v":{"$error":"#N/A"}}]
[null,null,null,null,null,"UL18_8_VFD1","35S-6D3-P101","11.200.1.91",null,null,null,null,null,null,null,null,null,null,null,"UL15_4_DPM1_VFD1","UL15_4_DPM1","DPM",{"$f":"VLOOKUP(V66,'Part Number'!$C$1:$D$13,2,FALSE)","v":{"$error":"#N/A"}}]
[null,null,null,null,null,"UL18_9_VFD1","35S-6D3-P101","11.200.1.92",null,null,null,null,null,null,null,null,null,null,null,"UL16_2_DPM1_VFD1","UL16_2_DPM1","DPM",{"$f":"VLOOKUP(V67,'Part Number'!$C$1:$D$13,2,FALSE)","v":{"$error":"#N/A"}}]
[null,null,null,null,null,"UL18_10_VFD1","35S-6D4-P111","11.200.1.93",null,null,null,null,null,null,null,null,null,null,null,"UL18_4_DPM1_VFD1","UL18_4_DPM1","DPM",{"$f":"VLOOKUP(V68,'Part Number'!$C$1:$D$13,2,FALSE)","v":{"$error":"#N/A"}}]
[null,null,null,null,null,"UL18_11_VFD1","35S-6D4-P111","11.200.1.94",null,null,null,null,null,null,null,null,null,null,null,{"$f":"_xlfn.CONCAT(U69,\"_VFD1\")","v":"UL19_1_VFD1"},"UL19_1",2,{"$f":"VLOOKUP(V69,'Part Number'!$C$1:$D$13,2,FALSE)","v":"35S-6D2-P101"}]
[null,null,null,null,null,"UL18_12_VFD1","35S-6D3-P101","11.200.1.95",null,null,null,null,null,null,null,null,null,null,null,"UL19_2_VFD1","UL19_2",7.5,{"$f":"VLOOKUP(V70,'Part Number'!$C$1:$D$13,2,FALSE)","v":"35S-6D5-P111"}]
[null,null,null,null,null,"UL18_13A_VFD1","35S-6D3-P101","11.200.1.96",null,null,null,null,null,null,null,null,null,null,null,"UL19_3_VFD1","UL19_3",2,{"$f":"VLOOKUP(V71,'Part Number'!$C$1:$D$13,2,FALSE)","v":"35S-6D2-P101"}]
[null,null,null,null,null,"UL18_13B_VFD1","35S-6D3-P101","11.200.1.97",null,null,null,null,null,null,null,null,null,null,null,"UL19_4_VFD1","UL19_4",2,{"$f":"VLOOKUP(V72,'Part Number'!$C$1:$D$13,2,FALSE)","v":"35S-6D2-P101"}]
[null,null,null,null,null,"UL18_14_VFD1","35S-6D2-P101","11.200.1.98",null,null,null,null,null,null,null,null,null,null,null,"UL19_5_VFD1","UL19_5",3,{"$f":"VLOOKUP(V73,'Part Number'!$C$1:$D$13,2,FALSE)","v":"35S-6D3-P101"}]
[null,null,null,null,null,"UL18_15_VFD1","35S-6D2-P101","11.200.1.99",null,null,null,null,null,null,null,null,null,null,null,"UL19_6_VFD1","UL19_6",3,{"$f":"VLOOKUP(V74,'Part Number'!$C$1:$D$13,2,FALSE)","v":"35S-6D3-P101"}]
[null,null,null,null,null,"UL18_16_VFD1","35S-6D4-P111","11.200.1.100",null,null,null,null,null,null,null,null,null,null,null,"UL19_7_VFD1","UL19_7",3,{"$f":"VLOOKUP(V75,'Part Number'!$C$1:$D$13,2,FALSE)","v":"35S-6D3-P101"}]
[null,null,null,null,null,"UL18_3_FIO1","5032-8IOLM12DR","11.200.1.101","name change",null,null,null,null,null,null,null,null,null,null,"UL19_8_VFD1","UL19_8",3,{"$f":"VLOOKUP(V76,'Part Number'!$C$1:$D$13,2,FALSE)","v":"35S-6D3-P101"}]
[null,null,null,null,null,"PDP3_FIO1","5032-8IOLM12DR","11.200.1.190","NEWLY ADDED",null,null,null,null,null,null,null,null,null,null,"UL19_9_VFD1","UL19_9",2,{"$f":"VLOOKUP(V77,'Part Number'!$C$1:$D$13,2,FALSE)","v":"35S-6D2-P101"}]
[null,null,null,null,null,"PDP3_PMM1","1420-V2-ENT","11.200.1.191",null,null,null,null,null,null,null,null,null,null,null,"UL20_3_VFD1","UL20_3",5,{"$f":"VLOOKUP(V78,'Part Number'!$C$1:$D$13,2,FALSE)","v":"35S-6D4-P111"}]
[null,null,null,null,null,"PDP4_FIO1","5032-8IOLM12DR","11.200.1.192",null,null,null,null,null,null,null,null,null,null,null,"UL20_4_VFD1","UL20_4",5,{"$f":"VLOOKUP(V79,'Part Number'!$C$1:$D$13,2,FALSE)","v":"35S-6D4-P111"}]
[null,null,null,null,null,"PDP4_PMM1","1420-V2-ENT","11.200.1.193",null,null,null,null,null,null,null,null,null,null,null,"UL20_5_VFD1","UL20_5",2,{"$f":"VLOOKUP(V80,'Part Number'!$C$1:$D$13,2,FALSE)","v":"35S-6D2-P101"}]
[null,null,null,null,null,"UL18_16_FIO1","5032-8IOLM12DR","11.200.1.197","ADDED 5-26",null,null,null,null,null,null,null,null,null,null,"UL20_6_VFD1","UL20_6",2,{"$f":"VLOOKUP(V81,'Part Number'!$C$1:$D$13,2,FALSE)","v":"35S-6D2-P101"}]
[null,null,"Merged Cells 5-27","UL19_2_DPM1","11.200.1.6","UL19_1_VFD1","35S-6D2-P101","11.200.1.102",null,null,null,null,null,null,null,null,null,null,null,"UL20_7_VFD1","UL20_7",3,{"$f":"VLOOKUP(V82,'Part Number'!$C$1:$D$13,2,FALSE)","v":"35S-6D3-P101"}]
[null,null,null,null,null,"UL19_2_VFD1","35S-6D5-P111","11.200.1.103",null,null,null,null,null,null,null,null,null,null,null,"UL20_8_VFD1","UL20_8",3,{"$f":"VLOOKUP(V83,'Part Number'!$C$1:$D$13,2,FALSE)","v":"35S-6D3-P101"}]
[null,null,null,null,null,"UL19_3_VFD1","35S-6D2-P101","11.200.1.104",null,null,null,null,null,null,null,null,null,null,null,"UL20_9_VFD1","UL20_9",3,{"$f":"VLOOKUP(V84,'Part Number'!$C$1:$D$13,2,FALSE)","v":"35S-6D3-P101"}]
[null,null,null,null,null,"UL19_4_VFD1","35S-6D2-P101","11.200.1.105",null,null,null,null,null,null,null,null,null,null,null,"UL20_10_VFD1","UL20_10",3,{"$f":"VLOOKUP(V85,'Part Number'!$C$1:$D$13,2,FALSE)","v":"35S-6D3-P101"}]
[null,null,null,null,null,"UL19_5_VFD1","35S-6D3-P101","11.200.1.106",null,null,null,null,null,null,null,null,null,null,null,"UL20_11_VFD1","UL20_11",2,{"$f":"VLOOKUP(V86,'Part Number'!$C$1:$D$13,2,FALSE)","v":"35S-6D2-P101"}]
[null,null,null,null,null,"UL19_6_VFD1","35S-6D3-P101","11.200.1.107",null,null,null,null,null,null,null,null,null,null,null,"UL21_3_VFD1","UL21_3",5,{"$f":"VLOOKUP(V87,'Part Number'!$C$1:$D$13,2,FALSE)","v":"35S-6D4-P111"}]
[null,null,null,null,null,"UL19_7_VFD1","35S-6D3-P101","11.200.1.108",null,null,null,null,null,null,null,null,null,null,null,"UL21_4_VFD1","UL21_4",5,{"$f":"VLOOKUP(V88,'Part Number'!$C$1:$D$13,2,FALSE)","v":"35S-6D4-P111"}]
[null,null,null,null,null,"UL19_8_VFD1","35S-6D3-P101","11.200.1.109",null,null,null,null,null,null,null,null,null,null,null,"UL21_5_VFD1","UL21_5",5,{"$f":"VLOOKUP(V89,'Part Number'!$C$1:$D$13,2,FALSE)","v":"35S-6D4-P111"}]
[null,null,null,null,null,"UL19_9_VFD1","35S-6D2-P101","11.200.1.110",null,null,null,null,null,null,null,null,null,null,null,"UL21_6_VFD1","UL21_6",3,{"$f":"VLOOKUP(V90,'Part Number'!$C$1:$D$13,2,FALSE)","v":"35S-6D3-P101"}]
[null,null,null,null,null,"UL20_1_EX1","CALJAN","11.200.1.111",null,null,null,null,null,null,null,null,null,null,null,"UL21_7_VFD1","UL21_7",3,{"$f":"VLOOKUP(V91,'Part Number'!$C$1:$D$13,2,FALSE)","v":"35S-6D3-P101"}]
[null,null,null,null,null,"UL20_3_VFD1","35S-6D4-P111","11.200.1.112",null,null,null,null,null,null,null,null,null,null,null,"UL21_8_VFD1","UL21_8",3,{"$f":"VLOOKUP(V92,'Part Number'!$C$1:$D$13,2,FALSE)","v":"35S-6D3-P101"}]
[null,null,null,null,null,"UL20_4_VFD1","35S-6D4-P111","11.200.1.113",null,null,null,null,null,null,null,null,null,null,null,"UL21_9_VFD1","UL21_9",3,{"$f":"VLOOKUP(V93,'Part Number'!$C$1:$D$13,2,FALSE)","v":"35S-6D3-P101"}]
[null,null,null,null,null,"UL20_5_VFD1","35S-6D2-P101","11.200.1.114",null,null,null,null,null,null,null,null,null,null,null,"UL21_10_VFD1","UL21_10",3,{"$f":"VLOOKUP(V94,'Part Number'!$C$1:$D$13,2,FALSE)","v":"35S-6D3-P101"}]
[null,null,null,null,null,"UL20_6_VFD1","35S-6D2-P101","11.200.1.115",null,null,null,null,null,null,null,null,null,null,null,"UL21_11_VFD1","UL21_11",7.5,{"$f":"VLOOKUP(V95,'Part Number'!$C$1:$D$13,2,FALSE)","v":"35S-6D5-P111"}]
[null,null,null,null,null,"UL20_7_VFD1","35S-6D3-P101","11.200.1.116",null,null,null,null,null,null,null,null,null,null,null,"UL21_12_VFD1","UL21_12",5,{"$f":"VLOOKUP(V96,'Part Number'!$C$1:$D$13,2,FALSE)","v":"35S-6D4-P111"}]
[null,null,null,null,null,"UL20_8_VFD1","35S-6D3-P101","11.200.1.117",null,null,null,null,null,null,null,null,null,null,null,"UL21_13_VFD1","UL21_13",2,{"$f":"VLOOKUP(V97,'Part Number'!$C$1:$D$13,2,FALSE)","v":"35S-6D2-P101"}]
[null,null,null,null,null,"UL20_9_VFD1","35S-6D3-P101","11.200.1.118",null,null,null,null,null,null,null,null,null,null,null,"UL21_14A_VFD1","UL21_14A",3,{"$f":"VLOOKUP(V98,'Part Number'!$C$1:$D$13,2,FALSE)","v":"35S-6D3-P101"}]
[null,null,null,null,null,"UL20_10_VFD1","35S-6D3-P101","11.200.1.119","add",null,null,null,null,null,null,null,null,null,null,"UL21_14B_VFD1","UL21_14B",3,{"$f":"VLOOKUP(V99,'Part Number'!$C$1:$D$13,2,FALSE)","v":"35S-6D3-P101"}]
[null,null,null,null,null,"UL20_11_VFD1","35S-6D2-P101","11.200.1.120","add",null,null,null,null,null,null,null,null,null,null,"UL21_15_VFD1","UL21_15",2,{"$f":"VLOOKUP(V100,'Part Number'!$C$1:$D$13,2,FALSE)","v":"35S-6D2-P101"}]
[null,null,null,null,null,"UL19_2_FIO1","5032-8IOLM12DR","11.200.1.121","name change",null,null,null,null,null,null,null,null,null,null,"UL21_16_VFD1","UL21_16",2,{"$f":"VLOOKUP(V101,'Part Number'!$C$1:$D$13,2,FALSE)","v":"35S-6D2-P101"}]
[null,null,null,null,null,"UL20_3_FIO1","5032-8IOLM12DR","11.200.1.122","name change",null,null,null,null,null,null,null,null,null,null,"UL21_17_VFD1","UL21_17",5,{"$f":"VLOOKUP(V102,'Part Number'!$C$1:$D$13,2,FALSE)","v":"35S-6D4-P111"}]
[null,null,null,"UL21_11_DPM1","11.200.1.7","UL21_1_EX1","CALJAN","11.200.1.123",null,null,null,null,null,null,null,null,null,null,null,{"$f":"_xlfn.CONCAT(U103,\"_EX1\")","v":"UL14_1_EX1"},"UL14_1","EXTENDO",{"$f":"VLOOKUP(V103,'Part Number'!$C$1:$D$13,2,FALSE)","v":"CALJAN"}]
[null,null,null,null,null,"UL21_3_VFD1","35S-6D4-P111","11.200.1.124",null,null,null,null,null,null,null,null,null,null,null,"UL15_1_EX1","UL15_1","EXTENDO",{"$f":"VLOOKUP(V104,'Part Number'!$C$1:$D$13,2,FALSE)","v":"CALJAN"}]
[null,null,null,null,null,"UL21_4_VFD1","35S-6D4-P111","11.200.1.125",null,null,null,null,null,null,null,null,null,null,null,"UL17_1_EX1","UL17_1","EXTENDO",{"$f":"VLOOKUP(V105,'Part Number'!$C$1:$D$13,2,FALSE)","v":"CALJAN"}]
[null,null,null,null,null,"UL21_5_VFD1","35S-6D4-P111","11.200.1.126",null,null,null,null,null,null,null,null,null,null,null,"UL18_1_EX1","UL18_1","EXTENDO",{"$f":"VLOOKUP(V106,'Part Number'!$C$1:$D$13,2,FALSE)","v":"CALJAN"}]
[null,null,null,null,null,"UL21_6_VFD1","35S-6D3-P101","11.200.1.127",null,null,null,null,null,null,null,null,null,null,null,"UL20_1_EX1","UL20_1","EXTENDO",{"$f":"VLOOKUP(V107,'Part Number'!$C$1:$D$13,2,FALSE)","v":"CALJAN"}]
[null,null,null,null,null,"UL21_7_VFD1","35S-6D3-P101","11.200.1.128",null,null,null,null,null,null,null,null,null,null,null,"UL21_1_EX1","UL21_1","EXTENDO",{"$f":"VLOOKUP(V108,'Part Number'!$C$1:$D$13,2,FALSE)","v":"CALJAN"}]
[null,null,null,null,null,"UL21_8_VFD1","35S-6D3-P101","11.200.1.129",null,null,null,null,null,null,null,null,null,null,null,"UL19_2_DPM1_VFD1","UL19_2_DPM1","DPM",{"$f":"VLOOKUP(V109,'Part Number'!$C$1:$D$13,2,FALSE)","v":{"$error":"#N/A"}}]
[null,null,null,null,null,"UL21_9_VFD1","35S-6D3-P101","11.200.1.130",null,null,null,null,null,null,null,null,null,null,null,"UL21_11_DPM1_VFD1","UL21_11_DPM1","DPM",{"$f":"VLOOKUP(V110,'Part Number'!$C$1:$D$13,2,FALSE)","v":{"$error":"#N/A"}}]
[null,null,null,null,null,"UL21_10_VFD1","35S-6D3-P101","11.200.1.131",null,null,null,null,null,null,null,null,null,null,null,"PS5_1_VFD1","PS5_1",2,{"$f":"VLOOKUP(V111,'Part Number'!$C$1:$D$13,2,FALSE)","v":"35S-6D2-P101"}]
[null,null,null,null,null,"UL21_11_VFD1","35S-6D5-P111","11.200.1.132",null,null,null,null,null,null,null,null,null,null,null,"PS5_2_VFD1","PS5_2",3,{"$f":"VLOOKUP(V112,'Part Number'!$C$1:$D$13,2,FALSE)","v":"35S-6D3-P101"}]
[null,null,null,null,null,"UL21_12_VFD1","35S-6D4-P111","11.200.1.133",null,null,null,null,null,null,null,null,null,null,null,"PS5_3_VFD1","PS5_3",2,{"$f":"VLOOKUP(V113,'Part Number'!$C$1:$D$13,2,FALSE)","v":"35S-6D2-P101"}]
[null,null,null,null,null,"UL21_13_VFD1","35S-6D2-P101","11.200.1.134",null,null,null,null,null,null,null,null,null,null,null,"PS5_4_VFD1","PS5_4",3,{"$f":"VLOOKUP(V114,'Part Number'!$C$1:$D$13,2,FALSE)","v":"35S-6D3-P101"}]
[null,null,null,null,null,"UL21_14A_VFD1","35S-6D3-P101","11.200.1.135",null,null,null,null,null,null,null,null,null,null,null,"PS5_5_VFD1","PS5_5",5,{"$f":"VLOOKUP(V115,'Part Number'!$C$1:$D$13,2,FALSE)","v":"35S-6D4-P111"}]
[null,null,null,null,null,"UL21_14B_VFD1","35S-6D3-P101","11.200.1.136",null,null,null,null,null,null,null,null,null,null,null,"PS5_6_VFD1","PS5_6",5,{"$f":"VLOOKUP(V116,'Part Number'!$C$1:$D$13,2,FALSE)","v":"35S-6D4-P111"}]
[null,null,null,null,null,"UL21_15_VFD1","35S-6D2-P101","11.200.1.137",null,null,null,null,null,null,null,null,null,null,null,"PS5_7_VFD1","PS5_7",10,{"$f":"VLOOKUP(V117,'Part Number'!$C$1:$D$13,2,FALSE)","v":"35S-6D6-P111"}]
[null,null,null,null,null,"UL21_16_VFD1","35S-6D2-P101","11.200.1.138",null,null,null,null,null,null,null,null,null,null,null,"PS5_8_VFD1","PS5_8",5,{"$f":"VLOOKUP(V118,'Part Number'!$C$1:$D$13,2,FALSE)","v":"35S-6D4-P111"}]
[null,null,null,null,null,"UL21_17_VFD1","35S-6D4-P111","11.200.1.139",null,null,null,null,null,null,null,null,null,null,null,"PS5_9_VFD1","PS5_9",3,{"$f":"VLOOKUP(V119,'Part Number'!$C$1:$D$13,2,FALSE)","v":"35S-6D3-P101"}]
[null,null,null,null,null,"UL21_3_FIO1","5032-8IOLM12DR","11.200.1.140","name change",null,null,null,null,null,null,null,null,null,null,"PS5_10_VFD1","PS5_10",10,{"$f":"VLOOKUP(V120,'Part Number'!$C$1:$D$13,2,FALSE)","v":"35S-6D6-P111"}]
[null,null,null,null,null,"PDP7_FIO1","5032-8IOLM12DR","11.200.1.194","NEWLY ADDED",null,null,null,null,null,null,null,null,null,null,"PS5_11_VFD1","PS5_11",2,{"$f":"VLOOKUP(V121,'Part Number'!$C$1:$D$13,2,FALSE)","v":"35S-6D2-P101"}]
[null,null,null,null,null,"PDP7_PMM1","1420-V2-ENT","11.200.1.195",null,null,null,null,null,null,null,null,null,null,null,"PS5_12_VFD1","PS5_12",10,{"$f":"VLOOKUP(V122,'Part Number'!$C$1:$D$13,2,FALSE)","v":"35S-6D6-P111"}]
[null,null,null,null,null,"UL21_17_FIO1","5032-8IOLM12DR","11.200.1.198","5-26 ADDED",null,null,null,null,null,null,null,null,null,null,"PS5_13_VFD1","PS5_13",3,{"$f":"VLOOKUP(V123,'Part Number'!$C$1:$D$13,2,FALSE)","v":"35S-6D3-P101"}]
[null,null,"Merged Cells 5-27","PS5_7_DPM1","11.200.1.8","PS5_1_VFD1","35S-6D2-P101","11.200.1.141",null,null,null,null,null,null,null,null,null,null,null,"PS6_1_VFD1","PS6_1",2,{"$f":"VLOOKUP(V124,'Part Number'!$C$1:$D$13,2,FALSE)","v":"35S-6D2-P101"}]
[null,null,null,null,null,"PS5_2_VFD1","35S-6D3-P101","11.200.1.142",null,null,null,null,null,null,null,null,null,null,null,"PS6_2_VFD1","PS6_2",3,{"$f":"VLOOKUP(V125,'Part Number'!$C$1:$D$13,2,FALSE)","v":"35S-6D3-P101"}]
[null,null,null,null,null,"PS5_3_VFD1","35S-6D2-P101","11.200.1.143",null,null,null,null,null,null,null,null,null,null,null,"PS6_3_VFD1","PS6_3",2,{"$f":"VLOOKUP(V126,'Part Number'!$C$1:$D$13,2,FALSE)","v":"35S-6D2-P101"}]
[null,null,null,null,null,"PS5_4_VFD1","35S-6D3-P101","11.200.1.144",null,null,null,null,null,null,null,null,null,null,null,"PS6_4_VFD1","PS6_4",3,{"$f":"VLOOKUP(V127,'Part Number'!$C$1:$D$13,2,FALSE)","v":"35S-6D3-P101"}]
[null,null,null,null,null,"PS5_5_VFD1","35S-6D4-P111","11.200.1.145",null,null,null,null,null,null,null,null,null,null,null,"PS6_5_VFD1","PS6_5",5,{"$f":"VLOOKUP(V128,'Part Number'!$C$1:$D$13,2,FALSE)","v":"35S-6D4-P111"}]
[null,null,null,null,null,"PS5_6_VFD1","35S-6D4-P111","11.200.1.146",null,null,null,null,null,null,null,null,null,null,null,"PS6_6_VFD1","PS6_6",5,{"$f":"VLOOKUP(V129,'Part Number'!$C$1:$D$13,2,FALSE)","v":"35S-6D4-P111"}]
[null,null,null,null,null,"PS5_7_VFD1","35S-6D6-P111","11.200.1.147",null,null,null,null,null,null,null,null,null,null,null,"PS6_7_VFD1","PS6_7",7.5,{"$f":"VLOOKUP(V130,'Part Number'!$C$1:$D$13,2,FALSE)","v":"35S-6D5-P111"}]
[null,null,null,null,null,"PS5_8_VFD1","35S-6D4-P111","11.200.1.148",null,null,null,null,null,null,null,null,null,null,null,"PS6_8_VFD1","PS6_8",5,{"$f":"VLOOKUP(V131,'Part Number'!$C$1:$D$13,2,FALSE)","v":"35S-6D4-P111"}]
[null,null,null,null,null,"PS5_9_VFD1","35S-6D3-P101","11.200.1.149",null,null,null,null,null,null,null,null,null,null,null,"PS6_9_VFD1","PS6_9",3,{"$f":"VLOOKUP(V132,'Part Number'!$C$1:$D$13,2,FALSE)","v":"35S-6D3-P101"}]
[null,null,null,null,null,"PS5_10_VFD1","35S-6D6-P111","11.200.1.150",null,null,null,null,null,null,null,null,null,null,null,{"$f":"_xlfn.CONCAT(U133,\"_VFD1\")","v":"PS6_10_VFD1"},"PS6_10",10,{"$f":"VLOOKUP(V133,'Part Number'!$C$1:$D$13,2,FALSE)","v":"35S-6D6-P111"}]
[null,null,null,null,null,"PS5_11_VFD1","35S-6D2-P101","11.200.1.151",null,null,null,null,null,null,null,null,null,null,null,"PS6_11_VFD1","PS6_11",3,{"$f":"VLOOKUP(V134,'Part Number'!$C$1:$D$13,2,FALSE)","v":"35S-6D3-P101"}]
[null,null,null,null,null,"PS5_12_VFD1","35S-6D6-P111","11.200.1.152",null,null,null,null,null,null,null,null,null,null,null,"PS6_12_VFD1","PS6_12",10,{"$f":"VLOOKUP(V135,'Part Number'!$C$1:$D$13,2,FALSE)","v":"35S-6D6-P111"}]
[null,null,null,null,null,"PS5_13_VFD1","35S-6D3-P101","11.200.1.153",null,null,null,null,null,null,null,null,null,null,null,"PS6_13_VFD1","PS6_13",3,{"$f":"VLOOKUP(V136,'Part Number'!$C$1:$D$13,2,FALSE)","v":"35S-6D3-P101"}]
[null,null,null,"PS6_7_DPM1","11.200.1.9","PS6_1_VFD1","35S-6D2-P101","11.200.1.154",null,null,null,null,null,null,null,null,null,null,null,"PS7_1_VFD1","PS7_1",2,{"$f":"VLOOKUP(V137,'Part Number'!$C$1:$D$13,2,FALSE)","v":"35S-6D2-P101"}]
[null,null,null,null,null,"PS6_2_VFD1","35S-6D3-P101","11.200.1.155",null,null,null,null,null,null,null,null,null,null,null,"PS7_2_VFD1","PS7_2",3,{"$f":"VLOOKUP(V138,'Part Number'!$C$1:$D$13,2,FALSE)","v":"35S-6D3-P101"}]
[null,null,null,null,null,"PS6_3_VFD1","35S-6D2-P101","11.200.1.156",null,null,null,null,null,null,null,null,null,null,null,"PS7_3_VFD1","PS7_3",2,{"$f":"VLOOKUP(V139,'Part Number'!$C$1:$D$13,2,FALSE)","v":"35S-6D2-P101"}]
[null,null,null,null,null,"PS6_4_VFD1","35S-6D3-P101","11.200.1.157",null,null,null,null,null,null,null,null,null,null,null,"PS7_4_VFD1","PS7_4",3,{"$f":"VLOOKUP(V140,'Part Number'!$C$1:$D$13,2,FALSE)","v":"35S-6D3-P101"}]
[null,null,null,null,null,"PS6_5_VFD1","35S-6D4-P111","11.200.1.158",null,null,null,null,null,null,null,null,null,null,null,"PS7_5_VFD1","PS7_5",7.5,{"$f":"VLOOKUP(V141,'Part Number'!$C$1:$D$13,2,FALSE)","v":"35S-6D5-P111"}]
[null,null,null,null,null,"PS6_6_VFD1","35S-6D4-P111","11.200.1.159",null,null,null,null,null,null,null,null,null,null,null,"PS7_6_VFD1","PS7_6",7.5,{"$f":"VLOOKUP(V142,'Part Number'!$C$1:$D$13,2,FALSE)","v":"35S-6D5-P111"}]
[null,null,null,null,null,"PS6_7_VFD1","35S-6D5-P111","11.200.1.160",null,null,null,null,null,null,null,null,null,null,null,"PS7_7_VFD1","PS7_7",10,{"$f":"VLOOKUP(V143,'Part Number'!$C$1:$D$13,2,FALSE)","v":"35S-6D6-P111"}]
[null,null,null,null,null,"PS6_8_VFD1","35S-6D4-P111","11.200.1.161",null,null,null,null,null,null,null,null,null,null,null,"PS7_8_VFD1","PS7_8",10,{"$f":"VLOOKUP(V144,'Part Number'!$C$1:$D$13,2,FALSE)","v":"35S-6D6-P111"}]
[null,null,null,null,null,"PS6_9_VFD1","35S-6D3-P101","11.200.1.162",null,null,null,null,null,null,null,null,null,null,null,"PS7_9_VFD1","PS7_9",7.5,{"$f":"VLOOKUP(V145,'Part Number'!$C$1:$D$13,2,FALSE)","v":"35S-6D5-P111"}]
[null,null,null,null,null,"PS6_10_VFD1","35S-6D6-P111","11.200.1.163",null,null,null,null,null,null,null,null,null,null,null,"PS7_10_VFD1","PS7_10",3,{"$f":"VLOOKUP(V146,'Part Number'!$C$1:$D$13,2,FALSE)","v":"35S-6D3-P101"}]
[null,null,null,null,null,"PS6_11_VFD1","35S-6D3-P101","11.200.1.164",null,null,null,null,null,null,null,null,null,null,null,"PS7_11_VFD1","PS7_11",3,{"$f":"VLOOKUP(V147,'Part Number'!$C$1:$D$13,2,FALSE)","v":"35S-6D3-P101"}]
[null,null,null,null,null,"PS6_12_VFD1","35S-6D6-P111","11.200.1.165",null,null,null,null,null,null,null,null,null,null,null,"PS7_12_VFD1","PS7_12",3,{"$f":"VLOOKUP(V148,'Part Number'!$C$1:$D$13,2,FALSE)","v":"35S-6D3-P101"}]
[null,null,null,null,null,"PS6_13_VFD1","35S-6D3-P101","11.200.1.166",null,null,null,null,null,null,null,null,null,null,null,"PS7_13_VFD1","PS7_13",3,{"$f":"VLOOKUP(V149,'Part Number'!$C$1:$D$13,2,FALSE)","v":"35S-6D3-P101"}]
[null,null,null,"PS7_7_DPM1","11.200.1.10","PS7_1_VFD1","35S-6D2-P101","11.200.1.167",null,null,null,null,null,null,null,null,null,null,null,"PS7_14_VFD1","PS7_14",7.5,{"$f":"VLOOKUP(V150,'Part Number'!$C$1:$D$13,2,FALSE)","v":"35S-6D5-P111"}]
[null,null,null,null,null,"PS7_2_VFD1","35S-6D3-P101","11.200.1.168"]
[null,null,null,null,null,"PS7_3_VFD1","35S-6D2-P101","11.200.1.169"]
[null,null,null,null,null,"PS7_4_VFD1","35S-6D3-P101","11.200.1.170"]
[null,null,null,null,null,"PS7_5_VFD1","35S-6D5-P111","11.200.1.171"]
[null,null,null,null,null,"PS7_6_VFD1","35S-6D5-P111","11.200.1.172"]
[null,null,null,null,null,"PS7_7_VFD1","35S-6D6-P111","11.200.1.173"]
[null,null,null,null,null,"PS7_8_VFD1","35S-6D6-P111","11.200.1.174"]
[null,null,null,null,null,"PS7_9_VFD1","35S-6D5-P111","11.200.1.175"]
[null,null,null,null,null,"PS7_10_VFD1","35S-6D3-P101","11.200.1.176"]
[null,null,null,null,null,"PS7_11_VFD1","35S-6D3-P101","11.200.1.177"]
[null,null,null,null,null,"PS7_12_VFD1","35S-6D3-P101","11.200.1.178"]
[null,null,null,null,null,"PS7_13_VFD1","35S-6D3-P101","11.200.1.179"]
[null,null,null,null,null,"PS7_14_VFD1","35S-6D5-P111","11.200.1.180"]

{"sheet":"Part Number","index":4,"n_rows":13,"n_cols":4,"rows_kept":13,"cut":false,"hidden":false,"merged":[]}
[null,"PART NUMBER","HP","PART NUMBER"]
[null,"35S-6D2-P101",2,"35S-6D2-P101"]
[null,"35S-6D3-P101",3,"35S-6D3-P101"]
[null,"35S-6D4-P111",5,"35S-6D4-P111"]
[null,"35S-6D5-P111",7.5,"35S-6D5-P111"]
[null,"35S-6D6-P111",10,"35S-6D6-P111"]
[null,"25B-D024N104",15,"25B-D024N104"]
[null,"25B-D030N104",20,"25B-D030N104"]
[null,"25B-D043N114 ",30,"25B-D043N114 "]
[null,"CALJAN","EXTENDO","CALJAN"]
[null,"PIONEER","TIPPER","PIONEER"]
[null,"ZMX-3DE2500HF-Q7-AMZCHD","ZMX","ZMX-3DE2500HF-Q7-AMZCHD"]
[null,"5032-8IOLM12DR","FIO","5032-8IOLM12DR"]

{"sheet":"IO Assignment MCM02","index":5,"n_rows":1689,"n_cols":11,"rows_kept":1689,"cut":false,"hidden":false,"merged":[]}
["Controller name","Signal type","Address name","Assigned device","Unassigned Device",null,null,null,null,null,"MCM02_DESC"]
["PS5_1_VFD1","I0","PS5_1_VFD1_I0","PS5_1_DISC"]
["PS5_1_VFD1","I1","PS5_1_VFD1_I1"]
["PS5_1_VFD1","I2","PS5_1_VFD1_I2"]
["PS5_1_VFD1","I3","PS5_1_VFD1_I3"]
["PS5_1_VFD1","IO0","PS5_1_VFD1_IO0","PS5_1_S1_PB"]
["PS5_1_VFD1","IO1","PS5_1_VFD1_IO1","PS5_1_S1_PB_LT"]
["PS5_1_VFD1","SI0","PS5_1_VFD1_SI0","PS5_1_EPC1"]
["PS5_1_VFD1","SI1","PS5_1_VFD1_SI1","PS5_1_EPC1_2"]
["PS5_1_VFD1","SI2","PS5_1_VFD1_SI2","PS5_1_EPC2"]
["PS5_1_VFD1","SI3","PS5_1_VFD1_SI3","PS5_1_EPC2_2"]
["PS5_1_VFD1","SO0","PS5_1_VFD1_SO0","PS5_1_BCN1_R"]
["PS5_10_VFD1","I0","PS5_10_VFD1_I0","PS5_10_DISC"]
["PS5_10_VFD1","I1","PS5_10_VFD1_I1"]
["PS5_10_VFD1","I2","PS5_10_VFD1_I2","PS5_10_TPE1"]
["PS5_10_VFD1","I3","PS5_10_VFD1_I3","PS5_10_TPE2"]
["PS5_10_VFD1","IO0","PS5_10_VFD1_IO0","PS5_10_JR1_PB"]
["PS5_10_VFD1","IO1","PS5_10_VFD1_IO1","PS5_10_JR1_PB_LT"]
["PS5_10_VFD1","SI0","PS5_10_VFD1_SI0"]
["PS5_10_VFD1","SI1","PS5_10_VFD1_SI1"]
["PS5_10_VFD1","SI2","PS5_10_VFD1_SI2"]
["PS5_10_VFD1","SI3","PS5_10_VFD1_SI3"]
["PS5_10_VFD1","SO0","PS5_10_VFD1_SO0"]
["PS5_11_VFD1","I0","PS5_11_VFD1_I0","PS5_11_DISC"]
["PS5_11_VFD1","I1","PS5_11_VFD1_I1"]
["PS5_11_VFD1","I2","PS5_11_VFD1_I2"]
["PS5_11_VFD1","I3","PS5_11_VFD1_I3"]
["PS5_11_VFD1","IO0","PS5_11_VFD1_IO0","PS5_11_JR1_PB"]
["PS5_11_VFD1","IO1","PS5_11_VFD1_IO1","PS5_11_JR1_PB_LT"]
["PS5_11_VFD1","SI0","PS5_11_VFD1_SI0"]
["PS5_11_VFD1","SI1","PS5_11_VFD1_SI1"]
["PS5_11_VFD1","SI2","PS5_11_VFD1_SI2"]
["PS5_11_VFD1","SI3","PS5_11_VFD1_SI3"]
["PS5_11_VFD1","SO0","PS5_11_VFD1_SO0","PS5_11_BCN1_A"]
["PS5_12_VFD1","I0","PS5_12_VFD1_I0","PS5_12_DISC"]
["PS5_12_VFD1","I1","PS5_12_VFD1_I1"]
["PS5_12_VFD1","I2","PS5_12_VFD1_I2","PS5_12_TPE1"]
["PS5_12_VFD1","I3","PS5_12_VFD1_I3","PS5_12_TPE2"]
["PS5_12_VFD1","IO0","PS5_12_VFD1_IO0"]
["PS5_12_VFD1","IO1","PS5_12_VFD1_IO1"]
["PS5_12_VFD1","SI0","PS5_12_VFD1_SI0"]
["PS5_12_VFD1","SI1","PS5_12_VFD1_SI1"]
["PS5_12_VFD1","SI2","PS5_12_VFD1_SI2"]
["PS5_12_VFD1","SI3","PS5_12_VFD1_SI3"]
["PS5_12_VFD1","SO0","PS5_12_VFD1_SO0"]
["PS5_13_VFD1","I0","PS5_13_VFD1_I0","PS5_13_DISC"]
["PS5_13_VFD1","I1","PS5_13_VFD1_I1"]
["PS5_13_VFD1","I2","PS5_13_VFD1_I2","PS5_13_TPE1"]
["PS5_13_VFD1","I3","PS5_13_VFD1_I3"]
["PS5_13_VFD1","IO0","PS5_13_VFD1_IO0"]
["PS5_13_VFD1","IO1","PS5_13_VFD1_IO1"]
["PS5_13_VFD1","SI0","PS5_13_VFD1_SI0"]
["PS5_13_VFD1","SI1","PS5_13_VFD1_SI1"]
["PS5_13_VFD1","SI2","PS5_13_VFD1_SI2"]
["PS5_13_VFD1","SI3","PS5_13_VFD1_SI3"]
["PS5_13_VFD1","SO0","PS5_13_VFD1_SO0"]
["PS5_2_VFD1","I0","PS5_2_VFD1_I0","PS5_2_DISC"]
["PS5_2_VFD1","I1","PS5_2_VFD1_I1"]
["PS5_2_VFD1","I2","PS5_2_VFD1_I2","PS5_2_TPE1"]
["PS5_2_VFD1","I3","PS5_2_VFD1_I3","PS5_2_TPE2"]
["PS5_2_VFD1","IO0","PS5_2_VFD1_IO0","PS5_1_S2_PB"]
["PS5_2_VFD1","IO1","PS5_2_VFD1_IO1","PS5_1_S2_PB_LT"]
["PS5_2_VFD1","SI0","PS5_2_VFD1_SI0"]
["PS5_2_VFD1","SI1","PS5_2_VFD1_SI1"]
["PS5_2_VFD1","SI2","PS5_2_VFD1_SI2"]
["PS5_2_VFD1","SI3","PS5_2_VFD1_SI3"]
["PS5_2_VFD1","SO0","PS5_2_VFD1_SO0"]
["PS5_3_VFD1","I0","PS5_3_VFD1_I0","PS5_3_DISC"]
["PS5_3_VFD1","I1","PS5_3_VFD1_I1"]
["PS5_3_VFD1","I2","PS5_3_VFD1_I2"]
["PS5_3_VFD1","I3","PS5_3_VFD1_I3"]
["PS5_3_VFD1","IO0","PS5_3_VFD1_IO0","PS5_2_BCN1_A"]
["PS5_3_VFD1","IO1","PS5_3_VFD1_IO1","PS5_2_BCN1_R"]
["PS5_3_VFD1","SI0","PS5_3_VFD1_SI0"]
["PS5_3_VFD1","SI1","PS5_3_VFD1_SI1"]
["PS5_3_VFD1","SI2","PS5_3_VFD1_SI2"]
["PS5_3_VFD1","SI3","PS5_3_VFD1_SI3"]
["PS5_3_VFD1","SO0","PS5_3_VFD1_SO0"]
["PS5_4_VFD1","I0","PS5_4_VFD1_I0","PS5_4_DISC"]
["PS5_4_VFD1","I1","PS5_4_VFD1_I1"]
["PS5_4_VFD1","I2","PS5_4_VFD1_I2","PS5_4_TPE1"]
["PS5_4_VFD1","I3","PS5_4_VFD1_I3","PS5_4_TPE2"]
["PS5_4_VFD1","IO0","PS5_4_VFD1_IO0"]
["PS5_4_VFD1","IO1","PS5_4_VFD1_IO1"]
["PS5_4_VFD1","SI0","PS5_4_VFD1_SI0"]
["PS5_4_VFD1","SI1","PS5_4_VFD1_SI1"]
["PS5_4_VFD1","SI2","PS5_4_VFD1_SI2"]
["PS5_4_VFD1","SI3","PS5_4_VFD1_SI3"]
["PS5_4_VFD1","SO0","PS5_4_VFD1_SO0"]
["PS5_5_VFD1","I0","PS5_5_VFD1_I0","PS5_5_DISC"]
["PS5_5_VFD1","I1","PS5_5_VFD1_I1"]
["PS5_5_VFD1","I2","PS5_5_VFD1_I2","PS5_5_TPE1"]
["PS5_5_VFD1","I3","PS5_5_VFD1_I3"]
["PS5_5_VFD1","IO0","PS5_5_VFD1_IO0"]
["PS5_5_VFD1","IO1","PS5_5_VFD1_IO1"]
["PS5_5_VFD1","SI0","PS5_5_VFD1_SI0"]
["PS5_5_VFD1","SI1","PS5_5_VFD1_SI1"]
["PS5_5_VFD1","SI2","PS5_5_VFD1_SI2"]
["PS5_5_VFD1","SI3","PS5_5_VFD1_SI3"]
["PS5_5_VFD1","SO0","PS5_5_VFD1_SO0"]
["PS5_6_VFD1","I0","PS5_6_VFD1_I0","PS5_6_DISC"]
["PS5_6_VFD1","I1","PS5_6_VFD1_I1"]
["PS5_6_VFD1","I2","PS5_6_VFD1_I2"]
["PS5_6_VFD1","I3","PS5_6_VFD1_I3"]
["PS5_6_VFD1","IO0","PS5_6_VFD1_IO0","PS5_6_JR1_PB"]
["PS5_6_VFD1","IO1","PS5_6_VFD1_IO1","PS5_6_JR1_PB_LT"]
["PS5_6_VFD1","SI0","PS5_6_VFD1_SI0"]
["PS5_6_VFD1","SI1","PS5_6_VFD1_SI1"]
["PS5_6_VFD1","SI2","PS5_6_VFD1_SI2"]
["PS5_6_VFD1","SI3","PS5_6_VFD1_SI3"]
["PS5_6_VFD1","SO0","PS5_6_VFD1_SO0","PS5_6_BCN1_A"]
["PS5_7_VFD1","I0","PS5_7_VFD1_I0","PS5_7_DISC"]
["PS5_7_VFD1","I1","PS5_7_VFD1_I1"]
["PS5_7_VFD1","I2","PS5_7_VFD1_I2","PS5_7_TPE1"]
["PS5_7_VFD1","I3","PS5_7_VFD1_I3"]
["PS5_7_VFD1","IO0","PS5_7_VFD1_IO0"]
["PS5_7_VFD1","IO1","PS5_7_VFD1_IO1"]
["PS5_7_VFD1","SI0","PS5_7_VFD1_SI0"]
["PS5_7_VFD1","SI1","PS5_7_VFD1_SI1"]
["PS5_7_VFD1","SI2","PS5_7_VFD1_SI2"]
["PS5_7_VFD1","SI3","PS5_7_VFD1_SI3"]
["PS5_7_VFD1","SO0","PS5_7_VFD1_SO0"]
["PS5_8_VFD1","I0","PS5_8_VFD1_I0","PS5_8_DISC"]
["PS5_8_VFD1","I1","PS5_8_VFD1_I1"]
["PS5_8_VFD1","I2","PS5_8_VFD1_I2","PS5_8_TPE1"]
["PS5_8_VFD1","I3","PS5_8_VFD1_I3","PS5_8_TPE2"]
["PS5_8_VFD1","IO0","PS5_8_VFD1_IO0","PS5_9_JR2_PB"]
["PS5_8_VFD1","IO1","PS5_8_VFD1_IO1","PS5_9_JR2_PB_LT"]
["PS5_8_VFD1","SI0","PS5_8_VFD1_SI0"]
["PS5_8_VFD1","SI1","PS5_8_VFD1_SI1"]
["PS5_8_VFD1","SI2","PS5_8_VFD1_SI2"]
["PS5_8_VFD1","SI3","PS5_8_VFD1_SI3"]
["PS5_8_VFD1","SO0","PS5_8_VFD1_SO0"]
["PS5_9_VFD1","I0","PS5_9_VFD1_I0","PS5_9_DISC"]
["PS5_9_VFD1","I1","PS5_9_VFD1_I1"]
["PS5_9_VFD1","I2","PS5_9_VFD1_I2"]
["PS5_9_VFD1","I3","PS5_9_VFD1_I3"]
["PS5_9_VFD1","IO0","PS5_9_VFD1_IO0","PS5_9_JR1_PB"]
["PS5_9_VFD1","IO1","PS5_9_VFD1_IO1","PS5_9_JR1_PB_LT"]
["PS5_9_VFD1","SI0","PS5_9_VFD1_SI0"]
["PS5_9_VFD1","SI1","PS5_9_VFD1_SI1"]
["PS5_9_VFD1","SI2","PS5_9_VFD1_SI2"]
["PS5_9_VFD1","SI3","PS5_9_VFD1_SI3"]
["PS5_9_VFD1","SO0","PS5_9_VFD1_SO0","PS5_9_BCN1_A"]
["PS6_1_VFD1","I0","PS6_1_VFD1_I0","PS6_1_DISC"]
["PS6_1_VFD1","I1","PS6_1_VFD1_I1"]
["PS6_1_VFD1","I2","PS6_1_VFD1_I2"]
["PS6_1_VFD1","I3","PS6_1_VFD1_I3"]
["PS6_1_VFD1","IO0","PS6_1_VFD1_IO0","PS6_1_S1_PB"]
["PS6_1_VFD1","IO1","PS6_1_VFD1_IO1","PS6_1_S1_PB_LT"]
["PS6_1_VFD1","SI0","PS6_1_VFD1_SI0","PS6_1_EPC1"]
["PS6_1_VFD1","SI1","PS6_1_VFD1_SI1","PS6_1_EPC1_2"]
["PS6_1_VFD1","SI2","PS6_1_VFD1_SI2","PS6_1_EPC2"]
["PS6_1_VFD1","SI3","PS6_1_VFD1_SI3","PS6_1_EPC2_2"]
["PS6_1_VFD1","SO0","PS6_1_VFD1_SO0","PS6_1_BCN1_R"]
["PS6_10_VFD1","I0","PS6_10_VFD1_I0","PS6_10_DISC"]
["PS6_10_VFD1","I1","PS6_10_VFD1_I1"]
["PS6_10_VFD1","I2","PS6_10_VFD1_I2","PS6_10_TPE1"]
["PS6_10_VFD1","I3","PS6_10_VFD1_I3","PS6_10_TPE2"]
["PS6_10_VFD1","IO0","PS6_10_VFD1_IO0"]
["PS6_10_VFD1","IO1","PS6_10_VFD1_IO1"]
["PS6_10_VFD1","SI0","PS6_10_VFD1_SI0"]
["PS6_10_VFD1","SI1","PS6_10_VFD1_SI1"]
["PS6_10_VFD1","SI2","PS6_10_VFD1_SI2"]
["PS6_10_VFD1","SI3","PS6_10_VFD1_SI3"]
["PS6_10_VFD1","SO0","PS6_10_VFD1_SO0"]
["PS6_11_VFD1","I0","PS6_11_VFD1_I0","PS6_11_DISC"]
["PS6_11_VFD1","I1","PS6_11_VFD1_I1"]
["PS6_11_VFD1","I2","PS6_11_VFD1_I2"]
["PS6_11_VFD1","I3","PS6_11_VFD1_I3"]
["PS6_11_VFD1","IO0","PS6_11_VFD1_IO0","PS6_11_JR1_PB"]
["PS6_11_VFD1","IO1","PS6_11_VFD1_IO1","PS6_11_JR1_PB_LT"]
["PS6_11_VFD1","SI0","PS6_11_VFD1_SI0"]
["PS6_11_VFD1","SI1","PS6_11_VFD1_SI1"]
["PS6_11_VFD1","SI2","PS6_11_VFD1_SI2"]
["PS6_11_VFD1","SI3","PS6_11_VFD1_SI3"]
["PS6_11_VFD1","SO0","PS6_11_VFD1_SO0","PS6_11_BCN1_A"]
["PS6_12_VFD1","I0","PS6_12_VFD1_I0","PS6_12_DISC"]
["PS6_12_VFD1","I1","PS6_12_VFD1_I1"]
["PS6_12_VFD1","I2","PS6_12_VFD1_I2","PS6_12_TPE1"]
["PS6_12_VFD1","I3","PS6_12_VFD1_I3","PS6_12_TPE2"]
["PS6_12_VFD1","IO0","PS6_12_VFD1_IO0"]
["PS6_12_VFD1","IO1","PS6_12_VFD1_IO1"]
["PS6_12_VFD1","SI0","PS6_12_VFD1_SI0"]
["PS6_12_VFD1","SI1","PS6_12_VFD1_SI1"]
["PS6_12_VFD1","SI2","PS6_12_VFD1_SI2"]
["PS6_12_VFD1","SI3","PS6_12_VFD1_SI3"]
["PS6_12_VFD1","SO0","PS6_12_VFD1_SO0"]
["PS6_13_VFD1","I0","PS6_13_VFD1_I0","PS6_13_DISC"]
["PS6_13_VFD1","I1","PS6_13_VFD1_I1"]
["PS6_13_VFD1","I2","PS6_13_VFD1_I2"]
["PS6_13_VFD1","I3","PS6_13_VFD1_I3"]
["PS6_13_VFD1","IO0","PS6_13_VFD1_IO0"]
["PS6_13_VFD1","IO1","PS6_13_VFD1_IO1"]
["PS6_13_VFD1","SI0","PS6_13_VFD1_SI0"]
["PS6_13_VFD1","SI1","PS6_13_VFD1_SI1"]
["PS6_13_VFD1","SI2","PS6_13_VFD1_SI2"]
["PS6_13_VFD1","SI3","PS6_13_VFD1_SI3"]
["PS6_13_VFD1","SO0","PS6_13_VFD1_SO0"]
["PS6_2_VFD1","I0","PS6_2_VFD1_I0","PS6_2_DISC"]
["PS6_2_VFD1","I1","PS6_2_VFD1_I1"]
["PS6_2_VFD1","I2","PS6_2_VFD1_I2","PS6_2_TPE1"]
["PS6_2_VFD1","I3","PS6_2_VFD1_I3","PS6_2_TPE2"]
["PS6_2_VFD1","IO0","PS6_2_VFD1_IO0"]
["PS6_2_VFD1","IO1","PS6_2_VFD1_IO1"]
["PS6_2_VFD1","SI0","PS6_2_VFD1_SI0","PS6_1_S2_PB"]
["PS6_2_VFD1","SI1","PS6_2_VFD1_SI1","PS6_1_S2_PB_LT"]
["PS6_2_VFD1","SI2","PS6_2_VFD1_SI2"]
["PS6_2_VFD1","SI3","PS6_2_VFD1_SI3"]
["PS6_2_VFD1","SO0","PS6_2_VFD1_SO0","PS6_6_BCN1_A"]
["PS6_3_VFD1","I0","PS6_3_VFD1_I0","PS6_3_DISC"]
["PS6_3_VFD1","I1","PS6_3_VFD1_I1"]
["PS6_3_VFD1","I2","PS6_3_VFD1_I2"]
["PS6_3_VFD1","I3","PS6_3_VFD1_I3"]
["PS6_3_VFD1","IO0","PS6_3_VFD1_IO0","PS6_2_BCN2_A"]
["PS6_3_VFD1","IO1","PS6_3_VFD1_IO1","PS6_2_BCN2_R"]
["PS6_3_VFD1","SI0","PS6_3_VFD1_SI0"]
["PS6_3_VFD1","SI1","PS6_3_VFD1_SI1"]
["PS6_3_VFD1","SI2","PS6_3_VFD1_SI2"]
["PS6_3_VFD1","SI3","PS6_3_VFD1_SI3"]
["PS6_3_VFD1","SO0","PS6_3_VFD1_SO0"]
["PS6_4_VFD1","I0","PS6_4_VFD1_I0","PS6_4_DISC"]
["PS6_4_VFD1","I1","PS6_4_VFD1_I1"]
["PS6_4_VFD1","I2","PS6_4_VFD1_I2","PS6_4_TPE1"]
["PS6_4_VFD1","I3","PS6_4_VFD1_I3","PS6_4_TPE2"]
["PS6_4_VFD1","IO0","PS6_4_VFD1_IO0"]
["PS6_4_VFD1","IO1","PS6_4_VFD1_IO1"]
["PS6_4_VFD1","SI0","PS6_4_VFD1_SI0"]
["PS6_4_VFD1","SI1","PS6_4_VFD1_SI1"]
["PS6_4_VFD1","SI2","PS6_4_VFD1_SI2"]
["PS6_4_VFD1","SI3","PS6_4_VFD1_SI3"]
["PS6_4_VFD1","SO0","PS6_4_VFD1_SO0"]
["PS6_5_VFD1","I0","PS6_5_VFD1_I0","PS6_5_DISC"]
["PS6_5_VFD1","I1","PS6_5_VFD1_I1"]
["PS6_5_VFD1","I2","PS6_5_VFD1_I2","PS6_5_TPE1"]
["PS6_5_VFD1","I3","PS6_5_VFD1_I3"]
["PS6_5_VFD1","IO0","PS6_5_VFD1_IO0"]
["PS6_5_VFD1","IO1","PS6_5_VFD1_IO1"]
["PS6_5_VFD1","SI0","PS6_5_VFD1_SI0"]
["PS6_5_VFD1","SI1","PS6_5_VFD1_SI1"]
["PS6_5_VFD1","SI2","PS6_5_VFD1_SI2"]
["PS6_5_VFD1","SI3","PS6_5_VFD1_SI3"]
["PS6_5_VFD1","SO0","PS6_5_VFD1_SO0"]
["PS6_6_VFD1","I0","PS6_6_VFD1_I0","PS6_6_DISC"]
["PS6_6_VFD1","I1","PS6_6_VFD1_I1"]
["PS6_6_VFD1","I2","PS6_6_VFD1_I2"]
["PS6_6_VFD1","I3","PS6_6_VFD1_I3"]
["PS6_6_VFD1","IO0","PS6_6_VFD1_IO0","PS6_6_JR1_PB"]
["PS6_6_VFD1","IO1","PS6_6_VFD1_IO1","PS6_6_JR1_PB_LT"]
["PS6_6_VFD1","SI0","PS6_6_VFD1_SI0"]
["PS6_6_VFD1","SI1","PS6_6_VFD1_SI1"]
["PS6_6_VFD1","SI2","PS6_6_VFD1_SI2"]
["PS6_6_VFD1","SI3","PS6_6_VFD1_SI3"]
["PS6_6_VFD1","SO0","PS6_6_VFD1_SO0"]
["PS6_7_VFD1","I0","PS6_7_VFD1_I0","PS6_7_DISC"]
["PS6_7_VFD1","I1","PS6_7_VFD1_I1"]
["PS6_7_VFD1","I2","PS6_7_VFD1_I2","PS6_7_TPE1"]
["PS6_7_VFD1","I3","PS6_7_VFD1_I3"]
["PS6_7_VFD1","IO0","PS6_7_VFD1_IO0"]
["PS6_7_VFD1","IO1","PS6_7_VFD1_IO1"]
["PS6_7_VFD1","SI0","PS6_7_VFD1_SI0"]
["PS6_7_VFD1","SI1","PS6_7_VFD1_SI1"]
["PS6_7_VFD1","SI2","PS6_7_VFD1_SI2"]
["PS6_7_VFD1","SI3","PS6_7_VFD1_SI3"]
["PS6_7_VFD1","SO0","PS6_7_VFD1_SO0"]
["PS6_8_VFD1","I0","PS6_8_VFD1_I0","PS6_8_DISC"]
["PS6_8_VFD1","I1","PS6_8_VFD1_I1"]
["PS6_8_VFD1","I2","PS6_8_VFD1_I2","PS6_8_TPE1"]
["PS6_8_VFD1","I3","PS6_8_VFD1_I3","PS6_8_TPE2"]
["PS6_8_VFD1","IO0","PS6_8_VFD1_IO0","PS6_8_JR1_PB"]
["PS6_8_VFD1","IO1","PS6_8_VFD1_IO1","PS6_8_JR1_PB_LT"]
["PS6_8_VFD1","SI0","PS6_8_VFD1_SI0"]
["PS6_8_VFD1","SI1","PS6_8_VFD1_SI1"]
["PS6_8_VFD1","SI2","PS6_8_VFD1_SI2"]
["PS6_8_VFD1","SI3","PS6_8_VFD1_SI3"]
["PS6_8_VFD1","SO0","PS6_8_VFD1_SO0","PS6_8_BCN1_A"]
["PS6_9_VFD1","I0","PS6_9_VFD1_I0","PS6_9_DISC"]
["PS6_9_VFD1","I1","PS6_9_VFD1_I1"]
["PS6_9_VFD1","I2","PS6_9_VFD1_I2"]
["PS6_9_VFD1","I3","PS6_9_VFD1_I3"]
["PS6_9_VFD1","IO0","PS6_9_VFD1_IO0","PS6_9_JR1_PB"]
["PS6_9_VFD1","IO1","PS6_9_VFD1_IO1","PS6_9_JR1_PB_LT"]
["PS6_9_VFD1","SI0","PS6_9_VFD1_SI0"]
["PS6_9_VFD1","SI1","PS6_9_VFD1_SI1"]
["PS6_9_VFD1","SI2","PS6_9_VFD1_SI2"]
["PS6_9_VFD1","SI3","PS6_9_VFD1_SI3"]
["PS6_9_VFD1","SO0","PS6_9_VFD1_SO0"]
["PS7_1_VFD1","I0","PS7_1_VFD1_I0","PS7_1_DISC"]
["PS7_1_VFD1","I1","PS7_1_VFD1_I1"]
["PS7_1_VFD1","I2","PS7_1_VFD1_I2"]
["PS7_1_VFD1","I3","PS7_1_VFD1_I3"]
["PS7_1_VFD1","IO0","PS7_1_VFD1_IO0","PS7_1_S1_PB"]
["PS7_1_VFD1","IO1","PS7_1_VFD1_IO1","PS7_1_S1_PB_LT"]
["PS7_1_VFD1","SI0","PS7_1_VFD1_SI0","PS7_1_EPC1"]
["PS7_1_VFD1","SI1","PS7_1_VFD1_SI1","PS7_1_EPC1_2"]
["PS7_1_VFD1","SI2","PS7_1_VFD1_SI2","PS7_1_EPC2"]
["PS7_1_VFD1","SI3","PS7_1_VFD1_SI3","PS7_1_EPC2_2"]
["PS7_1_VFD1","SO0","PS7_1_VFD1_SO0","PS7_1_BCN1_R"]
["PS7_10_VFD1","I0","PS7_10_VFD1_I0","PS7_10_DISC"]
["PS7_10_VFD1","I1","PS7_10_VFD1_I1"]
["PS7_10_VFD1","I2","PS7_10_VFD1_I2","PS7_10_TPE1"]
["PS7_10_VFD1","I3","PS7_10_VFD1_I3"]
["PS7_10_VFD1","IO0","PS7_10_VFD1_IO0","PS7_9_S2_PB"]
["PS7_10_VFD1","IO1","PS7_10_VFD1_IO1","PS7_9_S2_PB_LT"]
["PS7_10_VFD1","SI0","PS7_10_VFD1_SI0"]
["PS7_10_VFD1","SI1","PS7_10_VFD1_SI1"]
["PS7_10_VFD1","SI2","PS7_10_VFD1_SI2"]
["PS7_10_VFD1","SI3","PS7_10_VFD1_SI3"]
["PS7_10_VFD1","SO0","PS7_10_VFD1_SO0","PS7_9_BCN2_R"]
["PS7_11_VFD1","I0","PS7_11_VFD1_I0","PS7_11_DISC"]
["PS7_11_VFD1","I1","PS7_11_VFD1_I1"]
["PS7_11_VFD1","I2","PS7_11_VFD1_I2"]
["PS7_11_VFD1","I3","PS7_11_VFD1_I3"]
["PS7_11_VFD1","IO0","PS7_11_VFD1_IO0","PS7_11_JR1_PB"]
["PS7_11_VFD1","IO1","PS7_11_VFD1_IO1","PS7_11_JR1_PB_LT"]
["PS7_11_VFD1","SI0","PS7_11_VFD1_SI0"]
["PS7_11_VFD1","SI1","PS7_11_VFD1_SI1"]
["PS7_11_VFD1","SI2","PS7_11_VFD1_SI2"]
["PS7_11_VFD1","SI3","PS7_11_VFD1_SI3"]
["PS7_11_VFD1","SO0","PS7_11_VFD1_SO0","PS7_11_BCN1_A"]
["PS7_12_VFD1","I0","PS7_12_VFD1_I0","PS7_12_DISC"]
["PS7_12_VFD1","I1","PS7_12_VFD1_I1"]
["PS7_12_VFD1","I2","PS7_12_VFD1_I2","PS7_12_TPE1"]
["PS7_12_VFD1","I3","PS7_12_VFD1_I3","PS7_12_TPE2"]
["PS7_12_VFD1","IO0","PS7_12_VFD1_IO0"]
["PS7_12_VFD1","IO1","PS7_12_VFD1_IO1"]
["PS7_12_VFD1","SI0","PS7_12_VFD1_SI0"]
["PS7_12_VFD1","SI1","PS7_12_VFD1_SI1"]
["PS7_12_VFD1","SI2","PS7_12_VFD1_SI2"]
["PS7_12_VFD1","SI3","PS7_12_VFD1_SI3"]
["PS7_12_VFD1","SO0","PS7_12_VFD1_SO0"]
["PS7_13_VFD1","I0","PS7_13_VFD1_I0","PS7_13_DISC"]
["PS7_13_VFD1","I1","PS7_13_VFD1_I1"]
["PS7_13_VFD1","I2","PS7_13_VFD1_I2"]
["PS7_13_VFD1","I3","PS7_13_VFD1_I3"]
["PS7_13_VFD1","IO0","PS7_13_VFD1_IO0","PS7_13_JR1_PB"]
["PS7_13_VFD1","IO1","PS7_13_VFD1_IO1","PS7_13_JR1_PB_LT"]
["PS7_13_VFD1","SI0","PS7_13_VFD1_SI0"]
["PS7_13_VFD1","SI1","PS7_13_VFD1_SI1"]
["PS7_13_VFD1","SI2","PS7_13_VFD1_SI2"]
["PS7_13_VFD1","SI3","PS7_13_VFD1_SI3"]
["PS7_13_VFD1","SO0","PS7_13_VFD1_SO0","PS7_13_BCN1_A"]
["PS7_14_VFD1","I0","PS7_14_VFD1_I0","PS7_14_DISC"]
["PS7_14_VFD1","I1","PS7_14_VFD1_I1"]
["PS7_14_VFD1","I2","PS7_14_VFD1_I2","PS7_14_TPE1"]
["PS7_14_VFD1","I3","PS7_14_VFD1_I3","PS7_14_TPE2"]
["PS7_14_VFD1","IO0","PS7_14_VFD1_IO0"]
["PS7_14_VFD1","IO1","PS7_14_VFD1_IO1"]
["PS7_14_VFD1","SI0","PS7_14_VFD1_SI0"]
["PS7_14_VFD1","SI1","PS7_14_VFD1_SI1"]
["PS7_14_VFD1","SI2","PS7_14_VFD1_SI2"]
["PS7_14_VFD1","SI3","PS7_14_VFD1_SI3"]
["PS7_14_VFD1","SO0","PS7_14_VFD1_SO0"]
["PS7_2_VFD1","I0","PS7_2_VFD1_I0","PS7_2_DISC"]
["PS7_2_VFD1","I1","PS7_2_VFD1_I1"]
["PS7_2_VFD1","I2","PS7_2_VFD1_I2","PS7_2_TPE1"]
["PS7_2_VFD1","I3","PS7_2_VFD1_I3","PS7_2_TPE2"]
["PS7_2_VFD1","IO0","PS7_2_VFD1_IO0","PS7_1_S2_PB"]
["PS7_2_VFD1","IO1","PS7_2_VFD1_IO1","PS7_1_S2_PB_LT"]
["PS7_2_VFD1","SI0","PS7_2_VFD1_SI0"]
["PS7_2_VFD1","SI1","PS7_2_VFD1_SI1"]
["PS7_2_VFD1","SI2","PS7_2_VFD1_SI2"]
["PS7_2_VFD1","SI3","PS7_2_VFD1_SI3"]
["PS7_2_VFD1","SO0","PS7_2_VFD1_SO0"]
["PS7_3_VFD1","I0","PS7_3_VFD1_I0","PS7_3_DISC"]
["PS7_3_VFD1","I1","PS7_3_VFD1_I1"]
["PS7_3_VFD1","I2","PS7_3_VFD1_I2"]
["PS7_3_VFD1","I3","PS7_3_VFD1_I3"]
["PS7_3_VFD1","IO0","PS7_3_VFD1_IO0","PS7_2_BCN1_A"]
["PS7_3_VFD1","IO1","PS7_3_VFD1_IO1","PS7_2_BCN1_R"]
["PS7_3_VFD1","SI0","PS7_3_VFD1_SI0"]
["PS7_3_VFD1","SI1","PS7_3_VFD1_SI1"]
["PS7_3_VFD1","SI2","PS7_3_VFD1_SI2"]
["PS7_3_VFD1","SI3","PS7_3_VFD1_SI3"]
["PS7_3_VFD1","SO0","PS7_3_VFD1_SO0"]
["PS7_4_VFD1","I0","PS7_4_VFD1_I0","PS7_4_DISC"]
["PS7_4_VFD1","I1","PS7_4_VFD1_I1"]
["PS7_4_VFD1","I2","PS7_4_VFD1_I2","PS7_4_TPE1"]
["PS7_4_VFD1","I3","PS7_4_VFD1_I3","PS7_4_TPE2"]
["PS7_4_VFD1","IO0","PS7_4_VFD1_IO0"]
["PS7_4_VFD1","IO1","PS7_4_VFD1_IO1"]
["PS7_4_VFD1","SI0","PS7_4_VFD1_SI0"]
["PS7_4_VFD1","SI1","PS7_4_VFD1_SI1"]
["PS7_4_VFD1","SI2","PS7_4_VFD1_SI2"]
["PS7_4_VFD1","SI3","PS7_4_VFD1_SI3"]
["PS7_4_VFD1","SO0","PS7_4_VFD1_SO0"]
["PS7_5_VFD1","I0","PS7_5_VFD1_I0","PS7_5_DISC"]
["PS7_5_VFD1","I1","PS7_5_VFD1_I1"]
["PS7_5_VFD1","I2","PS7_5_VFD1_I2","PS7_5_TPE1"]
["PS7_5_VFD1","I3","PS7_5_VFD1_I3"]
["PS7_5_VFD1","IO0","PS7_5_VFD1_IO0"]
["PS7_5_VFD1","IO1","PS7_5_VFD1_IO1"]
["PS7_5_VFD1","SI0","PS7_5_VFD1_SI0"]
["PS7_5_VFD1","SI1","PS7_5_VFD1_SI1"]
["PS7_5_VFD1","SI2","PS7_5_VFD1_SI2"]
["PS7_5_VFD1","SI3","PS7_5_VFD1_SI3"]
["PS7_5_VFD1","SO0","PS7_5_VFD1_SO0"]
["PS7_6_VFD1","I0","PS7_6_VFD1_I0","PS7_6_DISC"]
["PS7_6_VFD1","I1","PS7_6_VFD1_I1"]
["PS7_6_VFD1","I2","PS7_6_VFD1_I2","PS7_6_TPE1"]
["PS7_6_VFD1","I3","PS7_6_VFD1_I3"]
["PS7_6_VFD1","IO0","PS7_6_VFD1_IO0"]
["PS7_6_VFD1","IO1","PS7_6_VFD1_IO1"]
["PS7_6_VFD1","SI0","PS7_6_VFD1_SI0"]
["PS7_6_VFD1","SI1","PS7_6_VFD1_SI1"]
["PS7_6_VFD1","SI2","PS7_6_VFD1_SI2"]
["PS7_6_VFD1","SI3","PS7_6_VFD1_SI3"]
["PS7_6_VFD1","SO0","PS7_6_VFD1_SO0"]
["PS7_7_VFD1","I0","PS7_7_VFD1_I0","PS7_7_DISC"]
["PS7_7_VFD1","I1","PS7_7_VFD1_I1"]
["PS7_7_VFD1","I2","PS7_7_VFD1_I2","PS7_7_TPE1"]
["PS7_7_VFD1","I3","PS7_7_VFD1_I3"]
["PS7_7_VFD1","IO0","PS7_7_VFD1_IO0"]
["PS7_7_VFD1","IO1","PS7_7_VFD1_IO1"]
["PS7_7_VFD1","SI0","PS7_7_VFD1_SI0"]
["PS7_7_VFD1","SI1","PS7_7_VFD1_SI1"]
["PS7_7_VFD1","SI2","PS7_7_VFD1_SI2"]
["PS7_7_VFD1","SI3","PS7_7_VFD1_SI3"]
["PS7_7_VFD1","SO0","PS7_7_VFD1_SO0"]
["PS7_8_VFD1","I0","PS7_8_VFD1_I0","PS7_8_DISC"]
["PS7_8_VFD1","I1","PS7_8_VFD1_I1"]
["PS7_8_VFD1","I2","PS7_8_VFD1_I2","PS7_8_TPE1"]
["PS7_8_VFD1","I3","PS7_8_VFD1_I3"]
["PS7_8_VFD1","IO0","PS7_8_VFD1_IO0"]
["PS7_8_VFD1","IO1","PS7_8_VFD1_IO1"]
["PS7_8_VFD1","SI0","PS7_8_VFD1_SI0"]
["PS7_8_VFD1","SI1","PS7_8_VFD1_SI1"]
["PS7_8_VFD1","SI2","PS7_8_VFD1_SI2"]
["PS7_8_VFD1","SI3","PS7_8_VFD1_SI3"]
["PS7_8_VFD1","SO0","PS7_8_VFD1_SO0"]
["PS7_9_VFD1","I0","PS7_9_VFD1_I0","PS7_9_DISC"]
["PS7_9_VFD1","I1","PS7_9_VFD1_I1"]
["PS7_9_VFD1","I2","PS7_9_VFD1_I2","PS7_9_TPE1"]
["PS7_9_VFD1","I3","PS7_9_VFD1_I3"]
["PS7_9_VFD1","IO0","PS7_9_VFD1_IO0","PS7_9_S1_PB"]
["PS7_9_VFD1","IO1","PS7_9_VFD1_IO1","PS7_9_S1_PB_LT"]
["PS7_9_VFD1","SI0","PS7_9_VFD1_SI0","PS7_9_EPC1"]
["PS7_9_VFD1","SI1","PS7_9_VFD1_SI1","PS7_9_EPC1_2"]
["PS7_9_VFD1","SI2","PS7_9_VFD1_SI2","PS7_9_EPC2"]
["PS7_9_VFD1","SI3","PS7_9_VFD1_SI3","PS7_9_EPC2_2"]
["PS7_9_VFD1","SO0","PS7_9_VFD1_SO0","PS7_9_BCN1_R"]
["UL13_1_VFD1","I0","UL13_1_VFD1_I0","UL13_1_DISC"]
["UL13_1_VFD1","I1","UL13_1_VFD1_I1"]
["UL13_1_VFD1","I2","UL13_1_VFD1_I2","UL13_1_TPE1"]
["UL13_1_VFD1","I3","UL13_1_VFD1_I3","UL13_1_SS1_SPB"]
["UL13_1_VFD1","IO0","UL13_1_VFD1_IO0","UL13_1_SS1_STPB"]
["UL13_1_VFD1","IO1","UL13_1_VFD1_IO1","UL13_1_SS1_STPB_LT"]
["UL13_1_VFD1","SI0","UL13_1_VFD1_SI0","UL13_1_EPC1"]
["UL13_1_VFD1","SI1","UL13_1_VFD1_SI1","UL13_1_EPC1_2"]
["UL13_1_VFD1","SI2","UL13_1_VFD1_SI2","UL13_1_EPC2"]
["UL13_1_VFD1","SI3","UL13_1_VFD1_SI3","UL13_1_EPC2_2"]
["UL13_1_VFD1","SO0","UL13_1_VFD1_SO0"]
["UL13_10_VFD1","I0","UL13_10_VFD1_I0","UL13_10_DISC"]
["UL13_10_VFD1","I1","UL13_10_VFD1_I1","UL13_10_ENC1"]
["UL13_10_VFD1","I2","UL13_10_VFD1_I2","UL13_10_TPE1"]
["UL13_10_VFD1","I3","UL13_10_VFD1_I3","UL13_10_TPE2"]
["UL13_10_VFD1","IO0","UL13_10_VFD1_IO0"]
["UL13_10_VFD1","IO1","UL13_10_VFD1_IO1"]
["UL13_10_VFD1","SI0","UL13_10_VFD1_SI0"]
["UL13_10_VFD1","SI1","UL13_10_VFD1_SI1"]
["UL13_10_VFD1","SI2","UL13_10_VFD1_SI2"]
["UL13_10_VFD1","SI3","UL13_10_VFD1_SI3"]
["UL13_10_VFD1","SO0","UL13_10_VFD1_SO0"]
["UL13_11_VFD1","I0","UL13_11_VFD1_I0","UL13_11_DISC"]
["UL13_11_VFD1","I1","UL13_11_VFD1_I1","UL13_11_ENC1"]
["UL13_11_VFD1","I2","UL13_11_VFD1_I2","UL13_11_TPE1"]
["UL13_11_VFD1","I3","UL13_11_VFD1_I3"]
["UL13_11_VFD1","IO0","UL13_11_VFD1_IO0"]
["UL13_11_VFD1","IO1","UL13_11_VFD1_IO1"]
["UL13_11_VFD1","SI0","UL13_11_VFD1_SI0"]
["UL13_11_VFD1","SI1","UL13_11_VFD1_SI1"]
["UL13_11_VFD1","SI2","UL13_11_VFD1_SI2"]
["UL13_11_VFD1","SI3","UL13_11_VFD1_SI3"]
["UL13_11_VFD1","SO0","UL13_11_VFD1_SO0"]
["UL13_12_VFD1","I0","UL13_12_VFD1_I0","UL13_12_DISC"]
["UL13_12_VFD1","I1","UL13_12_VFD1_I1"]
["UL13_12_VFD1","I2","UL13_12_VFD1_I2"]
["UL13_12_VFD1","I3","UL13_12_VFD1_I3"]
["UL13_12_VFD1","IO0","UL13_12_VFD1_IO0"]
["UL13_12_VFD1","IO1","UL13_12_VFD1_IO1"]
["UL13_12_VFD1","SI0","UL13_12_VFD1_SI0"]
["UL13_12_VFD1","SI1","UL13_12_VFD1_SI1"]
["UL13_12_VFD1","SI2","UL13_12_VFD1_SI2"]
["UL13_12_VFD1","SI3","UL13_12_VFD1_SI3"]
["UL13_12_VFD1","SO0","UL13_12_VFD1_SO0"]
["UL13_2_VFD1","I0","UL13_2_VFD1_I0","UL13_2_DISC"]
["UL13_2_VFD1","I1","UL13_2_VFD1_I1"]
["UL13_2_VFD1","I2","UL13_2_VFD1_I2","UL13_2_TPE1"]
["UL13_2_VFD1","I3","UL13_2_VFD1_I3"]
["UL13_2_VFD1","IO0","UL13_2_VFD1_IO0"]
["UL13_2_VFD1","IO1","UL13_2_VFD1_IO1"]
["UL13_2_VFD1","SI0","UL13_2_VFD1_SI0"]
["UL13_2_VFD1","SI1","UL13_2_VFD1_SI1"]
["UL13_2_VFD1","SI2","UL13_2_VFD1_SI2"]
["UL13_2_VFD1","SI3","UL13_2_VFD1_SI3"]
["UL13_2_VFD1","SO0","UL13_2_VFD1_SO0"]
["UL13_3_VFD1","I0","UL13_3_VFD1_I0","UL13_3_DISC"]
["UL13_3_VFD1","I1","UL13_3_VFD1_I1"]
["UL13_3_VFD1","I2","UL13_3_VFD1_I2","UL13_3_TPE1"]
["UL13_3_VFD1","I3","UL13_3_VFD1_I3"]
["UL13_3_VFD1","IO0","UL13_3_VFD1_IO0"]
["UL13_3_VFD1","IO1","UL13_3_VFD1_IO1"]
["UL13_3_VFD1","SI0","UL13_3_VFD1_SI0"]
["UL13_3_VFD1","SI1","UL13_3_VFD1_SI1"]
["UL13_3_VFD1","SI2","UL13_3_VFD1_SI2"]
["UL13_3_VFD1","SI3","UL13_3_VFD1_SI3"]
["UL13_3_VFD1","SO0","UL13_3_VFD1_SO0"]
["UL13_4_VFD1","I0","UL13_4_VFD1_I0","UL13_4_DISC"]
["UL13_4_VFD1","I1","UL13_4_VFD1_I1","UL13_4_ENC1"]
["UL13_4_VFD1","I2","UL13_4_VFD1_I2","UL13_4_TPE1"]
["UL13_4_VFD1","I3","UL13_4_VFD1_I3"]
["UL13_4_VFD1","IO0","UL13_4_VFD1_IO0","UL13_4_S1_PB"]
["UL13_4_VFD1","IO1","UL13_4_VFD1_IO1","UL13_4_S1_PB_LT"]
["UL13_4_VFD1","SI0","UL13_4_VFD1_SI0","UL13_4_EPC1"]
["UL13_4_VFD1","SI1","UL13_4_VFD1_SI1","UL13_4_EPC1_2"]
["UL13_4_VFD1","SI2","UL13_4_VFD1_SI2","UL13_4_EPC2"]
["UL13_4_VFD1","SI3","UL13_4_VFD1_SI3","UL13_4_EPC2_2"]
["UL13_4_VFD1","SO0","UL13_4_VFD1_SO0","UL13_4_BCN1_R"]
["UL13_5_VFD1","I0","UL13_5_VFD1_I0","UL13_5_DISC"]
["UL13_5_VFD1","I1","UL13_5_VFD1_I1","UL13_5_ENC1"]
["UL13_5_VFD1","I2","UL13_5_VFD1_I2","UL13_5_TPE1"]
["UL13_5_VFD1","I3","UL13_5_VFD1_I3"]
["UL13_5_VFD1","IO0","UL13_5_VFD1_IO0","UL13_4_S2_PB"]
["UL13_5_VFD1","IO1","UL13_5_VFD1_IO1","UL13_4_S2_PB_LT"]
["UL13_5_VFD1","SI0","UL13_5_VFD1_SI0"]
["UL13_5_VFD1","SI1","UL13_5_VFD1_SI1"]
["UL13_5_VFD1","SI2","UL13_5_VFD1_SI2"]
["UL13_5_VFD1","SI3","UL13_5_VFD1_SI3"]
["UL13_5_VFD1","SO0","UL13_5_VFD1_SO0","UL13_4_BCN2_R"]
["UL13_6_VFD1","I0","UL13_6_VFD1_I0"]
["UL13_6_VFD1","I1","UL13_6_VFD_I1","UL13_6_ENC1"]
["UL13_6_VFD1","I2","UL13_6_VFD1_I2","UL13_6_TPE1"]
["UL13_6_VFD1","I3","UL13_6_VFD1_I3"]
["UL13_6_VFD1","IO0","UL13_6_VFD1_IO0","UL13_8_S2_PB"]
["UL13_6_VFD1","IO1","UL13_6_VFD1_IO1","UL13_8_S2_PB_LT"]
["UL13_6_VFD1","SI0","UL13_6_VFD1_SI0"]
["UL13_6_VFD1","SI1","UL13_6_VFD1_SI1"]
["UL13_6_VFD1","SI2","UL13_6_VFD1_SI2"]
["UL13_6_VFD1","SI3","UL13_6_VFD1_SI3"]
["UL13_6_VFD1","SO0","UL13_6_VFD1_SO0"]
["UL13_7_VFD1","I0","UL13_7_VFD1_I0","UL13_7_DISC"]
["UL13_7_VFD1","I1","UL13_7_VFD1_I1","UL13_7_ENC1"]
["UL13_7_VFD1","I2","UL13_7_VFD1_I2","UL13_7_TPE1"]
["UL13_7_VFD1","I3","UL13_7_VFD1_I3"]
["UL13_7_VFD1","IO0","UL13_7_VFD1_IO0","UL13_8_S1_PB"]
["UL13_7_VFD1","IO1","UL13_7_VFD1_IO1","UL13_8_S1_PB_LT"]
["UL13_7_VFD1","SI0","UL13_7_VFD1_SI0"]
["UL13_7_VFD1","SI1","UL13_7_VFD1_SI1"]
["UL13_7_VFD1","SI2","UL13_7_VFD1_SI2"]
["UL13_7_VFD1","SI3","UL13_7_VFD1_SI3"]
["UL13_7_VFD1","SO0","UL13_7_VFD1_SO0"]
["UL13_8_VFD1","I0","UL13_8_VFD1_I0","UL13_8_DISC"]
["UL13_8_VFD1","I1","UL13_8_VFD1_I1","UL13_8_ENC1"]
["UL13_8_VFD1","I2","UL13_8_VFD1_I2","UL13_8_TPE1"]
["UL13_8_VFD1","I3","UL13_8_VFD1_I3","UL13_8_TPE2"]
["UL13_8_VFD1","IO0","UL13_8_VFD1_IO0","UL13_8_BCN1_A"]
["UL13_8_VFD1","IO1","UL13_8_VFD1_IO1","UL13_8_BCN1_R"]
["UL13_8_VFD1","SI0","UL13_8_VFD1_SI0","UL13_8_EPC1"]
["UL13_8_VFD1","SI1","UL13_8_VFD1_SI1","UL13_8_EPC1_2"]
["UL13_8_VFD1","SI2","UL13_8_VFD1_SI2","UL13_8_EPC2"]
["UL13_8_VFD1","SI3","UL13_8_VFD1_SI3","UL13_8_EPC2_2"]
["UL13_8_VFD1","SO0","UL13_8_VFD1_SO0","UL13_8_BCN2_R"]
["UL13_9A_VFD1","I0","UL13_9A_VFD1_I0","UL13_9A_DISC"]
["UL13_9A_VFD1","I1","UL13_9A_VFD1_I1","UL13_8_TPE3"]
["UL13_9A_VFD1","I2","UL13_9A_VFD1_I2","UL13_8_TPE4"]
["UL13_9A_VFD1","I3","UL13_9A_VFD1_I3","UL13_8_TPE5"]
["UL13_9A_VFD1","IO0","UL13_9A_VFD1_IO0","UL13_8_JR1_PB"]
["UL13_9A_VFD1","IO1","UL13_9A_VFD1_IO1","UL13_8_JR1_PB_LT"]
["UL13_9A_VFD1","SI0","UL13_9A_VFD1_SI0"]
["UL13_9A_VFD1","SI1","UL13_9A_VFD1_SI1"]
["UL13_9A_VFD1","SI2","UL13_9A_VFD1_SI2"]
["UL13_9A_VFD1","SI3","UL13_9A_VFD1_SI3"]
["UL13_9A_VFD1","SO0","UL13_9A_VFD1_SO0"]
["UL13_9B_VFD1","I0","UL13_9B_VFD1_I0","UL13_9B_DISC"]
["UL13_9B_VFD1","I1","UL13_9B_VFD1_I1"]
["UL13_9B_VFD1","I2","UL13_9B_VFD1_I2"]
["UL13_9B_VFD1","I3","UL13_9B_VFD1_I3"]
["UL13_9B_VFD1","IO0","UL13_9B_VFD1_IO0","UL13_8_JR2_PB"]
["UL13_9B_VFD1","IO1","UL13_9B_VFD1_IO1","UL13_8_JR2_PB_LT"]
["UL13_9B_VFD1","SI0","UL13_9B_VFD1_SI0"]
["UL13_9B_VFD1","SI1","UL13_9B_VFD1_SI1"]
["UL13_9B_VFD1","SI2","UL13_9B_VFD1_SI2"]
["UL13_9B_VFD1","SI3","UL13_9B_VFD1_SI3"]
["UL13_9B_VFD1","SO0","UL13_9B_VFD1_SO0"]
["UL14_10_VFD1","I0","UL14_10_VFD1_I0","UL14_10_DISC"]
["UL14_10_VFD1","I1","UL14_10_VFD1_I1"]
["UL14_10_VFD1","I2","UL14_10_VFD1_I2"]
["UL14_10_VFD1","I3","UL14_10_VFD1_I3"]
["UL14_10_VFD1","IO0","UL14_10_VFD1_IO0"]
["UL14_10_VFD1","IO1","UL14_10_VFD1_IO1"]
["UL14_10_VFD1","SI0","UL14_10_VFD1_SI0"]
["UL14_10_VFD1","SI1","UL14_10_VFD1_SI1"]
["UL14_10_VFD1","SI2","UL14_10_VFD1_SI2"]
["UL14_10_VFD1","SI3","UL14_10_VFD1_SI3"]
["UL14_10_VFD1","SO0","UL14_10_VFD1_SO0"]
["UL14_3_VFD1","I0","UL14_3_VFD1_I0","UL14_3_DISC"]
["UL14_3_VFD1","I1","UL14_3_VFD1_I1","UL14_3_ENC1"]
["UL14_3_VFD1","I2","UL14_3_VFD1_I2","UL14_3_TPE1"]
["UL14_3_VFD1","I3","UL14_3_VFD1_I3","UL14_3_TPE2"]
["UL14_3_VFD1","IO0","UL14_3_VFD1_IO0"]
["UL14_3_VFD1","IO1","UL14_3_VFD1_IO1"]
["UL14_3_VFD1","SI0","UL14_3_VFD1_SI0","UL14_3_EPC1"]
["UL14_3_VFD1","SI1","UL14_3_VFD1_SI1","UL14_3_EPC1_2"]
["UL14_3_VFD1","SI2","UL14_3_VFD1_SI2","UL14_3_EPC2"]
["UL14_3_VFD1","SI3","UL14_3_VFD1_SI3","UL14_3_EPC2_2"]
["UL14_3_VFD1","SO0","UL14_3_VFD1_SO0","UL14_1_STO1","E-STOP OK"]
["UL14_4_VFD1","I0","UL14_4_VFD1_I0","UL14_4_DISC"]
["UL14_4_VFD1","I1","UL14_4_VFD1_I1","UL14_4_ENC1"]
["UL14_4_VFD1","I2","UL14_4_VFD1_I2","UL14_4_TPE1"]
["UL14_4_VFD1","I3","UL14_4_VFD1_I3"]
["UL14_4_VFD1","IO0","UL14_4_VFD1_IO0","UL14_4_S1_PB"]
["UL14_4_VFD1","IO1","UL14_4_VFD1_IO1","UL14_4_S1_PB_LT"]
["UL14_4_VFD1","SI0","UL14_4_VFD1_SI0","UL14_4_EPC1"]
["UL14_4_VFD1","SI1","UL14_4_VFD1_SI1","UL14_4_EPC1_2"]
["UL14_4_VFD1","SI2","UL14_4_VFD1_SI2","UL14_4_EPC2"]
["UL14_4_VFD1","SI3","UL14_4_VFD1_SI3","UL14_4_EPC2_2"]
["UL14_4_VFD1","SO0","UL14_4_VFD1_SO0","UL14_4_BCN1_R"]
["UL14_5_VFD1","I0","UL14_5_VFD1_I0","UL14_5_DISC"]
["UL14_5_VFD1","I1","UL14_5_VFD1_I1","UL14_5_ENC1"]
["UL14_5_VFD1","I2","UL14_5_VFD1_I2","UL14_5_TPE1"]
["UL14_5_VFD1","I3","UL14_5_VFD1_I3"]
["UL14_5_VFD1","IO0","UL14_5_VFD1_IO0","UL14_4_S2_PB"]
["UL14_5_VFD1","IO1","UL14_5_VFD1_IO1","UL14_4_S2_PB_LT"]
["UL14_5_VFD1","SI0","UL14_5_VFD1_SI0","UL14_1_ESTOP1"]
["UL14_5_VFD1","SI1","UL14_5_VFD1_SI1"]
["UL14_5_VFD1","SI2","UL14_5_VFD1_SI2"]
["UL14_5_VFD1","SI3","UL14_5_VFD1_SI3"]
["UL14_5_VFD1","SO0","UL14_5_VFD1_SO0","UL14_4_BCN2_R"]
["UL14_6_VFD1","I0","UL14_6_VFD1_I0","UL14_6_DISC"]
["UL14_6_VFD1","I1","UL14_6_VFD1_I1","UL14_6_ENC1"]
["UL14_6_VFD1","I2","UL14_6_VFD1_I2"]
["UL14_6_VFD1","I3","UL14_6_VFD1_I3"]
["UL14_6_VFD1","IO0","UL14_6_VFD1_IO0"]
["UL14_6_VFD1","IO1","UL14_6_VFD1_IO1"]
["UL14_6_VFD1","SI0","UL14_6_VFD1_SI0"]
["UL14_6_VFD1","SI1","UL14_6_VFD1_SI1"]
["UL14_6_VFD1","SI2","UL14_6_VFD1_SI2"]
["UL14_6_VFD1","SI3","UL14_6_VFD1_SI3"]
["UL14_6_VFD1","SO0","UL14_6_VFD1_SO0"]
["UL14_7_VFD1","I0","UL14_7_VFD1_I0","UL14_7_DISC"]
["UL14_7_VFD1","I1","UL14_7_VFD1_I1","UL14_7_ENC1"]
["UL14_7_VFD1","I2","UL14_7_VFD1_I2","UL14_7_TPE1"]
["UL14_7_VFD1","I3","UL14_7_VFD1_I3","UL14_7_TPE2"]
["UL14_7_VFD1","IO0","UL14_7_VFD1_IO0"]
["UL14_7_VFD1","IO1","UL14_7_VFD1_IO1"]
["UL14_7_VFD1","SI0","UL14_7_VFD1_SI0"]
["UL14_7_VFD1","SI1","UL14_7_VFD1_SI1"]
["UL14_7_VFD1","SI2","UL14_7_VFD1_SI2"]
["UL14_7_VFD1","SI3","UL14_7_VFD1_SI3"]
["UL14_7_VFD1","SO0","UL14_7_VFD1_SO0"]
["UL14_8_VFD1","I0","UL14_8_VFD1_I0","UL14_8_DISC"]
["UL14_8_VFD1","I1","UL14_8_VFD1_I1","UL14_8_ENC1"]
["UL14_8_VFD1","I2","UL14_8_VFD1_I2","UL14_8_TPE1"]
["UL14_8_VFD1","I3","UL14_8_VFD1_I3"]
["UL14_8_VFD1","IO0","UL14_8_VFD1_IO0"]
["UL14_8_VFD1","IO1","UL14_8_VFD1_IO1"]
["UL14_8_VFD1","SI0","UL14_8_VFD1_SI0"]
["UL14_8_VFD1","SI1","UL14_8_VFD1_SI1"]
["UL14_8_VFD1","SI2","UL14_8_VFD1_SI2"]
["UL14_8_VFD1","SI3","UL14_8_VFD1_SI3"]
["UL14_8_VFD1","SO0","UL14_8_VFD1_SO0"]
["UL14_9_VFD1","I0","UL14_9_VFD1_I0","UL14_9_DISC"]
["UL14_9_VFD1","I1","UL14_9_VFD1_I1","UL14_9_ENC1"]
["UL14_9_VFD1","I2","UL14_9_VFD1_I2","UL14_9_TPE1"]
["UL14_9_VFD1","I3","UL14_9_VFD1_I3"]
["UL14_9_VFD1","IO0","UL14_9_VFD1_IO0"]
["UL14_9_VFD1","IO1","UL14_9_VFD1_IO1"]
["UL14_9_VFD1","SI0","UL14_9_VFD1_SI0"]
["UL14_9_VFD1","SI1","UL14_9_VFD1_SI1"]
["UL14_9_VFD1","SI2","UL14_9_VFD1_SI2"]
["UL14_9_VFD1","SI3","UL14_9_VFD1_SI3"]
["UL14_9_VFD1","SO0","UL14_9_VFD1_SO0"]
["UL15_10_VFD1","I0","UL15_10_VFD1_I0","UL15_10_DISC"]
["UL15_10_VFD1","I1","UL15_10_VFD1_I1","UL15_10_ENC1"]
["UL15_10_VFD1","I2","UL15_10_VFD1_I2","UL15_10_TPE1"]
["UL15_10_VFD1","I3","UL15_10_VFD1_I3"]
["UL15_10_VFD1","IO0","UL15_10_VFD1_IO0"]
["UL15_10_VFD1","IO1","UL15_10_VFD1_IO1"]
["UL15_10_VFD1","SI0","UL15_10_VFD1_SI0"]
["UL15_10_VFD1","SI1","UL15_10_VFD1_SI1"]
["UL15_10_VFD1","SI2","UL15_10_VFD1_SI2"]
["UL15_10_VFD1","SI3","UL15_10_VFD1_SI3"]
["UL15_10_VFD1","SO0","UL15_10_VFD1_SO0"]
["UL15_11_VFD1","I0","UL15_11_VFD1_I0","UL15_11_DISC"]
["UL15_11_VFD1","I1","UL15_11_VFD1_I1","UL15_11_ENC1"]
["UL15_11_VFD1","I2","UL15_11_VFD1_I2"]
["UL15_11_VFD1","I3","UL15_11_VFD1_I3"]
["UL15_11_VFD1","IO0","UL15_11_VFD1_IO0"]
["UL15_11_VFD1","IO1","UL15_11_VFD1_IO1"]
["UL15_11_VFD1","SI0","UL15_11_VFD1_SI0"]
["UL15_11_VFD1","SI1","UL15_11_VFD1_SI1"]
["UL15_11_VFD1","SI2","UL15_11_VFD1_SI2"]
["UL15_11_VFD1","SI3","UL15_11_VFD1_SI3"]
["UL15_11_VFD1","SO0","UL15_11_VFD1_SO0"]
["UL15_3_VFD1","I0","UL15_3_VFD1_I0","UL15_3_DISC"]
["UL15_3_VFD1","I1","UL15_3_VFD1_I1","UL15_3_ENC1"]
["UL15_3_VFD1","I2","UL15_3_VFD1_I2","UL15_3_TPE1"]
["UL15_3_VFD1","I3","UL15_3_VFD1_I3","UL15_3_TPE2"]
["UL15_3_VFD1","IO0","UL15_3_VFD1_IO0"]
["UL15_3_VFD1","IO1","UL15_3_VFD1_IO1"]
["UL15_3_VFD1","SI0","UL15_3_VFD1_SI0","UL15_3_EPC1"]
["UL15_3_VFD1","SI1","UL15_3_VFD1_SI1","UL15_3_EPC1_2"]
["UL15_3_VFD1","SI2","UL15_3_VFD1_SI2","UL15_3_EPC2"]
["UL15_3_VFD1","SI3","UL15_3_VFD1_SI3","UL15_3_EPC2_2"]
["UL15_3_VFD1","SO0","UL15_3_VFD1_SO0","UL15_1_STO1","E-STOP OK"]
["UL15_4_VFD1","I0","UL15_4_VFD1_I0","UL15_4_DISC"]
["UL15_4_VFD1","I1","UL15_4_VFD1_I1","UL15_4_ENC1"]
["UL15_4_VFD1","I2","UL15_4_VFD1_I2","UL15_4_TPE1"]
["UL15_4_VFD1","I3","UL15_4_VFD1_I3"]
["UL15_4_VFD1","IO0","UL15_4_VFD1_IO0","UL15_4_S1_PB"]
["UL15_4_VFD1","IO1","UL15_4_VFD1_IO1","UL15_4_S1_PB_LT"]
["UL15_4_VFD1","SI0","UL15_4_VFD1_SI0","UL15_4_EPC1"]
["UL15_4_VFD1","SI1","UL15_4_VFD1_SI1","UL15_4_EPC1_2"]
["UL15_4_VFD1","SI2","UL15_4_VFD1_SI2","UL15_4_EPC2"]
["UL15_4_VFD1","SI3","UL15_4_VFD1_SI3","UL15_4_EPC2_2"]
["UL15_4_VFD1","SO0","UL15_4_VFD1_SO0","UL15_4_BCN1_R"]
["UL15_5_VFD1","I0","UL15_5_VFD1_I0","UL15_5_DISC"]
["UL15_5_VFD1","I1","UL15_5_VFD1_I1","UL15_5_ENC1"]
["UL15_5_VFD1","I2","UL15_5_VFD1_I2"]
["UL15_5_VFD1","I3","UL15_5_VFD1_I3"]
["UL15_5_VFD1","IO0","UL15_5_VFD1_IO0","UL15_4_S2_PB"]
["UL15_5_VFD1","IO1","UL15_5_VFD1_IO1","UL15_4_S2_PB_LT"]
["UL15_5_VFD1","SI0","UL15_5_VFD1_SI0","UL15_1_ESTOP1"]
["UL15_5_VFD1","SI1","UL15_5_VFD1_SI1"]
["UL15_5_VFD1","SI2","UL15_5_VFD1_SI2"]
["UL15_5_VFD1","SI3","UL15_5_VFD1_SI3"]
["UL15_5_VFD1","SO0","UL15_5_VFD1_SO0","UL15_4_BCN2_R"]
["UL15_6_VFD1","I0","UL15_6_VFD1_I0","UL15_6_DISC"]
["UL15_6_VFD1","I1","UL15_6_VFD1_I1","UL15_6_ENC1"]
["UL15_6_VFD1","I2","UL15_6_VFD1_I2","UL15_6_TPE1"]
["UL15_6_VFD1","I3","UL15_6_VFD1_I3","UL15_6_TPE2"]
["UL15_6_VFD1","IO0","UL15_6_VFD1_IO0"]
["UL15_6_VFD1","IO1","UL15_6_VFD1_IO1"]
["UL15_6_VFD1","SI0","UL15_6_VFD1_SI0"]
["UL15_6_VFD1","SI1","UL15_6_VFD1_SI1"]
["UL15_6_VFD1","SI2","UL15_6_VFD1_SI2"]
["UL15_6_VFD1","SI3","UL15_6_VFD1_SI3"]
["UL15_6_VFD1","SO0","UL15_6_VFD1_SO0"]
["UL15_7_VFD1","I0","UL15_7_VFD1_I0","UL15_7_DISC"]
["UL15_7_VFD1","I1","UL15_7_VFD1_I1","UL15_7_ENC1"]
["UL15_7_VFD1","I2","UL15_7_VFD1_I2","UL15_7_TPE1"]
["UL15_7_VFD1","I3","UL15_7_VFD1_I3"]
["UL15_7_VFD1","IO0","UL15_7_VFD1_IO0"]
["UL15_7_VFD1","IO1","UL15_7_VFD1_IO1"]
["UL15_7_VFD1","SI0","UL15_7_VFD1_SI0"]
["UL15_7_VFD1","SI1","UL15_7_VFD1_SI1"]
["UL15_7_VFD1","SI2","UL15_7_VFD1_SI2"]
["UL15_7_VFD1","SI3","UL15_7_VFD1_SI3"]
["UL15_7_VFD1","SO0","UL15_7_VFD1_SO0"]
["UL15_8_VFD1","I0","UL15_8_VFD1_I0","UL15_8_DISC"]
["UL15_8_VFD1","I1","UL15_8_VFD1_I1","UL15_8_ENC1"]
["UL15_8_VFD1","I2","UL15_8_VFD1_I2","UL15_8_TPE1"]
["UL15_8_VFD1","I3","UL15_8_VFD1_I3"]
["UL15_8_VFD1","IO0","UL15_8_VFD1_IO0"]
["UL15_8_VFD1","IO1","UL15_8_VFD1_IO1"]
["UL15_8_VFD1","SI0","UL15_8_VFD1_SI0"]
["UL15_8_VFD1","SI1","UL15_8_VFD1_SI1"]
["UL15_8_VFD1","SI2","UL15_8_VFD1_SI2"]
["UL15_8_VFD1","SI3","UL15_8_VFD1_SI3"]
["UL15_8_VFD1","SO0","UL15_8_VFD1_SO0"]
["UL15_9_VFD1","I0","UL15_9_VFD1_I0","UL15_9_DISC"]
["UL15_9_VFD1","I1","UL15_9_VFD1_I1","UL15_9_ENC1"]
["UL15_9_VFD1","I2","UL15_9_VFD1_I2","UL15_9_TPE1"]
["UL15_9_VFD1","I3","UL15_9_VFD1_I3"]
["UL15_9_VFD1","IO0","UL15_9_VFD1_IO0"]
["UL15_9_VFD1","IO1","UL15_9_VFD1_IO1"]
["UL15_9_VFD1","SI0","UL15_9_VFD1_SI0"]
["UL15_9_VFD1","SI1","UL15_9_VFD1_SI1"]
["UL15_9_VFD1","SI2","UL15_9_VFD1_SI2"]
["UL15_9_VFD1","SI3","UL15_9_VFD1_SI3"]
["UL15_9_VFD1","SO0","UL15_9_VFD1_SO0"]
["UL16_1_VFD1","I0","UL16_1_VFD1_I0","UL16_1_DISC"]
["UL16_1_VFD1","I1","UL16_1_VFD1_I1"]
["UL16_1_VFD1","I2","UL16_1_VFD1_I2","UL16_1_TPE1"]
["UL16_1_VFD1","I3","UL16_1_VFD1_I3","UL16_1_SS1_SPB"]
["UL16_1_VFD1","IO0","UL16_1_VFD1_IO0","UL16_1_SS1_STPB"]
["UL16_1_VFD1","IO1","UL16_1_VFD1_IO1","UL16_1_SS1_STPB_LT"]
["UL16_1_VFD1","SI0","UL16_1_VFD1_SI0","UL16_1_EPC1"]
["UL16_1_VFD1","SI1","UL16_1_VFD1_SI1","UL16_1_EPC1_2"]
["UL16_1_VFD1","SI2","UL16_1_VFD1_SI2","UL16_1_EPC2"]
["UL16_1_VFD1","SI3","UL16_1_VFD1_SI3","UL16_1_EPC2_2"]
["UL16_1_VFD1","SO0","UL16_1_VFD1_SO0"]
["UL16_2_VFD1","I0","UL16_2_VFD1_I0","UL16_2_DISC"]
["UL16_2_VFD1","I1","UL16_2_VFD1_I1","UL16_2_ENC1"]
["UL16_2_VFD1","I2","UL16_2_VFD1_I2","UL16_2_TPE1"]
["UL16_2_VFD1","I3","UL16_2_VFD1_I3","UL16_2_TPE2"]
["UL16_2_VFD1","IO0","UL16_2_VFD1_IO0"]
["UL16_2_VFD1","IO1","UL16_2_VFD1_IO1"]
["UL16_2_VFD1","SI0","UL16_2_VFD1_SI0","UL16_2_EPC1"]
["UL16_2_VFD1","SI1","UL16_2_VFD1_SI1","UL16_2_EPC1_2"]
["UL16_2_VFD1","SI2","UL16_2_VFD1_SI2","UL16_2_EPC2"]
["UL16_2_VFD1","SI3","UL16_2_VFD1_SI3","UL16_2_EPC2_2"]
["UL16_2_VFD1","SO0","UL16_2_VFD1_SO0"]
["UL16_3_VFD1","I0","UL16_3_VFD1_I0","UL16_3_DISC"]
["UL16_3_VFD1","I1","UL16_3_VFD1_I1"]
["UL16_3_VFD1","I2","UL16_3_VFD1_I2","UL16_3_TPE1"]
["UL16_3_VFD1","I3","UL16_3_VFD1_I3","UL16_3_TPE2"]
["UL16_3_VFD1","IO0","UL16_3_VFD1_IO0"]
["UL16_3_VFD1","IO1","UL16_3_VFD1_IO1"]
["UL16_3_VFD1","SI0","UL16_3_VFD1_SI0"]
["UL16_3_VFD1","SI1","UL16_3_VFD1_SI1"]
["UL16_3_VFD1","SI2","UL16_3_VFD1_SI2"]
["UL16_3_VFD1","SI3","UL16_3_VFD1_SI3"]
["UL16_3_VFD1","SO0","UL16_3_VFD1_SO0","UL16_2_BCN3_R"]
["UL16_4_VFD1","I0","UL16_4_VFD1_I0","UL16_4_DISC"]
["UL16_4_VFD1","I1","UL16_4_VFD1_I1","UL16_4_ENC1"]
["UL16_4_VFD1","I2","UL16_4_VFD1_I2","UL16_4_TPE1"]
["UL16_4_VFD1","I3","UL16_4_VFD1_I3"]
["UL16_4_VFD1","IO0","UL16_4_VFD1_IO0"]
["UL16_4_VFD1","IO1","UL16_4_VFD1_IO1"]
["UL16_4_VFD1","SI0","UL16_4_VFD1_SI0"]
["UL16_4_VFD1","SI1","UL16_4_VFD1_SI1"]
["UL16_4_VFD1","SI2","UL16_4_VFD1_SI2"]
["UL16_4_VFD1","SI3","UL16_4_VFD1_SI3"]
["UL16_4_VFD1","SO0","UL16_4_VFD1_SO0","UL16_2_BCN4_R"]
["UL16_5_VFD1","I0","UL16_5_VFD1_I0","UL16_5_DISC"]
["UL16_5_VFD1","I1","UL16_5_VFD1_I1","UL16_5_ENC1"]
["UL16_5_VFD1","I2","UL16_5_VFD1_I2"]
["UL16_5_VFD1","I3","UL16_5_VFD1_I3"]
["UL16_5_VFD1","IO0","UL16_5_VFD1_IO0"]
["UL16_5_VFD1","IO1","UL16_5_VFD1_IO1"]
["UL16_5_VFD1","SI0","UL16_5_VFD1_SI0"]
["UL16_5_VFD1","SI1","UL16_5_VFD1_SI1"]
["UL16_5_VFD1","SI2","UL16_5_VFD1_SI2"]
["UL16_5_VFD1","SI3","UL16_5_VFD1_SI3"]
["UL16_5_VFD1","SO0","UL16_5_VFD1_SO0"]
["UL16_6_VFD1","I0","UL16_6_VFD1_I0","UL16_6_DISC"]
["UL16_6_VFD1","I1","UL16_6_VFD1_I1","UL16_6_ENC1"]
["UL16_6_VFD1","I2","UL16_6_VFD1_I2","UL16_6_TPE1"]
["UL16_6_VFD1","I3","UL16_6_VFD1_I3","UL16_6_TPE2"]
["UL16_6_VFD1","IO0","UL16_6_VFD1_IO0"]
["UL16_6_VFD1","IO1","UL16_6_VFD1_IO1"]
["UL16_6_VFD1","SI0","UL16_6_VFD1_SI0"]
["UL16_6_VFD1","SI1","UL16_6_VFD1_SI1"]
["UL16_6_VFD1","SI2","UL16_6_VFD1_SI2"]
["UL16_6_VFD1","SI3","UL16_6_VFD1_SI3"]
["UL16_6_VFD1","SO0","UL16_6_VFD1_SO0"]
["UL16_7_VFD1","I0","UL16_7_VFD1_I0","UL16_7_DISC"]
["UL16_7_VFD1","I1","UL16_7_VFD1_I1","UL16_7_ENC1"]
["UL16_7_VFD1","I2","UL16_7_VFD1_I2","UL16_7_TPE1"]
["UL16_7_VFD1","I3","UL16_7_VFD1_I3"]
["UL16_7_VFD1","IO0","UL16_7_VFD1_IO0"]
["UL16_7_VFD1","IO1","UL16_7_VFD1_IO1"]
["UL16_7_VFD1","SI0","UL16_7_VFD1_SI0"]
["UL16_7_VFD1","SI1","UL16_7_VFD1_SI1"]
["UL16_7_VFD1","SI2","UL16_7_VFD1_SI2"]
["UL16_7_VFD1","SI3","UL16_7_VFD1_SI3"]
["UL16_7_VFD1","SO0","UL16_7_VFD1_SO0"]
["UL16_8_VFD1","I0","UL16_8_VFD1_I0","UL16_8_DISC"]
["UL16_8_VFD1","I1","UL16_8_VFD1_I1","UL16_8_ENC1"]
["UL16_8_VFD1","I2","UL16_8_VFD1_I2","UL16_8_TPE1"]
["UL16_8_VFD1","I3","UL16_8_VFD1_I3"]
["UL16_8_VFD1","IO0","UL16_8_VFD1_IO0"]
["UL16_8_VFD1","IO1","UL16_8_VFD1_IO1"]
["UL16_8_VFD1","SI0","UL16_8_VFD1_SI0"]
["UL16_8_VFD1","SI1","UL16_8_VFD1_SI1"]
["UL16_8_VFD1","SI2","UL16_8_VFD1_SI2"]
["UL16_8_VFD1","SI3","UL16_8_VFD1_SI3"]
["UL16_8_VFD1","SO0","UL16_8_VFD1_SO0"]
["UL16_9_VFD1","I0","UL16_9_VFD1_I0","UL16_9_DISC"]
["UL16_9_VFD1","I1","UL16_9_VFD1_I1"]
["UL16_9_VFD1","I2","UL16_9_VFD1_I2"]
["UL16_9_VFD1","I3","UL16_9_VFD1_I3"]
["UL16_9_VFD1","IO0","UL16_9_VFD1_IO0"]
["UL16_9_VFD1","IO1","UL16_9_VFD1_IO1"]
["UL16_9_VFD1","SI0","UL16_9_VFD1_SI0"]
["UL16_9_VFD1","SI1","UL16_9_VFD1_SI1"]
["UL16_9_VFD1","SI2","UL16_9_VFD1_SI2"]
["UL16_9_VFD1","SI3","UL16_9_VFD1_SI3"]
["UL16_9_VFD1","SO0","UL16_9_VFD1_SO0"]
["UL17_10_VFD1","I0","UL17_10_VFD1_I0","UL17_10_DISC"]
["UL17_10_VFD1","I1","UL17_10_VFD1_I1"]
["UL17_10_VFD1","I2","UL17_10_VFD1_I2"]
["UL17_10_VFD1","I3","UL17_10_VFD1_I3"]
["UL17_10_VFD1","IO0","UL17_10_VFD1_IO0"]
["UL17_10_VFD1","IO1","UL17_10_VFD1_IO1"]
["UL17_10_VFD1","SI0","UL17_10_VFD1_SI0"]
["UL17_10_VFD1","SI1","UL17_10_VFD1_SI1"]
["UL17_10_VFD1","SI2","UL17_10_VFD1_SI2"]
["UL17_10_VFD1","SI3","UL17_10_VFD1_SI3"]
["UL17_10_VFD1","SO0","UL17_10_VFD1_SO0"]
["UL17_3_VFD1","I0","UL17_3_VFD1_I0","UL17_3_DISC"]
["UL17_3_VFD1","I1","UL17_3_VFD1_I1","UL17_3_ENC1"]
["UL17_3_VFD1","I2","UL17_3_VFD1_I2","UL17_3_TPE1"]
["UL17_3_VFD1","I3","UL17_3_VFD1_I3"]
["UL17_3_VFD1","IO0","UL17_3_VFD1_IO0"]
["UL17_3_VFD1","IO1","UL17_3_VFD1_IO1"]
["UL17_3_VFD1","SI0","UL17_3_VFD1_SI0","UL17_3_EPC1"]
["UL17_3_VFD1","SI1","UL17_3_VFD1_SI1","UL17_3_EPC1_2"]
["UL17_3_VFD1","SI2","UL17_3_VFD1_SI2","UL17_3_EPC2"]
["UL17_3_VFD1","SI3","UL17_3_VFD1_SI3","UL17_3_EPC2_2"]
["UL17_3_VFD1","SO0","UL17_3_VFD1_SO0","UL17_1_STO1","E-STOP OK"]
["UL17_4_VFD1","I0","UL17_4_VFD1_I0","UL17_4_DISC"]
["UL17_4_VFD1","I1","UL17_4_VFD1_I1","UL17_4_ENC1"]
["UL17_4_VFD1","I2","UL17_4_VFD1_I2","UL17_4_TPE1"]
["UL17_4_VFD1","I3","UL17_4_VFD1_I3"]
["UL17_4_VFD1","IO0","UL17_4_VFD1_IO0","UL17_4_S1_PB"]
["UL17_4_VFD1","IO1","UL17_4_VFD1_IO1","UL17_4_S1_PB_LT"]
["UL17_4_VFD1","SI0","UL17_4_VFD1_SI0","UL17_4_EPC1"]
["UL17_4_VFD1","SI1","UL17_4_VFD1_SI1","UL17_4_EPC1_2"]
["UL17_4_VFD1","SI2","UL17_4_VFD1_SI2","UL17_4_EPC2"]
["UL17_4_VFD1","SI3","UL17_4_VFD1_SI3","UL17_4_EPC2_2"]
["UL17_4_VFD1","SO0","UL17_4_VFD1_SO0","UL17_4_BCN1_R"]
["UL17_5_VFD1","I0","UL17_5_VFD1_I0","UL17_5_DISC"]
["UL17_5_VFD1","I1","UL17_5_VFD1_I1","UL17_5_ENC1"]
["UL17_5_VFD1","I2","UL17_5_VFD1_I2","UL17_5_TPE1"]
["UL17_5_VFD1","I3","UL17_5_VFD1_I3"]
["UL17_5_VFD1","IO0","UL17_5_VFD1_IO0","UL17_4_S2_PB"]
["UL17_5_VFD1","IO1","UL17_5_VFD1_IO1","UL17_4_S2_PB_LT"]
["UL17_5_VFD1","SI0","UL17_5_VFD1_SI0","UL17_1_ESTOP1"]
["UL17_5_VFD1","SI1","UL17_5_VFD1_SI1"]
["UL17_5_VFD1","SI2","UL17_5_VFD1_SI2"]
["UL17_5_VFD1","SI3","UL17_5_VFD1_SI3"]
["UL17_5_VFD1","SO0","UL17_5_VFD1_SO0","UL17_4_BCN2_R"]
["UL17_6_VFD1","I0","UL17_6_VFD1_I0","UL17_6_DISC"]
["UL17_6_VFD1","I1","UL17_6_VFD1_I1","UL17_6_ENC1"]
["UL17_6_VFD1","I2","UL17_6_VFD1_I2"]
["UL17_6_VFD1","I3","UL17_6_VFD1_I3"]
["UL17_6_VFD1","IO0","UL17_6_VFD1_IO0"]
["UL17_6_VFD1","IO1","UL17_6_VFD1_IO1"]
["UL17_6_VFD1","SI0","UL17_6_VFD1_SI0"]
["UL17_6_VFD1","SI1","UL17_6_VFD1_SI1"]
["UL17_6_VFD1","SI2","UL17_6_VFD1_SI2"]
["UL17_6_VFD1","SI3","UL17_6_VFD1_SI3"]
["UL17_6_VFD1","SO0","UL17_6_VFD1_SO0"]
["UL17_7_VFD1","I0","UL17_7_VFD1_I0","UL17_7_DISC"]
["UL17_7_VFD1","I1","UL17_7_VFD1_I1","UL17_7_ENC1"]
["UL17_7_VFD1","I2","UL17_7_VFD1_I2","UL17_7_TPE1"]
["UL17_7_VFD1","I3","UL17_7_VFD1_I3","UL17_7_TPE2"]
["UL17_7_VFD1","IO0","UL17_7_VFD1_IO0"]
["UL17_7_VFD1","IO1","UL17_7_VFD1_IO1"]
["UL17_7_VFD1","SI0","UL17_7_VFD1_SI0"]
["UL17_7_VFD1","SI1","UL17_7_VFD1_SI1"]
["UL17_7_VFD1","SI2","UL17_7_VFD1_SI2"]
["UL17_7_VFD1","SI3","UL17_7_VFD1_SI3"]
["UL17_7_VFD1","SO0","UL17_7_VFD1_SO0"]
["UL17_8_VFD1","I0","UL17_8_VFD1_I0","UL17_8_DISC"]
["UL17_8_VFD1","I1","UL17_8_VFD1_I1","UL17_8_ENC1"]
["UL17_8_VFD1","I2","UL17_8_VFD1_I2","UL17_8_TPE1"]
["UL17_8_VFD1","I3","UL17_8_VFD1_I3"]
["UL17_8_VFD1","IO0","UL17_8_VFD1_IO0"]
["UL17_8_VFD1","IO1","UL17_8_VFD1_IO1"]
["UL17_8_VFD1","SI0","UL17_8_VFD1_SI0"]
["UL17_8_VFD1","SI1","UL17_8_VFD1_SI1"]
["UL17_8_VFD1","SI2","UL17_8_VFD1_SI2"]
["UL17_8_VFD1","SI3","UL17_8_VFD1_SI3"]
["UL17_8_VFD1","SO0","UL17_8_VFD1_SO0"]
["UL17_9_VFD1","I0","UL17_9_VFD1_I0","UL17_9_DISC"]
["UL17_9_VFD1","I1","UL17_9_VFD1_I1","UL17_9_ENC1"]
["UL17_9_VFD1","I2","UL17_9_VFD1_I2","UL17_9_TPE1"]
["UL17_9_VFD1","I3","UL17_9_VFD1_I3"]
["UL17_9_VFD1","IO0","UL17_9_VFD1_IO0"]
["UL17_9_VFD1","IO1","UL17_9_VFD1_IO1"]
["UL17_9_VFD1","SI0","UL17_9_VFD1_SI0"]
["UL17_9_VFD1","SI1","UL17_9_VFD1_SI1"]
["UL17_9_VFD1","SI2","UL17_9_VFD1_SI2"]
["UL17_9_VFD1","SI3","UL17_9_VFD1_SI3"]
["UL17_9_VFD1","SO0","UL17_9_VFD1_SO0"]
["UL18_10_VFD1","I0","UL18_10_VFD1_I0","UL18_10_DISC"]
["UL18_10_VFD1","I1","UL18_10_VFD1_I1","UL18_10_ENC1"]
["UL18_10_VFD1","I2","UL18_10_VFD1_I2","UL18_10_TPE3"]
["UL18_10_VFD1","I3","UL18_10_VFD1_I3","UL18_10_TPE4"]
["UL18_10_VFD1","IO0","UL18_10_VFD1_IO0","UL18_10_JR1_PB"]
["UL18_10_VFD1","IO1","UL18_10_VFD1_IO1","UL18_10_JR1_PB_LT"]
["UL18_10_VFD1","SI0","UL18_10_VFD1_SI0","UL18_10_EPC1"]
["UL18_10_VFD1","SI1","UL18_10_VFD1_SI1","UL18_10_EPC1_2"]
["UL18_10_VFD1","SI2","UL18_10_VFD1_SI2","UL18_10_EPC2"]
["UL18_10_VFD1","SI3","UL18_10_VFD1_SI3","UL18_10_EPC2_2"]
["UL18_10_VFD1","SO0","UL18_10_VFD1_SO0","UL18_10_BCN2_R"]
["UL18_11_VFD1","I0","UL18_11_VFD1_I0","UL18_11_DISC"]
["UL18_11_VFD1","I1","UL18_11_VFD1_I1","UL18_11_ENC1"]
["UL18_11_VFD1","I2","UL18_11_VFD1_I2","UL18_10_TPE5"]
["UL18_11_VFD1","I3","UL18_11_VFD1_I3"]
["UL18_11_VFD1","IO0","UL18_11_VFD1_IO0","UL18_10_JR2_PB"]
["UL18_11_VFD1","IO1","UL18_11_VFD1_IO1","UL18_10_JR2_PB_LT"]
["UL18_11_VFD1","SI0","UL18_11_VFD1_SI0"]
["UL18_11_VFD1","SI1","UL18_11_VFD1_SI1"]
["UL18_11_VFD1","SI2","UL18_11_VFD1_SI2"]
["UL18_11_VFD1","SI3","UL18_11_VFD1_SI3"]
["UL18_11_VFD1","SO0","UL18_11_VFD1_SO0"]
["UL18_12_VFD1","I0","UL18_12_VFD1_I0","UL18_12_DISC"]
["UL18_12_VFD1","I1","UL18_12_VFD1_I1","UL18_12_ENC1"]
["UL18_12_VFD1","I2","UL18_12_VFD1_I2","UL18_12_TPE1"]
["UL18_12_VFD1","I3","UL18_12_VFD1_I3","UL18_12_TPE2"]
["UL18_12_VFD1","IO0","UL18_12_VFD1_IO0","UL18_10_BCN1_A"]
["UL18_12_VFD1","IO1","UL18_12_VFD1_IO1","UL18_10_BCN1_R"]
["UL18_12_VFD1","SI0","UL18_12_VFD1_SI0"]
["UL18_12_VFD1","SI1","UL18_12_VFD1_SI1"]
["UL18_12_VFD1","SI2","UL18_12_VFD1_SI2"]
["UL18_12_VFD1","SI3","UL18_12_VFD1_SI3"]
["UL18_12_VFD1","SO0","UL18_12_VFD1_SO0"]
["UL18_13A_VFD1","I0","UL18_13A_VFD1_I0","UL18_13A_DISC"]
["UL18_13A_VFD1","I1","UL18_13A_VFD1_I1"]
["UL18_13A_VFD1","I2","UL18_13A_VFD1_I2"]
["UL18_13A_VFD1","I3","UL18_13A_VFD1_I3"]
["UL18_13A_VFD1","IO0","UL18_13A_VFD1_IO0"]
["UL18_13A_VFD1","IO1","UL18_13A_VFD1_IO1"]
["UL18_13A_VFD1","SI0","UL18_13A_VFD1_SI0"]
["UL18_13A_VFD1","SI1","UL18_13A_VFD1_SI1"]
["UL18_13A_VFD1","SI2","UL18_13A_VFD1_SI2"]
["UL18_13A_VFD1","SI3","UL18_13A_VFD1_SI3"]
["UL18_13A_VFD1","SO0","UL18_13A_VFD1_SO0"]
["UL18_13B_VFD1","I0","UL18_13B_VFD1_I0","UL18_13B_DISC"]
["UL18_13B_VFD1","I1","UL18_13B_VFD1_I1"]
["UL18_13B_VFD1","I2","UL18_13B_VFD1_I2"]
["UL18_13B_VFD1","I3","UL18_13B_VFD1_I3"]
["UL18_13B_VFD1","IO0","UL18_13B_VFD1_IO0"]
["UL18_13B_VFD1","IO1","UL18_13B_VFD1_IO1"]
["UL18_13B_VFD1","SI0","UL18_13B_VFD1_SI0"]
["UL18_13B_VFD1","SI1","UL18_13B_VFD1_SI1"]
["UL18_13B_VFD1","SI2","UL18_13B_VFD1_SI2"]
["UL18_13B_VFD1","SI3","UL18_13B_VFD1_SI3"]
["UL18_13B_VFD1","SO0","UL18_13B_VFD1_SO0"]
["UL18_14_VFD1","I0","UL18_14_VFD1_I0","UL18_14_DISC"]
["UL18_14_VFD1","I1","UL18_14_VFD1_I1","UL18_14_ENC1"]
["UL18_14_VFD1","I2","UL18_14_VFD1_I2","UL18_14_TPE1"]
["UL18_14_VFD1","I3","UL18_14_VFD1_I3","UL18_14_TPE2"]
["UL18_14_VFD1","IO0","UL18_14_VFD1_IO0"]
["UL18_14_VFD1","IO1","UL18_14_VFD1_IO1"]
["UL18_14_VFD1","SI0","UL18_14_VFD1_SI0"]
["UL18_14_VFD1","SI1","UL18_14_VFD1_SI1"]
["UL18_14_VFD1","SI2","UL18_14_VFD1_SI2"]
["UL18_14_VFD1","SI3","UL18_14_VFD1_SI3"]
["UL18_14_VFD1","SO0","UL18_14_VFD1_SO0"]
["UL18_15_VFD1","I0","UL18_15_VFD1_I0","UL18_15_DISC"]
["UL18_15_VFD1","I1","UL18_15_VFD1_I1","UL18_15_ENC1"]
["UL18_15_VFD1","I2","UL18_15_VFD1_I2","UL18_15_TPE1"]
["UL18_15_VFD1","I3","UL18_15_VFD1_I3"]
["UL18_15_VFD1","IO0","UL18_15_VFD1_IO0"]
["UL18_15_VFD1","IO1","UL18_15_VFD1_IO1"]
["UL18_15_VFD1","SI0","UL18_15_VFD1_SI0"]
["UL18_15_VFD1","SI1","UL18_15_VFD1_SI1"]
["UL18_15_VFD1","SI2","UL18_15_VFD1_SI2"]
["UL18_15_VFD1","SI3","UL18_15_VFD1_SI3"]
["UL18_15_VFD1","SO0","UL18_15_VFD1_SO0"]
["UL18_16_VFD1","I0","UL18_16_VFD1_I0","UL18_16_DISC"]
["UL18_16_VFD1","I1","UL18_16_VFD1_I1"]
["UL18_16_VFD1","I2","UL18_16_VFD1_I2"]
["UL18_16_VFD1","I3","UL18_16_VFD1_I3"]
["UL18_16_VFD1","IO0","UL18_16_VFD1_IO0"]
["UL18_16_VFD1","IO1","UL18_16_VFD1_IO1"]
["UL18_16_VFD1","SI0","UL18_16_VFD1_SI0"]
["UL18_16_VFD1","SI1","UL18_16_VFD1_SI1"]
["UL18_16_VFD1","SI2","UL18_16_VFD1_SI2"]
["UL18_16_VFD1","SI3","UL18_16_VFD1_SI3"]
["UL18_16_VFD1","SO0","UL18_16_VFD1_SO0"]
["UL18_3_VFD1","I0","UL18_3_VFD1_I0","UL18_3_DISC"]
["UL18_3_VFD1","I1","UL18_3_VFD1_I1","UL18_3_ENC1"]
["UL18_3_VFD1","I2","UL18_3_VFD1_I2","UL18_3_TPE1"]
["UL18_3_VFD1","I3","UL18_3_VFD1_I3","UL18_3_TPE2"]
["UL18_3_VFD1","IO0","UL18_3_VFD1_IO0"]
["UL18_3_VFD1","IO1","UL18_3_VFD1_IO1"]
["UL18_3_VFD1","SI0","UL18_3_VFD1_SI0","UL18_3_EPC1"]
["UL18_3_VFD1","SI1","UL18_3_VFD1_SI1","UL18_3_EPC1_2"]
["UL18_3_VFD1","SI2","UL18_3_VFD1_SI2","UL18_3_EPC2"]
["UL18_3_VFD1","SI3","UL18_3_VFD1_SI3","UL18_3_EPC2_2"]
["UL18_3_VFD1","SO0","UL18_3_VFD1_SO0","UL18_1_STO1","E-STOP OK"]
["UL18_4_VFD1","I0","UL18_4_VFD1_I0","UL18_4_DISC"]
["UL18_4_VFD1","I1","UL18_4_VFD1_I1","UL18_4_ENC1"]
["UL18_4_VFD1","I2","UL18_4_VFD1_I2","UL18_4_TPE1"]
["UL18_4_VFD1","I3","UL18_4_VFD1_I3"]
["UL18_4_VFD1","IO0","UL18_4_VFD1_IO0","UL18_4_S1_PB"]
["UL18_4_VFD1","IO1","UL18_4_VFD1_IO1","UL18_4_S1_PB_LT"]
["UL18_4_VFD1","SI0","UL18_4_VFD1_SI0","UL18_4_EPC1"]
["UL18_4_VFD1","SI1","UL18_4_VFD1_SI1","UL18_4_EPC1_2"]
["UL18_4_VFD1","SI2","UL18_4_VFD1_SI2","UL18_4_EPC2"]
["UL18_4_VFD1","SI3","UL18_4_VFD1_SI3","UL18_4_EPC2_2"]
["UL18_4_VFD1","SO0","UL18_4_VFD1_SO0","UL18_4_BCN1_R"]
["UL18_5_VFD1","I0","UL18_5_VFD1_I0","UL18_5_DISC"]
["UL18_5_VFD1","I1","UL18_5_VFD1_I1","UL18_5_ENC1"]
["UL18_5_VFD1","I2","UL18_5_VFD1_I2","UL18_5_TPE1"]
["UL18_5_VFD1","I3","UL18_5_VFD1_I3"]
["UL18_5_VFD1","IO0","UL18_5_VFD1_IO0","UL18_4_S2_PB"]
["UL18_5_VFD1","IO1","UL18_5_VFD1_IO1","UL18_4_S2_PB_LT"]
["UL18_5_VFD1","SI0","UL18_5_VFD1_SI0","UL18_1_ESTOP1"]
["UL18_5_VFD1","SI1","UL18_5_VFD1_SI1"]
["UL18_5_VFD1","SI2","UL18_5_VFD1_SI2"]
["UL18_5_VFD1","SI3","UL18_5_VFD1_SI3"]
["UL18_5_VFD1","SO0","UL18_5_VFD1_SO0","UL18_4_BCN2_R"]
["UL18_6_VFD1","I0","UL18_6_VFD1_I0","UL18_6_DISC"]
["UL18_6_VFD1","I1","UL18_6_VFD1_I1","UL18_6_ENC1"]
["UL18_6_VFD1","I2","UL18_6_VFD1_I2"]
["UL18_6_VFD1","I3","UL18_6_VFD1_I3"]
["UL18_6_VFD1","IO0","UL18_6_VFD1_IO0","UL18_10_S2_PB"]
["UL18_6_VFD1","IO1","UL18_6_VFD1_IO1","UL18_10_S2_PB_LT"]
["UL18_6_VFD1","SI0","UL18_6_VFD1_SI0"]
["UL18_6_VFD1","SI1","UL18_6_VFD1_SI1"]
["UL18_6_VFD1","SI2","UL18_6_VFD1_SI2"]
["UL18_6_VFD1","SI3","UL18_6_VFD1_SI3"]
["UL18_6_VFD1","SO0","UL18_6_VFD1_SO0"]
["UL18_7_VFD1","I0","UL18_7_VFD1_I0","UL18_7_DISC"]
["UL18_7_VFD1","I1","UL18_7_VFD1_I1","UL18_7_ENC1"]
["UL18_7_VFD1","I2","UL18_7_VFD1_I2","UL18_7_TPE1"]
["UL18_7_VFD1","I3","UL18_7_VFD1_I3","UL18_7_TPE2"]
["UL18_7_VFD1","IO0","UL18_7_VFD1_IO0","UL18_10_JR3_PB"]
["UL18_7_VFD1","IO1","UL18_7_VFD1_IO1","UL18_10_JR3_PB_LT"]
["UL18_7_VFD1","SI0","UL18_7_VFD1_SI0"]
["UL18_7_VFD1","SI1","UL18_7_VFD1_SI1"]
["UL18_7_VFD1","SI2","UL18_7_VFD1_SI2"]
["UL18_7_VFD1","SI3","UL18_7_VFD1_SI3"]
["UL18_7_VFD1","SO0","UL18_7_VFD1_SO0"]
["UL18_8_VFD1","I0","UL18_8_VFD1_I0","UL18_8_DISC"]
["UL18_8_VFD1","I1","UL18_8_VFD1_I1","UL18_8_ENC1"]
["UL18_8_VFD1","I2","UL18_8_VFD1_I2","UL18_8_TPE1"]
["UL18_8_VFD1","I3","UL18_8_VFD1_I3"]
["UL18_8_VFD1","IO0","UL18_8_VFD1_IO0","UL18_10_TPE1"]
["UL18_8_VFD1","IO1","UL18_8_VFD1_IO1","UL18_10_TPE2"]
["UL18_8_VFD1","SI0","UL18_8_VFD1_SI0"]
["UL18_8_VFD1","SI1","UL18_8_VFD1_SI1"]
["UL18_8_VFD1","SI2","UL18_8_VFD1_SI2"]
["UL18_8_VFD1","SI3","UL18_8_VFD1_SI3"]
["UL18_8_VFD1","SO0","UL18_8_VFD1_SO0"]
["UL18_9_VFD1","I0","UL18_9_VFD1_I0","UL18_9_DISC"]
["UL18_9_VFD1","I1","UL18_9_VFD1_I1","UL18_9_ENC1"]
["UL18_9_VFD1","I2","UL18_9_VFD1_I2","UL18_9_TPE1"]
["UL18_9_VFD1","I3","UL18_9_VFD1_I3","UL18_10_S1_PB"]
["UL18_9_VFD1","IO0","UL18_9_VFD1_IO0","UL18_10_S1_PB_LT"]
["UL18_9_VFD1","IO1","UL18_9_VFD1_IO1"]
["UL18_9_VFD1","SI0","UL18_9_VFD1_SI0"]
["UL18_9_VFD1","SI1","UL18_9_VFD1_SI1"]
["UL18_9_VFD1","SI2","UL18_9_VFD1_SI2"]
["UL18_9_VFD1","SI3","UL18_9_VFD1_SI3"]
["UL18_9_VFD1","SO0","UL18_9_VFD1_SO0"]
["UL19_1_VFD1","I0","UL19_1_VFD1_I0","UL19_1_DISC"]
["UL19_1_VFD1","I1","UL19_1_VFD1_I1"]
["UL19_1_VFD1","I2","UL19_1_VFD1_I2","UL19_1_TPE1"]
["UL19_1_VFD1","I3","UL19_1_VFD1_I3","UL19_1_SS1_SPB"]
["UL19_1_VFD1","IO0","UL19_1_VFD1_IO0","UL19_1_SS1_STPB"]
["UL19_1_VFD1","IO1","UL19_1_VFD1_IO1","UL19_1_SS1_STPB_LT"]
["UL19_1_VFD1","SI0","UL19_1_VFD1_SI0","UL19_1_EPC1"]
["UL19_1_VFD1","SI1","UL19_1_VFD1_SI1","UL19_1_EPC1_2"]
["UL19_1_VFD1","SI2","UL19_1_VFD1_SI2","UL19_1_EPC2"]
["UL19_1_VFD1","SI3","UL19_1_VFD1_SI3","UL19_1_EPC2_2"]
["UL19_1_VFD1","SO0","UL19_1_VFD1_SO0","UL19_1_BCN1_R"]
["UL19_2_VFD1","I0","UL19_2_VFD1_I0","UL19_2_DISC"]
["UL19_2_VFD1","I1","UL19_2_VFD1_I1","UL19_2_ENC1"]
["UL19_2_VFD1","I2","UL19_2_VFD1_I2","UL19_2_TPE1"]
["UL19_2_VFD1","I3","UL19_2_VFD1_I3","UL19_2_TPE2"]
["UL19_2_VFD1","IO0","UL19_2_VFD1_IO0"]
["UL19_2_VFD1","IO1","UL19_2_VFD1_IO1"]
["UL19_2_VFD1","SI0","UL19_2_VFD1_SI0","UL19_2_EPC1"]
["UL19_2_VFD1","SI1","UL19_2_VFD1_SI1","UL19_2_EPC1_2"]
["UL19_2_VFD1","SI2","UL19_2_VFD1_SI2","UL19_2_EPC2"]
["UL19_2_VFD1","SI3","UL19_2_VFD1_SI3","UL19_2_EPC2_2"]
["UL19_2_VFD1","SO0","UL19_2_VFD1_SO0","UL19_1_BCN2_R"]
["UL19_3_VFD1","I0","UL19_3_VFD1_I0","UL19_3_DISC"]
["UL19_3_VFD1","I1","UL19_3_VFD1_I1","UL19_3_ENC1"]
["UL19_3_VFD1","I2","UL19_3_VFD1_I2"]
["UL19_3_VFD1","I3","UL19_3_VFD1_I3"]
["UL19_3_VFD1","IO0","UL19_3_VFD1_IO0"]
["UL19_3_VFD1","IO1","UL19_3_VFD1_IO1"]
["UL19_3_VFD1","SI0","UL19_3_VFD1_SI0"]
["UL19_3_VFD1","SI1","UL19_3_VFD1_SI1"]
["UL19_3_VFD1","SI2","UL19_3_VFD1_SI2"]
["UL19_3_VFD1","SI3","UL19_3_VFD1_SI3"]
["UL19_3_VFD1","SO0","UL19_3_VFD1_SO0"]
["UL19_4_VFD1","I0","UL19_4_VFD1_I0","UL19_4_DISC"]
["UL19_4_VFD1","I1","UL19_4_VFD1_I1","UL19_4_ENC1"]
["UL19_4_VFD1","I2","UL19_4_VFD1_I2","UL19_4_TPE1"]
["UL19_4_VFD1","I3","UL19_4_VFD1_I3","UL19_4_TPE2"]
["UL19_4_VFD1","IO0","UL19_4_VFD1_IO0"]
["UL19_4_VFD1","IO1","UL19_4_VFD1_IO1"]
["UL19_4_VFD1","SI0","UL19_4_VFD1_SI0"]
["UL19_4_VFD1","SI1","UL19_4_VFD1_SI1"]
["UL19_4_VFD1","SI2","UL19_4_VFD1_SI2"]
["UL19_4_VFD1","SI3","UL19_4_VFD1_SI3"]
["UL19_4_VFD1","SO0","UL19_4_VFD1_SO0"]
["UL19_5_VFD1","I0","UL19_5_VFD1_I0","UL19_5_DISC"]
["UL19_5_VFD1","I1","UL19_5_VFD1_I1","UL19_5_ENC1"]
["UL19_5_VFD1","I2","UL19_5_VFD1_I2","UL19_5_TPE1"]
["UL19_5_VFD1","I3","UL19_5_VFD1_I3"]
["UL19_5_VFD1","IO0","UL19_5_VFD1_IO0"]
["UL19_5_VFD1","IO1","UL19_5_VFD1_IO1"]
["UL19_5_VFD1","SI0","UL19_5_VFD1_SI0"]
["UL19_5_VFD1","SI1","UL19_5_VFD1_SI1"]
["UL19_5_VFD1","SI2","UL19_5_VFD1_SI2"]
["UL19_5_VFD1","SI3","UL19_5_VFD1_SI3"]
["UL19_5_VFD1","SO0","UL19_5_VFD1_SO0"]
["UL19_6_VFD1","I0","UL19_6_VFD1_I0","UL19_6_DISC"]
["UL19_6_VFD1","I1","UL19_6_VFD1_I1","UL19_6_ENC1"]
["UL19_6_VFD1","I2","UL19_6_VFD1_I2","UL19_6_TPE1"]
["UL19_6_VFD1","I3","UL19_6_VFD1_I3"]
["UL19_6_VFD1","IO0","UL19_6_VFD1_IO0"]
["UL19_6_VFD1","IO1","UL19_6_VFD1_IO1"]
["UL19_6_VFD1","SI0","UL19_6_VFD1_SI0"]
["UL19_6_VFD1","SI1","UL19_6_VFD1_SI1"]
["UL19_6_VFD1","SI2","UL19_6_VFD1_SI2"]
["UL19_6_VFD1","SI3","UL19_6_VFD1_SI3"]
["UL19_6_VFD1","SO0","UL19_6_VFD1_SO0"]
["UL19_7_VFD1","I0","UL19_7_VFD1_I0","UL19_7_DISC"]
["UL19_7_VFD1","I1","UL19_7_VFD1_I1","UL19_7_ENC1"]
["UL19_7_VFD1","I2","UL19_7_VFD1_I2","UL19_7_TPE1"]
["UL19_7_VFD1","I3","UL19_7_VFD1_I3"]
["UL19_7_VFD1","IO0","UL19_7_VFD1_IO0"]
["UL19_7_VFD1","IO1","UL19_7_VFD1_IO1"]
["UL19_7_VFD1","SI0","UL19_7_VFD1_SI0"]
["UL19_7_VFD1","SI1","UL19_7_VFD1_SI1"]
["UL19_7_VFD1","SI2","UL19_7_VFD1_SI2"]
["UL19_7_VFD1","SI3","UL19_7_VFD1_SI3"]
["UL19_7_VFD1","SO0","UL19_7_VFD1_SO0"]
["UL19_8_VFD1","I0","UL19_8_VFD1_I0","UL19_8_DISC"]
["UL19_8_VFD1","I1","UL19_8_VFD1_I1","UL19_8_ENC1"]
["UL19_8_VFD1","I2","UL19_8_VFD1_I2","UL19_8_TPE1"]
["UL19_8_VFD1","I3","UL19_8_VFD1_I3"]
["UL19_8_VFD1","IO0","UL19_8_VFD1_IO0"]
["UL19_8_VFD1","IO1","UL19_8_VFD1_IO1"]
["UL19_8_VFD1","SI0","UL19_8_VFD1_SI0"]
["UL19_8_VFD1","SI1","UL19_8_VFD1_SI1"]
["UL19_8_VFD1","SI2","UL19_8_VFD1_SI2"]
["UL19_8_VFD1","SI3","UL19_8_VFD1_SI3"]
["UL19_8_VFD1","SO0","UL19_8_VFD1_SO0"]
["UL19_9_VFD1","I0","UL19_9_VFD1_I0","UL19_9_DISC"]
["UL19_9_VFD1","I1","UL19_9_VFD1_I1"]
["UL19_9_VFD1","I2","UL19_9_VFD1_I2"]
["UL19_9_VFD1","I3","UL19_9_VFD1_I3"]
["UL19_9_VFD1","IO0","UL19_9_VFD1_IO0"]
["UL19_9_VFD1","IO1","UL19_9_VFD1_IO1"]
["UL19_9_VFD1","SI0","UL19_9_VFD1_SI0"]
["UL19_9_VFD1","SI1","UL19_9_VFD1_SI1"]
["UL19_9_VFD1","SI2","UL19_9_VFD1_SI2"]
["UL19_9_VFD1","SI3","UL19_9_VFD1_SI3"]
["UL19_9_VFD1","SO0","UL19_9_VFD1_SO0"]
["UL20_10_VFD1","I0","UL20_10_VFD1_I0","UL20_10_DISC"]
["UL20_10_VFD1","I1","UL20_10_VFD1_I1","UL20_10_ENC1"]
["UL20_10_VFD1","I2","UL20_10_VFD1_I2","UL20_10_TPE1"]
["UL20_10_VFD1","I3","UL20_10_VFD1_I3"]
["UL20_10_VFD1","IO0","UL20_10_VFD1_IO0"]
["UL20_10_VFD1","IO1","UL20_10_VFD1_IO1"]
["UL20_10_VFD1","SI0","UL20_10_VFD1_SI0"]
["UL20_10_VFD1","SI1","UL20_10_VFD1_SI1"]
["UL20_10_VFD1","SI2","UL20_10_VFD1_SI2"]
["UL20_10_VFD1","SI3","UL20_10_VFD1_SI3"]
["UL20_10_VFD1","SO0","UL20_10_VFD1_SO0"]
["UL20_11_VFD1","I0","UL20_11_VFD1_I0","UL20_11_DISC"]
["UL20_11_VFD1","I1","UL20_11_VFD1_I1"]
["UL20_11_VFD1","I2","UL20_11_VFD1_I2"]
["UL20_11_VFD1","I3","UL20_11_VFD1_I3"]
["UL20_11_VFD1","IO0","UL20_11_VFD1_IO0"]
["UL20_11_VFD1","IO1","UL20_11_VFD1_IO1"]
["UL20_11_VFD1","SI0","UL20_11_VFD1_SI0"]
["UL20_11_VFD1","SI1","UL20_11_VFD1_SI1"]
["UL20_11_VFD1","SI2","UL20_11_VFD1_SI2"]
["UL20_11_VFD1","SI3","UL20_11_VFD1_SI3"]
["UL20_11_VFD1","SO0","UL20_11_VFD1_SO0"]
["UL20_3_VFD1","I0","UL20_3_VFD1_I0","UL20_3_DISC"]
["UL20_3_VFD1","I1","UL20_3_VFD1_I1","UL20_3_ENC1"]
["UL20_3_VFD1","I2","UL20_3_VFD1_I2","UL20_3_TPE1"]
["UL20_3_VFD1","I3","UL20_3_VFD1_I3","UL20_3_TPE2"]
["UL20_3_VFD1","IO0","UL20_3_VFD1_IO0"]
["UL20_3_VFD1","IO1","UL20_3_VFD1_IO1"]
["UL20_3_VFD1","SI0","UL20_3_VFD1_SI0","UL20_3_EPC1"]
["UL20_3_VFD1","SI1","UL20_3_VFD1_SI1","UL20_3_EPC1_2"]
["UL20_3_VFD1","SI2","UL20_3_VFD1_SI2","UL20_3_EPC2"]
["UL20_3_VFD1","SI3","UL20_3_VFD1_SI3","UL20_3_EPC2_2"]
["UL20_3_VFD1","SO0","UL20_3_VFD1_SO0","UL20_1_STO1","E-STOP OK"]
["UL20_4_VFD1","I0","UL20_4_VFD1_I0","UL20_4_DISC"]
["UL20_4_VFD1","I1","UL20_4_VFD1_I1","UL20_4_ENC1"]
["UL20_4_VFD1","I2","UL20_4_VFD1_I2","UL20_4_TPE1"]
["UL20_4_VFD1","I3","UL20_4_VFD1_I3"]
["UL20_4_VFD1","IO0","UL20_4_VFD1_IO0","UL20_4_S1_PB"]
["UL20_4_VFD1","IO1","UL20_4_VFD1_IO1","UL20_4_S1_PB_LT"]
["UL20_4_VFD1","SI0","UL20_4_VFD1_SI0","UL20_4_EPC1"]
["UL20_4_VFD1","SI1","UL20_4_VFD1_SI1","UL20_4_EPC1_2"]
["UL20_4_VFD1","SI2","UL20_4_VFD1_SI2","UL20_4_EPC2"]
["UL20_4_VFD1","SI3","UL20_4_VFD1_SI3","UL20_4_EPC2_2"]
["UL20_4_VFD1","SO0","UL20_4_VFD1_SO0","UL20_4_BCN1_R"]
["UL20_5_VFD1","I0","UL20_5_VFD1_I0","UL20_5_DISC"]
["UL20_5_VFD1","I1","UL20_5_VFD1_I1","UL20_5_ENC1"]
["UL20_5_VFD1","I2","UL20_5_VFD1_I2"]
["UL20_5_VFD1","I3","UL20_5_VFD1_I3"]
["UL20_5_VFD1","IO0","UL20_5_VFD1_IO0","UL20_4_S2_PB"]
["UL20_5_VFD1","IO1","UL20_5_VFD1_IO1","UL20_4_S2_PB_LT"]
["UL20_5_VFD1","SI0","UL20_5_VFD1_SI0","UL20_1_ESTOP1"]
["UL20_5_VFD1","SI1","UL20_5_VFD1_SI1"]
["UL20_5_VFD1","SI2","UL20_5_VFD1_SI2"]
["UL20_5_VFD1","SI3","UL20_5_VFD1_SI3"]
["UL20_5_VFD1","SO0","UL20_5_VFD1_SO0","UL20_4_BCN2_R"]
["UL20_6_VFD1","I0","UL20_6_VFD1_I0","UL20_6_DISC"]
["UL20_6_VFD1","I1","UL20_6_VFD1_I1","UL20_6_ENC1"]
["UL20_6_VFD1","I2","UL20_6_VFD1_I2","UL20_6_TPE1"]
["UL20_6_VFD1","I3","UL20_6_VFD1_I3","UL20_6_TPE2"]
["UL20_6_VFD1","IO0","UL20_6_VFD1_IO0"]
["UL20_6_VFD1","IO1","UL20_6_VFD1_IO1"]
["UL20_6_VFD1","SI0","UL20_6_VFD1_SI0"]
["UL20_6_VFD1","SI1","UL20_6_VFD1_SI1"]
["UL20_6_VFD1","SI2","UL20_6_VFD1_SI2"]
["UL20_6_VFD1","SI3","UL20_6_VFD1_SI3"]
["UL20_6_VFD1","SO0","UL20_6_VFD1_SO0"]
["UL20_7_VFD1","I0","UL20_7_VFD1_I0","UL20_7_DISC"]
["UL20_7_VFD1","I1","UL20_7_VFD1_I1","UL20_7_ENC1"]
["UL20_7_VFD1","I2","UL20_7_VFD1_I2","UL20_7_TPE1"]
["UL20_7_VFD1","I3","UL20_7_VFD1_I3"]
["UL20_7_VFD1","IO0","UL20_7_VFD1_IO0"]
["UL20_7_VFD1","IO1","UL20_7_VFD1_IO1"]
["UL20_7_VFD1","SI0","UL20_7_VFD1_SI0"]
["UL20_7_VFD1","SI1","UL20_7_VFD1_SI1"]
["UL20_7_VFD1","SI2","UL20_7_VFD1_SI2"]
["UL20_7_VFD1","SI3","UL20_7_VFD1_SI3"]
["UL20_7_VFD1","SO0","UL20_7_VFD1_SO0"]
["UL20_8_VFD1","I0","UL20_8_VFD1_I0","UL20_8_DISC"]
["UL20_8_VFD1","I1","UL20_8_VFD1_I1","UL20_8_ENC1"]
["UL20_8_VFD1","I2","UL20_8_VFD1_I2","UL20_8_TPE1"]
["UL20_8_VFD1","I3","UL20_8_VFD1_I3"]
["UL20_8_VFD1","IO0","UL20_8_VFD1_IO0"]
["UL20_8_VFD1","IO1","UL20_8_VFD1_IO1"]
["UL20_8_VFD1","SI0","UL20_8_VFD1_SI0"]
["UL20_8_VFD1","SI1","UL20_8_VFD1_SI1"]
["UL20_8_VFD1","SI2","UL20_8_VFD1_SI2"]
["UL20_8_VFD1","SI3","UL20_8_VFD1_SI3"]
["UL20_8_VFD1","SO0","UL20_8_VFD1_SO0"]
["UL20_9_VFD1","I0","UL20_9_VFD1_I0","UL20_9_DISC"]
["UL20_9_VFD1","I1","UL20_9_VFD1_I1","UL20_9_ENC1"]
["UL20_9_VFD1","I2","UL20_9_VFD1_I2","UL20_9_TPE1"]
["UL20_9_VFD1","I3","UL20_9_VFD1_I3"]
["UL20_9_VFD1","IO0","UL20_9_VFD1_IO0","UL21_11_TPE1"]
["UL20_9_VFD1","IO1","UL20_9_VFD1_IO1","UL21_11_TPE2"]
["UL20_9_VFD1","SI0","UL20_9_VFD1_SI0"]
["UL20_9_VFD1","SI1","UL20_9_VFD1_SI1"]
["UL20_9_VFD1","SI2","UL20_9_VFD1_SI2"]
["UL20_9_VFD1","SI3","UL20_9_VFD1_SI3"]
["UL20_9_VFD1","SO0","UL20_9_VFD1_SO0"]
["UL21_10_VFD1","I0","UL21_10_VFD1_I0","UL21_10_DISC"]
["UL21_10_VFD1","I1","UL21_10_VFD1_I1","UL21_10_ENC1"]
["UL21_10_VFD1","I2","UL21_10_VFD1_I2","UL21_10_TPE1"]
["UL21_10_VFD1","I3","UL21_10_VFD1_I3"]
["UL21_10_VFD1","IO0","UL21_10_VFD1_IO0","UL21_11_BCN1_A"]
["UL21_10_VFD1","IO1","UL21_10_VFD1_IO1","UL21_11_BCN1_R"]
["UL21_10_VFD1","SI0","UL21_10_VFD1_SI0"]
["UL21_10_VFD1","SI1","UL21_10_VFD1_SI1"]
["UL21_10_VFD1","SI2","UL21_10_VFD1_SI2"]
["UL21_10_VFD1","SI3","UL21_10_VFD1_SI3"]
["UL21_10_VFD1","SO0","UL21_10_VFD1_SO0","UL21_11_BCN2_R"]
["UL21_11_VFD1","I0","UL21_11_VFD1_I0","UL21_11_DISC"]
["UL21_11_VFD1","I1","UL21_11_VFD1_I1","UL21_11_ENC1"]
["UL21_11_VFD1","I2","UL21_11_VFD1_I2","UL21_11_TPE3"]
["UL21_11_VFD1","I3","UL21_11_VFD1_I3"]
["UL21_11_VFD1","IO0","UL21_11_VFD1_IO0","UL21_11_JR1_PB"]
["UL21_11_VFD1","IO1","UL21_11_VFD1_IO1","UL21_11_JR1_PB_LT"]
["UL21_11_VFD1","SI0","UL21_11_VFD1_SI0","UL21_11_EPC1"]
["UL21_11_VFD1","SI1","UL21_11_VFD1_SI1","UL21_11_EPC1_2"]
["UL21_11_VFD1","SI2","UL21_11_VFD1_SI2","UL21_11_EPC2"]
["UL21_11_VFD1","SI3","UL21_11_VFD1_SI3","UL21_11_EPC2_2"]
["UL21_11_VFD1","SO0","UL21_11_VFD1_SO0"]
["UL21_12_VFD1","I0","UL21_12_VFD1_I0","UL21_12_DISC"]
["UL21_12_VFD1","I1","UL21_12_VFD1_I1","UL21_12_ENC1"]
["UL21_12_VFD1","I2","UL21_12_VFD1_I2","UL21_11_TPE4"]
["UL21_12_VFD1","I3","UL21_12_VFD1_I3","UL21_11_TPE5"]
["UL21_12_VFD1","IO0","UL21_12_VFD1_IO0","UL21_11_JR2_PB"]
["UL21_12_VFD1","IO1","UL21_12_VFD1_IO1","UL21_11_JR2_PB_LT"]
["UL21_12_VFD1","SI0","UL21_12_VFD1_SI0"]
["UL21_12_VFD1","SI1","UL21_12_VFD1_SI1"]
["UL21_12_VFD1","SI2","UL21_12_VFD1_SI2"]
["UL21_12_VFD1","SI3","UL21_12_VFD1_SI3"]
["UL21_12_VFD1","SO0","UL21_12_VFD1_SO0"]
["UL21_13_VFD1","I0","UL21_13_VFD1_I0","UL21_13_DISC"]
["UL21_13_VFD1","I1","UL21_13_VFD1_I1","UL21_13_ENC1"]
["UL21_13_VFD1","I2","UL21_13_VFD1_I2","UL21_13_TPE1"]
["UL21_13_VFD1","I3","UL21_13_VFD1_I3","UL21_13_TPE2"]
["UL21_13_VFD1","IO0","UL21_13_VFD1_IO0","UL21_11_S1_PB"]
["UL21_13_VFD1","IO1","UL21_13_VFD1_IO1","UL21_11_S1_PB_LT"]
["UL21_13_VFD1","SI0","UL21_13_VFD1_SI0","UL21_13_EPC1"]
["UL21_13_VFD1","SI1","UL21_13_VFD1_SI1","UL21_13_EPC1_2"]
["UL21_13_VFD1","SI2","UL21_13_VFD1_SI2","UL21_13_EPC2"]
["UL21_13_VFD1","SI3","UL21_13_VFD1_SI3","UL21_13_EPC2_2"]
["UL21_13_VFD1","SO0","UL21_13_VFD1_SO0"]
["UL21_14A_VFD1","I0","UL21_14A_VFD1_I0","UL21_14A_DISC"]
["UL21_14A_VFD1","I1","UL21_14A_VFD1_I1"]
["UL21_14A_VFD1","I2","UL21_14A_VFD1_I2"]
["UL21_14A_VFD1","I3","UL21_14A_VFD1_I3"]
["UL21_14A_VFD1","IO0","UL21_14A_VFD1_IO0","UL21_11_S2_PB"]
["UL21_14A_VFD1","IO1","UL21_14A_VFD1_IO1","UL21_11_S2_PB_LT"]
["UL21_14A_VFD1","SI0","UL21_14A_VFD1_SI0"]
["UL21_14A_VFD1","SI1","UL21_14A_VFD1_SI1"]
["UL21_14A_VFD1","SI2","UL21_14A_VFD1_SI2"]
["UL21_14A_VFD1","SI3","UL21_14A_VFD1_SI3"]
["UL21_14A_VFD1","SO0","UL21_14A_VFD1_SO0"]
["UL21_14B_VFD1","I0","UL21_14B_VFD1_I0","UL21_14B_DISC"]
["UL21_14B_VFD1","I1","UL21_14B_VFD1_I1"]
["UL21_14B_VFD1","I2","UL21_14B_VFD1_I2"]
["UL21_14B_VFD1","I3","UL21_14B_VFD1_I3"]
["UL21_14B_VFD1","IO0","UL21_14B_VFD1_IO0","UL21_13_BCN1_R"]
["UL21_14B_VFD1","IO1","UL21_14B_VFD1_IO1","UL21_13_BCN2_R"]
["UL21_14B_VFD1","SI0","UL21_14B_VFD1_SI0"]
["UL21_14B_VFD1","SI1","UL21_14B_VFD1_SI1"]
["UL21_14B_VFD1","SI2","UL21_14B_VFD1_SI2"]
["UL21_14B_VFD1","SI3","UL21_14B_VFD1_SI3"]
["UL21_14B_VFD1","SO0","UL21_14B_VFD1_SO0"]
["UL21_15_VFD1","I0","UL21_15_VFD1_I0","UL21_15_DISC"]
["UL21_15_VFD1","I1","UL21_15_VFD1_I1","UL21_15_ENC1"]
["UL21_15_VFD1","I2","UL21_15_VFD1_I2","UL21_15_TPE1"]
["UL21_15_VFD1","I3","UL21_15_VFD1_I3","UL21_15_TPE2"]
["UL21_15_VFD1","IO0","UL21_15_VFD1_IO0","UL21_13_S1_PB"]
["UL21_15_VFD1","IO1","UL21_15_VFD1_IO1","UL21_13_S1_PB_LT"]
["UL21_15_VFD1","SI0","UL21_15_VFD1_SI0"]
["UL21_15_VFD1","SI1","UL21_15_VFD1_SI1"]
["UL21_15_VFD1","SI2","UL21_15_VFD1_SI2"]
["UL21_15_VFD1","SI3","UL21_15_VFD1_SI3"]
["UL21_15_VFD1","SO0","UL21_15_VFD1_SO0"]
["UL21_16_VFD1","I0","UL21_16_VFD1_I0","UL21_16_DISC"]
["UL21_16_VFD1","I1","UL21_16_VFD1_I1","UL21_16_ENC1"]
["UL21_16_VFD1","I2","UL21_16_VFD1_I2","UL21_16_TPE1"]
["UL21_16_VFD1","I3","UL21_16_VFD1_I3"]
["UL21_16_VFD1","IO0","UL21_16_VFD1_IO0","UL21_13_S2_PB"]
["UL21_16_VFD1","IO1","UL21_16_VFD1_IO1","UL21_13_S2_PB_LT"]
["UL21_16_VFD1","SI0","UL21_16_VFD1_SI0"]
["UL21_16_VFD1","SI1","UL21_16_VFD1_SI1"]
["UL21_16_VFD1","SI2","UL21_16_VFD1_SI2"]
["UL21_16_VFD1","SI3","UL21_16_VFD1_SI3"]
["UL21_16_VFD1","SO0","UL21_16_VFD1_SO0"]
["UL21_17_VFD1","I0","UL21_17_VFD1_I0","UL21_17_DISC"]
["UL21_17_VFD1","I1","UL21_17_VFD1_I1"]
["UL21_17_VFD1","I2","UL21_17_VFD1_I2"]
["UL21_17_VFD1","I3","UL21_17_VFD1_I3"]
["UL21_17_VFD1","IO0","UL21_17_VFD1_IO0"]
["UL21_17_VFD1","IO1","UL21_17_VFD1_IO1"]
["UL21_17_VFD1","SI0","UL21_17_VFD1_SI0"]
["UL21_17_VFD1","SI1","UL21_17_VFD1_SI1"]
["UL21_17_VFD1","SI2","UL21_17_VFD1_SI2"]
["UL21_17_VFD1","SI3","UL21_17_VFD1_SI3"]
["UL21_17_VFD1","SO0","UL21_17_VFD1_SO0"]
["UL21_3_VFD1","I0","UL21_3_VFD1_I0","UL21_3_DISC"]
["UL21_3_VFD1","I1","UL21_3_VFD1_I1","UL21_3_ENC1"]
["UL21_3_VFD1","I2","UL21_3_VFD1_I2","UL21_3_TPE1"]
["UL21_3_VFD1","I3","UL21_3_VFD1_I3","UL21_3_TPE2"]
["UL21_3_VFD1","IO0","UL21_3_VFD1_IO0"]
["UL21_3_VFD1","IO1","UL21_3_VFD1_IO1"]
["UL21_3_VFD1","SI0","UL21_3_VFD1_SI0","UL21_3_EPC1"]
["UL21_3_VFD1","SI1","UL21_3_VFD1_SI1","UL21_3_EPC1_2"]
["UL21_3_VFD1","SI2","UL21_3_VFD1_SI2","UL21_3_EPC2"]
["UL21_3_VFD1","SI3","UL21_3_VFD1_SI3","UL21_3_EPC2_2"]
["UL21_3_VFD1","SO0","UL21_3_VFD1_SO0","UL21_1_STO1","E-STOP OK"]
["UL21_4_VFD1","I0","UL21_4_VFD1_I0","UL21_4_DISC"]
["UL21_4_VFD1","I1","UL21_4_VFD1_I1","UL21_4_ENC1"]
["UL21_4_VFD1","I2","UL21_4_VFD1_I2","UL21_4_TPE1"]
["UL21_4_VFD1","I3","UL21_4_VFD1_I3"]
["UL21_4_VFD1","IO0","UL21_4_VFD1_IO0","UL21_4_S1_PB"]
["UL21_4_VFD1","IO1","UL21_4_VFD1_IO1","UL21_4_S1_PB_LT"]
["UL21_4_VFD1","SI0","UL21_4_VFD1_SI0","UL21_4_EPC1"]
["UL21_4_VFD1","SI1","UL21_4_VFD1_SI1","UL21_4_EPC1_2"]
["UL21_4_VFD1","SI2","UL21_4_VFD1_SI2","UL21_4_EPC2"]
["UL21_4_VFD1","SI3","UL21_4_VFD1_SI3","UL21_4_EPC2_2"]
["UL21_4_VFD1","SO0","UL21_4_VFD1_SO0","UL21_4_BCN1_R"]
["UL21_5_VFD1","I0","UL21_5_VFD1_I0","UL21_5_DISC"]
["UL21_5_VFD1","I1","UL21_5_VFD1_I1","UL21_5_ENC1"]
["UL21_5_VFD1","I2","UL21_5_VFD1_I2"]
["UL21_5_VFD1","I3","UL21_5_VFD1_I3"]
["UL21_5_VFD1","IO0","UL21_5_VFD1_IO0","UL21_5_JR1_PB"]
["UL21_5_VFD1","IO1","UL21_5_VFD1_IO1","UL21_5_JR1_PB_LT"]
["UL21_5_VFD1","SI0","UL21_5_VFD1_SI0","UL21_1_ESTOP1"]
["UL21_5_VFD1","SI1","UL21_5_VFD1_SI1"]
["UL21_5_VFD1","SI2","UL21_5_VFD1_SI2"]
["UL21_5_VFD1","SI3","UL21_5_VFD1_SI3"]
["UL21_5_VFD1","SO0","UL21_5_VFD1_SO0","UL21_5_BCN1_A"]
["UL21_6_VFD1","I0","UL21_6_VFD1_I0","UL21_6_DISC"]
["UL21_6_VFD1","I1","UL21_6_VFD1_I1","UL21_6_ENC1"]
["UL21_6_VFD1","I2","UL21_6_VFD1_I2","UL21_6_TPE1"]
["UL21_6_VFD1","I3","UL21_6_VFD1_I3","UL21_6_TPE2"]
["UL21_6_VFD1","IO0","UL21_6_VFD1_IO0","UL21_4_S2_PB"]
["UL21_6_VFD1","IO1","UL21_6_VFD1_IO1","UL21_4_S2_PB_LT"]
["UL21_6_VFD1","SI0","UL21_6_VFD1_SI0"]
["UL21_6_VFD1","SI1","UL21_6_VFD1_SI1"]
["UL21_6_VFD1","SI2","UL21_6_VFD1_SI2"]
["UL21_6_VFD1","SI3","UL21_6_VFD1_SI3"]
["UL21_6_VFD1","SO0","UL21_6_VFD1_SO0","UL21_4_BCN2_R"]
["UL21_7_VFD1","I0","UL21_7_VFD1_I0","UL21_7_DISC"]
["UL21_7_VFD1","I1","UL21_7_VFD1_I1","UL21_7_ENC1"]
["UL21_7_VFD1","I2","UL21_7_VFD1_I2","UL21_7_TPE1"]
["UL21_7_VFD1","I3","UL21_7_VFD1_I3"]
["UL21_7_VFD1","IO0","UL21_7_VFD1_IO0"]
["UL21_7_VFD1","IO1","UL21_7_VFD1_IO1"]
["UL21_7_VFD1","SI0","UL21_7_VFD1_SI0"]
["UL21_7_VFD1","SI1","UL21_7_VFD1_SI1"]
["UL21_7_VFD1","SI2","UL21_7_VFD1_SI2"]
["UL21_7_VFD1","SI3","UL21_7_VFD1_SI3"]
["UL21_7_VFD1","SO0","UL21_7_VFD1_SO0"]
["UL21_8_VFD1","I0","UL21_8_VFD1_I0","UL21_8_DISC"]
["UL21_8_VFD1","I1","UL21_8_VFD1_I1","UL21_8_ENC1"]
["UL21_8_VFD1","I2","UL21_8_VFD1_I2","UL21_8_TPE1"]
["UL21_8_VFD1","I3","UL21_8_VFD1_I3"]
["UL21_8_VFD1","IO0","UL21_8_VFD1_IO0"]
["UL21_8_VFD1","IO1","UL21_8_VFD1_IO1"]
["UL21_8_VFD1","SI0","UL21_8_VFD1_SI0"]
["UL21_8_VFD1","SI1","UL21_8_VFD1_SI1"]
["UL21_8_VFD1","SI2","UL21_8_VFD1_SI2"]
["UL21_8_VFD1","SI3","UL21_8_VFD1_SI3"]
["UL21_8_VFD1","SO0","UL21_8_VFD1_SO0"]
["UL21_9_VFD1","I0","UL21_9_VFD1_I0","UL21_9_DISC"]
["UL21_9_VFD1","I1","UL21_9_VFD1_I1","UL21_9_ENC1"]
["UL21_9_VFD1","I2","UL21_9_VFD1_I2","UL21_9_TPE1"]
["UL21_9_VFD1","I3","UL21_9_VFD1_I3"]
["UL21_9_VFD1","IO0","UL21_9_VFD1_IO0"]
["UL21_9_VFD1","IO1","UL21_9_VFD1_IO1"]
["UL21_9_VFD1","SI0","UL21_9_VFD1_SI0"]
["UL21_9_VFD1","SI1","UL21_9_VFD1_SI1"]
["UL21_9_VFD1","SI2","UL21_9_VFD1_SI2"]
["UL21_9_VFD1","SI3","UL21_9_VFD1_SI3"]
["UL21_9_VFD1","SO0","UL21_9_VFD1_SO0"]
["UL13_2_FIO1","IO00","UL13_2_FIO1_IO00"]
["UL13_2_FIO1","IO01","UL13_2_FIO1_IO01","UL13_1_BCN1_R"]
["UL13_2_FIO1","IO02","UL13_2_FIO1_IO02"]
["UL13_2_FIO1","IO03","UL13_2_FIO1_IO03","UL13_1_BCN2_R"]
["UL13_2_FIO1","IO04","UL13_2_FIO1_IO04","UL13_2_LPE1","2025-06-03"]
["UL13_2_FIO1","IO05","UL13_2_FIO1_IO05"]
["UL13_2_FIO1","IO06","UL13_2_FIO1_IO06","UL13_2_LPE2","2025-06-03"]
["UL13_2_FIO1","IO07","UL13_2_FIO1_IO07"]
["UL13_2_FIO1","IO08","UL13_2_FIO1_IO08"]
["UL13_2_FIO1","IO09","UL13_2_FIO1_IO09"]
["UL13_2_FIO1","IO10","UL13_2_FIO1_IO10"]
["UL13_2_FIO1","IO11","UL13_2_FIO1_IO11"]
["UL13_2_FIO1","IO12","UL13_2_FIO1_IO12"]
["UL13_2_FIO1","IO13","UL13_2_FIO1_IO13"]
["UL13_2_FIO1","IO14","UL13_2_FIO1_IO14"]
["UL13_2_FIO1","IO15","UL13_2_FIO1_IO15"]
["UL14_3_FIO1","IO00","UL14_3_FIO1_IO00","UL14_3_BCN1_R"]
["UL14_3_FIO1","IO01","UL14_3_FIO1_IO01"]
["UL14_3_FIO1","IO02","UL14_3_FIO1_IO02","UL14_3_BCN2_R"]
["UL14_3_FIO1","IO03","UL14_3_FIO1_IO03"]
["UL14_3_FIO1","IO04","UL14_3_FIO1_IO04","UL14_3_LPE1"]
["UL14_3_FIO1","IO05","UL14_3_FIO1_IO05"]
["UL14_3_FIO1","IO06","UL14_3_FIO1_IO06","UL14_3_LPE2"]
["UL14_3_FIO1","IO07","UL14_3_FIO1_IO07"]
["UL14_3_FIO1","IO08","UL14_3_FIO1_IO08","UL14_3_S1_PB"]
["UL14_3_FIO1","IO09","UL14_3_FIO1_IO09","UL14_3_S1_PB_LT"]
["UL14_3_FIO1","IO10","UL14_3_FIO1_IO10","UL14_3_S2_PB"]
["UL14_3_FIO1","IO11","UL14_3_FIO1_IO11","UL14_3_S2_PB_LT"]
["UL14_3_FIO1","IO12","UL14_3_FIO1_IO12"]
["UL14_3_FIO1","IO13","UL14_3_FIO1_IO13"]
["UL14_3_FIO1","IO14","UL14_3_FIO1_IO14"]
["UL14_3_FIO1","IO15","UL14_3_FIO1_IO15"]
["UL15_3_FIO1","IO00","UL15_3_FIO1_IO00","UL15_3_BCN1_R"]
["UL15_3_FIO1","IO01","UL15_3_FIO1_IO01"]
["UL15_3_FIO1","IO02","UL15_3_FIO1_IO02","UL15_3_BCN2_R"]
["UL15_3_FIO1","IO03","UL15_3_FIO1_IO03"]
["UL15_3_FIO1","IO04","UL15_3_FIO1_IO04","UL15_3_LPE1"]
["UL15_3_FIO1","IO05","UL15_3_FIO1_IO05"]
["UL15_3_FIO1","IO06","UL15_3_FIO1_IO06","UL15_3_LPE2"]
["UL15_3_FIO1","IO07","UL15_3_FIO1_IO07"]
["UL15_3_FIO1","IO08","UL15_3_FIO1_IO08","UL15_3_S1_PB"]
["UL15_3_FIO1","IO09","UL15_3_FIO1_IO09","UL15_3_S1_PB_LT"]
["UL15_3_FIO1","IO10","UL15_3_FIO1_IO10","UL15_3_S2_PB"]
["UL15_3_FIO1","IO11","UL15_3_FIO1_IO11","UL15_3_S2_PB_LT"]
["UL15_3_FIO1","IO12","UL15_3_FIO1_IO12"]
["UL15_3_FIO1","IO13","UL15_3_FIO1_IO13"]
["UL15_3_FIO1","IO14","UL15_3_FIO1_IO14"]
["UL15_3_FIO1","IO15","UL15_3_FIO1_IO15"]
["UL16_2_FIO1","IO00","UL16_2_FIO1_IO00","UL16_2_BCN1_R"]
["UL16_2_FIO1","IO01","UL16_2_FIO1_IO01"]
["UL16_2_FIO1","IO02","UL16_2_FIO1_IO02","UL16_2_BCN2_R"]
["UL16_2_FIO1","IO03","UL16_2_FIO1_IO03"]
["UL16_2_FIO1","IO04","UL16_2_FIO1_IO04","UL16_2_LPE1"]
["UL16_2_FIO1","IO05","UL16_2_FIO1_IO05"]
["UL16_2_FIO1","IO06","UL16_2_FIO1_IO06","UL16_2_LPE2"]
["UL16_2_FIO1","IO07","UL16_2_FIO1_IO07"]
["UL16_2_FIO1","IO08","UL16_2_FIO1_IO08","UL16_2_S1_PB"]
["UL16_2_FIO1","IO09","UL16_2_FIO1_IO09","UL16_2_S1_PB_LT"]
["UL16_2_FIO1","IO10","UL16_2_FIO1_IO10","UL16_2_S2_PB"]
["UL16_2_FIO1","IO11","UL16_2_FIO1_IO11","UL16_2_S2_PB_LT"]
["UL16_2_FIO1","IO12","UL16_2_FIO1_IO12"]
["UL16_2_FIO1","IO13","UL16_2_FIO1_IO13"]
["UL16_2_FIO1","IO14","UL16_2_FIO1_IO14"]
["UL16_2_FIO1","IO15","UL16_2_FIO1_IO15"]
["UL17_3_FIO1","IO00","UL17_3_FIO1_IO00","UL17_3_BCN1_R"]
["UL17_3_FIO1","IO01","UL17_3_FIO1_IO01"]
["UL17_3_FIO1","IO02","UL17_3_FIO1_IO02","UL17_3_BCN2_R"]
["UL17_3_FIO1","IO03","UL17_3_FIO1_IO03"]
["UL17_3_FIO1","IO04","UL17_3_FIO1_IO04","UL17_3_LPE1"]
["UL17_3_FIO1","IO05","UL17_3_FIO1_IO05"]
["UL17_3_FIO1","IO06","UL17_3_FIO1_IO06","UL17_3_LPE2"]
["UL17_3_FIO1","IO07","UL17_3_FIO1_IO07"]
["UL17_3_FIO1","IO08","UL17_3_FIO1_IO08","UL17_3_S1_PB"]
["UL17_3_FIO1","IO09","UL17_3_FIO1_IO09","UL17_3_S1_PB_LT"]
["UL17_3_FIO1","IO10","UL17_3_FIO1_IO10","UL17_3_S2_PB"]
["UL17_3_FIO1","IO11","UL17_3_FIO1_IO11","UL17_3_S2_PB_LT"]
["UL17_3_FIO1","IO12","UL17_3_FIO1_IO12"]
["UL17_3_FIO1","IO13","UL17_3_FIO1_IO13"]
["UL17_3_FIO1","IO14","UL17_3_FIO1_IO14"]
["UL17_3_FIO1","IO15","UL17_3_FIO1_IO15"]
["UL18_3_FIO1","IO00","UL18_3_FIO1_IO00","UL18_3_BCN1_R"]
["UL18_3_FIO1","IO01","UL18_3_FIO1_IO01"]
["UL18_3_FIO1","IO02","UL18_3_FIO1_IO02","UL18_3_BCN2_R"]
["UL18_3_FIO1","IO03","UL18_3_FIO1_IO03"]
["UL18_3_FIO1","IO04","UL18_3_FIO1_IO04","UL18_3_LPE1"]
["UL18_3_FIO1","IO05","UL18_3_FIO1_IO05"]
["UL18_3_FIO1","IO06","UL18_3_FIO1_IO06","UL18_3_LPE2"]
["UL18_3_FIO1","IO07","UL18_3_FIO1_IO07"]
["UL18_3_FIO1","IO08","UL18_3_FIO1_IO08","UL18_3_S1_PB"]
["UL18_3_FIO1","IO09","UL18_3_FIO1_IO09","UL18_3_S1_PB_LT"]
["UL18_3_FIO1","IO10","UL18_3_FIO1_IO10","UL18_3_S2_PB"]
["UL18_3_FIO1","IO11","UL18_3_FIO1_IO11","UL18_3_S2_PB_LT"]
["UL18_3_FIO1","IO12","UL18_3_FIO1_IO12"]
["UL18_3_FIO1","IO13","UL18_3_FIO1_IO13"]
["UL18_3_FIO1","IO14","UL18_3_FIO1_IO14"]
["UL18_3_FIO1","IO15","UL18_3_FIO1_IO15"]
["UL19_2_FIO1","IO00","UL19_2_FIO1_IO00","UL19_2_BCN1_R"]
["UL19_2_FIO1","IO01","UL19_2_FIO1_IO01"]
["UL19_2_FIO1","IO02","UL19_2_FIO1_IO02","UL19_2_BCN2_R"]
["UL19_2_FIO1","IO03","UL19_2_FIO1_IO03"]
["UL19_2_FIO1","IO04","UL19_2_FIO1_IO04","UL19_2_LPE1"]
["UL19_2_FIO1","IO05","UL19_2_FIO1_IO05"]
["UL19_2_FIO1","IO06","UL19_2_FIO1_IO06","UL19_2_LPE2"]
["UL19_2_FIO1","IO07","UL19_2_FIO1_IO07"]
["UL19_2_FIO1","IO08","UL19_2_FIO1_IO08","UL19_2_S1_PB"]
["UL19_2_FIO1","IO09","UL19_2_FIO1_IO09","UL19_2_S1_PB_LT"]
["UL19_2_FIO1","IO10","UL19_2_FIO1_IO10","UL19_2_S2_PB"]
["UL19_2_FIO1","IO11","UL19_2_FIO1_IO11","UL19_2_S2_PB_LT"]
["UL19_2_FIO1","IO12","UL19_2_FIO1_IO12"]
["UL19_2_FIO1","IO13","UL19_2_FIO1_IO13"]
["UL19_2_FIO1","IO14","UL19_2_FIO1_IO14"]
["UL19_2_FIO1","IO15","UL19_2_FIO1_IO15"]
["UL20_3_FIO1","IO00","UL20_3_FIO1_IO00","UL20_3_BCN1_R"]
["UL20_3_FIO1","IO01","UL20_3_FIO1_IO01"]
["UL20_3_FIO1","IO02","UL20_3_FIO1_IO02","UL20_3_BCN2_R"]
["UL20_3_FIO1","IO03","UL20_3_FIO1_IO03"]
["UL20_3_FIO1","IO04","UL20_3_FIO1_IO04","UL20_3_LPE1"]
["UL20_3_FIO1","IO05","UL20_3_FIO1_IO05"]
["UL20_3_FIO1","IO06","UL20_3_FIO1_IO06","UL20_3_LPE2"]
["UL20_3_FIO1","IO07","UL20_3_FIO1_IO07"]
["UL20_3_FIO1","IO08","UL20_3_FIO1_IO08","UL20_3_S1_PB"]
["UL20_3_FIO1","IO09","UL20_3_FIO1_IO09","UL20_3_S1_PB_LT"]
["UL20_3_FIO1","IO10","UL20_3_FIO1_IO10","UL20_3_S2_PB"]
["UL20_3_FIO1","IO11","UL20_3_FIO1_IO11","UL20_3_S2_PB_LT"]
["UL20_3_FIO1","IO12","UL20_3_FIO1_IO12"]
["UL20_3_FIO1","IO13","UL20_3_FIO1_IO13"]
["UL20_3_FIO1","IO14","UL20_3_FIO1_IO14"]
["UL20_3_FIO1","IO15","UL20_3_FIO1_IO15"]
["UL21_3_FIO1","IO00","UL21_3_FIO1_IO00","UL21_3_BCN1_R"]
["UL21_3_FIO1","IO01","UL21_3_FIO1_IO01"]
["UL21_3_FIO1","IO02","UL21_3_FIO1_IO02","UL21_3_BCN2_R"]
["UL21_3_FIO1","IO03","UL21_3_FIO1_IO03"]
["UL21_3_FIO1","IO04","UL21_3_FIO1_IO04","UL21_3_LPE1"]
["UL21_3_FIO1","IO05","UL21_3_FIO1_IO05"]
["UL21_3_FIO1","IO06","UL21_3_FIO1_IO06","UL21_3_LPE2"]
["UL21_3_FIO1","IO07","UL21_3_FIO1_IO07"]
["UL21_3_FIO1","IO08","UL21_3_FIO1_IO08","UL21_3_S1_PB"]
["UL21_3_FIO1","IO09","UL21_3_FIO1_IO09","UL21_3_S1_PB_LT"]
["UL21_3_FIO1","IO10","UL21_3_FIO1_IO10","UL21_3_S2_PB"]
["UL21_3_FIO1","IO11","UL21_3_FIO1_IO11","UL21_3_S2_PB_LT"]
["UL21_3_FIO1","IO12","UL21_3_FIO1_IO12"]
["UL21_3_FIO1","IO13","UL21_3_FIO1_IO13"]
["UL21_3_FIO1","IO14","UL21_3_FIO1_IO14"]
["UL21_3_FIO1","IO15","UL21_3_FIO1_IO15"]
["UL13_12_FIO1","IO00","UL13_12_FIO1_IO00","UL13_12_SOL1"]
["UL13_12_FIO1","IO01","UL13_12_FIO1_IO01"]
["UL13_12_FIO1","IO02","UL13_12_FIO1_IO02","UL13_12_SOL1"]
["UL13_12_FIO1","IO03","UL13_12_FIO1_IO03"]
["UL13_12_FIO1","IO04","UL13_12_FIO1_IO04"]
["UL13_12_FIO1","IO05","UL13_12_FIO1_IO05"]
["UL13_12_FIO1","IO06","UL13_12_FIO1_IO06"]
["UL13_12_FIO1","IO07","UL13_12_FIO1_IO07"]
["UL13_12_FIO1","IO08","UL13_12_FIO1_IO08"]
["UL13_12_FIO1","IO09","UL13_12_FIO1_IO09"]
["UL13_12_FIO1","IO10","UL13_12_FIO1_IO10"]
["UL13_12_FIO1","IO11","UL13_12_FIO1_IO11"]
["UL13_12_FIO1","IO12","UL13_12_FIO1_IO12"]
["UL13_12_FIO1","IO13","UL13_12_FIO1_IO13"]
["UL13_12_FIO1","IO14","UL13_12_FIO1_IO14"]
["UL13_12_FIO1","IO15","UL13_12_FIO1_IO15"]
["UL18_16_FIO1","IO00","UL18_16_FIO1_IO00","UL18_16_SOL1"]
["UL18_16_FIO1","IO01","UL18_16_FIO1_IO01"]
["UL18_16_FIO1","IO02","UL18_16_FIO1_IO02","UL18_16_SOL1"]
["UL18_16_FIO1","IO03","UL18_16_FIO1_IO03"]
["UL18_16_FIO1","IO04","UL18_16_FIO1_IO04"]
["UL18_16_FIO1","IO05","UL18_16_FIO1_IO05"]
["UL18_16_FIO1","IO06","UL18_16_FIO1_IO06"]
["UL18_16_FIO1","IO07","UL18_16_FIO1_IO07"]
["UL18_16_FIO1","IO08","UL18_16_FIO1_IO08"]
["UL18_16_FIO1","IO09","UL18_16_FIO1_IO09"]
["UL18_16_FIO1","IO10","UL18_16_FIO1_IO10"]
["UL18_16_FIO1","IO11","UL18_16_FIO1_IO11"]
["UL18_16_FIO1","IO12","UL18_16_FIO1_IO12"]
["UL18_16_FIO1","IO13","UL18_16_FIO1_IO13"]
["UL18_16_FIO1","IO14","UL18_16_FIO1_IO14"]
["UL18_16_FIO1","IO15","UL18_16_FIO1_IO15"]
["UL22_17_FIO1","IO00","UL22_17_FIO1_IO00","UL22_17_SOL1"]
["UL22_17_FIO1","IO01","UL22_17_FIO1_IO01"]
["UL22_17_FIO1","IO02","UL22_17_FIO1_IO02","UL22_17_SOL1"]
["UL22_17_FIO1","IO03","UL22_17_FIO1_IO03"]
["UL22_17_FIO1","IO04","UL22_17_FIO1_IO04"]
["UL22_17_FIO1","IO05","UL22_17_FIO1_IO05"]
["UL22_17_FIO1","IO06","UL22_17_FIO1_IO06"]
["UL22_17_FIO1","IO07","UL22_17_FIO1_IO07"]
["UL22_17_FIO1","IO08","UL22_17_FIO1_IO08"]
["UL22_17_FIO1","IO09","UL22_17_FIO1_IO09"]
["UL22_17_FIO1","IO10","UL22_17_FIO1_IO10"]
["UL22_17_FIO1","IO11","UL22_17_FIO1_IO11"]
["UL22_17_FIO1","IO12","UL22_17_FIO1_IO12"]
["UL22_17_FIO1","IO13","UL22_17_FIO1_IO13"]
["UL22_17_FIO1","IO14","UL22_17_FIO1_IO14"]
["UL22_17_FIO1","IO15","UL22_17_FIO1_IO15"]

{"sheet":"MCM02_DESC","index":6,"n_rows":1788,"n_cols":22,"rows_kept":1788,"cut":false,"hidden":false,"merged":[[1692,5,1787,5],[1644,5,1691,5],[26,8,30,8],[1,8,5,8],[6,8,10,8],[11,8,15,8],[16,8,20,8],[21,8,25,8],[86,8,90,8],[31,8,35,8],[36,8,40,8],[41,8,45,8],[46,8,50,8],[51,8,55,8],[56,8,60,8],[61,8,65,8],[66,8,70,8],[71,8,75,8],[76,8,80,8],[81,8,85,8],[146,8,150,8],[91,8,95,8],[96,8,100,8],[101,8,105,8],[106,8,110,8],[111,8,115,8],[116,8,120,8],[121,8,125,8],[126,8,130,8],[131,8,135,8],[136,8,140,8],[141,8,145,8],[181,8,185,8],[151,8,155,8],[156,8,160,8],[161,8,165,8],[166,8,170,8],[171,8,175,8],[176,8,180,8]]}
["TAGNAME","ADDR","TERM","TERMDESC","DESCA","DESCB",null,"CONTROLLERS"]
["PS5_1_VFD1","PS5_1_VFD1_I0","I0",null,"PS5_1_DISC","DISCONNECT AUX",null,"PS5_1_VFD1",600,null,{"$f":"_xlfn.CONCAT(H2,\"/\",H3,\"/\",H4,\"/\",H5,\" IO DRAWINGS\")","v":"PS5_1_VFD1/PS5_10_VFD1/PS5_11_VFD1/PS5_12_VFD1 IO DRAWINGS"},null,null,null,null,null,null,null,null,null,null,"PS5_1_VFD1/PS5_10_VFD1/PS5_11_VFD1/PS5_12_VFD1 IO DRAWINGS"]
["PS5_1_VFD1","PS5_1_VFD1_I1","I1",null,"SPARE",null,null,"PS5_10_VFD1",null,null,{"$f":"_xlfn.CONCAT(H7,\"/\",H8,\"/\",H9,\"/\",H10,\" IO DRAWINGS\")","v":"PS5_13_VFD1/PS5_2_VFD1/PS5_3_VFD1/PS5_4_VFD1 IO DRAWINGS"},null,null,null,null,null,null,null,null,null,null,"PS5_13_VFD1/PS5_2_VFD1/PS5_3_VFD1/PS5_4_VFD1 IO DRAWINGS"]
["PS5_1_VFD1","PS5_1_VFD1_I2","I2",null,"SPARE",null,null,"PS5_11_VFD1",null,null,{"$f":"_xlfn.CONCAT(H12,\"/\",H13,\"/\",H14,\"/\",H15,\" IO DRAWINGS\")","v":"PS5_5_VFD1/PS5_6_VFD1/PS5_7_VFD1/PS5_8_VFD1 IO DRAWINGS"},null,null,null,null,null,null,null,null,null,null,"PS5_5_VFD1/PS5_6_VFD1/PS5_7_VFD1/PS5_8_VFD1 IO DRAWINGS"]
["PS5_1_VFD1","PS5_1_VFD1_I3","I3",null,"SPARE",null,null,"PS5_12_VFD1",null,null,{"$f":"_xlfn.CONCAT(H17,\"/\",H18,\"/\",H19,\"/\",H20,\" IO DRAWINGS\")","v":"PS5_9_VFD1/PS6_1_VFD1/PS6_10_VFD1/PS6_11_VFD1 IO DRAWINGS"},null,null,null,null,null,null,null,null,null,null,"PS5_9_VFD1/PS6_1_VFD1/PS6_10_VFD1/PS6_11_VFD1 IO DRAWINGS"]
["PS5_1_VFD1","PS5_1_VFD1_IO0","IO0",null,"PS5_1_S1_PB","START PUSHBUTTON",null,null,null,null,{"$f":"_xlfn.CONCAT(H22,\"/\",H23,\"/\",H24,\"/\",H25,\" IO DRAWINGS\")","v":"PS6_12_VFD1/PS6_13_VFD1/PS6_2_VFD1/PS6_3_VFD1 IO DRAWINGS"},null,null,null,null,null,null,null,null,null,null,"PS6_12_VFD1/PS6_13_VFD1/PS6_2_VFD1/PS6_3_VFD1 IO DRAWINGS"]
["PS5_1_VFD1","PS5_1_VFD1_IO1","IO1",null,"PS5_1_S1_PB_LT","START PUSHBUTTON LIGHT",null,"PS5_13_VFD1",601,null,{"$f":"_xlfn.CONCAT(H27,\"/\",H28,\"/\",H29,\"/\",H30,\" IO DRAWINGS\")","v":"PS6_4_VFD1/PS6_5_VFD1/PS6_6_VFD1/PS6_7_VFD1 IO DRAWINGS"},null,null,null,null,null,null,null,null,null,null,"PS6_4_VFD1/PS6_5_VFD1/PS6_6_VFD1/PS6_7_VFD1 IO DRAWINGS"]
["PS5_1_VFD1","PS5_1_VFD1_SI0","SI0",null,"PS5_1_EPC1","E-STOP PULLCORD",null,"PS5_2_VFD1",null,null,{"$f":"_xlfn.CONCAT(H32,\"/\",H33,\"/\",H34,\"/\",H35,\" IO DRAWINGS\")","v":"PS6_8_VFD1/PS6_9_VFD1/PS7_1_VFD1/PS7_10_VFD1 IO DRAWINGS"},null,null,null,null,null,null,null,null,null,null,"PS6_8_VFD1/PS6_9_VFD1/PS7_1_VFD1/PS7_10_VFD1 IO DRAWINGS"]
["PS5_1_VFD1","PS5_1_VFD1_SI1","SI1",null,"PS5_1_EPC1_2","E-STOP PULLCORD",null,"PS5_3_VFD1",null,null,{"$f":"_xlfn.CONCAT(H37,\"/\",H38,\"/\",H39,\"/\",H40,\" IO DRAWINGS\")","v":"PS7_11_VFD1/PS7_12_VFD1/PS7_13_VFD1/PS7_14_VFD1 IO DRAWINGS"},null,null,null,null,null,null,null,null,null,null,"PS7_11_VFD1/PS7_12_VFD1/PS7_13_VFD1/PS7_14_VFD1 IO DRAWINGS"]
["PS5_1_VFD1","PS5_1_VFD1_SI2","SI2",null,"PS5_1_EPC2","E-STOP PULLCORD",null,"PS5_4_VFD1",null,null,{"$f":"_xlfn.CONCAT(H42,\"/\",H43,\"/\",H44,\"/\",H45,\" IO DRAWINGS\")","v":"PS7_2_VFD1/PS7_3_VFD1/PS7_4_VFD1/PS7_5_VFD1 IO DRAWINGS"},null,null,null,null,null,null,null,null,null,null,"PS7_2_VFD1/PS7_3_VFD1/PS7_4_VFD1/PS7_5_VFD1 IO DRAWINGS"]
["PS5_1_VFD1","PS5_1_VFD1_SI3","SI3",null,"PS5_1_EPC2_2","E-STOP PULLCORD",null,null,null,null,{"$f":"_xlfn.CONCAT(H47,\"/\",H48,\"/\",H49,\"/\",H50,\" IO DRAWINGS\")","v":"PS7_6_VFD1/PS7_7_VFD1/PS7_8_VFD1/PS7_9_VFD1 IO DRAWINGS"},null,null,null,null,null,null,null,null,null,null,"PS7_6_VFD1/PS7_7_VFD1/PS7_8_VFD1/PS7_9_VFD1 IO DRAWINGS"]
["PS5_1_VFD1","PS5_1_VFD1_SO0","SO0",null,"PS5_1_BCN1_R","RED BEACON LIGHT",null,"PS5_5_VFD1",602,null,{"$f":"_xlfn.CONCAT(H52,\"/\",H53,\"/\",H54,\"/\",H55,\" IO DRAWINGS\")","v":"UL13_1_VFD1/UL13_10_VFD1/UL13_11_VFD1/UL13_12_VFD1 IO DRAWINGS"},null,null,null,null,null,null,null,null,null,null,"UL13_1_VFD1/UL13_10_VFD1/UL13_11_VFD1/UL13_12_VFD1 IO DRAWINGS"]
["PS5_10_VFD1","PS5_10_VFD1_I0","I0",null,"PS5_10_DISC","DISCONNECT AUX",null,"PS5_6_VFD1",null,null,{"$f":"_xlfn.CONCAT(H57,\"/\",H58,\"/\",H59,\"/\",H60,\" IO DRAWINGS\")","v":"UL13_2_VFD1/UL13_3_VFD1/UL13_4_VFD1/UL13_5_VFD1 IO DRAWINGS"},null,null,null,null,null,null,null,null,null,null,"UL13_2_VFD1/UL13_3_VFD1/UL13_4_VFD1/UL13_5_VFD1 IO DRAWINGS"]
["PS5_10_VFD1","PS5_10_VFD1_I1","I1",null,"SPARE",null,null,"PS5_7_VFD1",null,null,{"$f":"_xlfn.CONCAT(H62,\"/\",H63,\"/\",H64,\"/\",H65,\" IO DRAWINGS\")","v":"UL13_6_VFD1/UL13_7_VFD1/UL13_8_VFD1/UL13_9A_VFD1 IO DRAWINGS"},null,null,null,null,null,null,null,null,null,null,"UL13_6_VFD1/UL13_7_VFD1/UL13_8_VFD1/UL13_9A_VFD1 IO DRAWINGS"]
["PS5_10_VFD1","PS5_10_VFD1_I2","I2",null,"PS5_10_TPE1","TRACKING PHOTOEYE",null,"PS5_8_VFD1",null,null,{"$f":"_xlfn.CONCAT(H67,\"/\",H68,\"/\",H69,\"/\",H70,\" IO DRAWINGS\")","v":"UL13_9B_VFD1/UL14_10_VFD1/UL14_3_VFD1/UL14_4_VFD1 IO DRAWINGS"},null,null,null,null,null,null,null,null,null,null,"UL13_9B_VFD1/UL14_10_VFD1/UL14_3_VFD1/UL14_4_VFD1 IO DRAWINGS"]
["PS5_10_VFD1","PS5_10_VFD1_I3","I3",null,"PS5_10_TPE2","TRACKING PHOTOEYE",null,null,null,null,{"$f":"_xlfn.CONCAT(H72,\"/\",H73,\"/\",H74,\"/\",H75,\" IO DRAWINGS\")","v":"UL14_5_VFD1/UL14_6_VFD1/UL14_7_VFD1/UL14_8_VFD1 IO DRAWINGS"},null,null,null,null,null,null,null,null,null,null,"UL14_5_VFD1/UL14_6_VFD1/UL14_7_VFD1/UL14_8_VFD1 IO DRAWINGS"]
["PS5_10_VFD1","PS5_10_VFD1_IO0","IO0",null,"PS5_10_JR1_PB","JAM RESET PUSHBUTTON",null,"PS5_9_VFD1",603,null,{"$f":"_xlfn.CONCAT(H77,\"/\",H78,\"/\",H79,\"/\",H80,\" IO DRAWINGS\")","v":"UL14_9_VFD1/UL15_10_VFD1/UL15_11_VFD1/UL15_3_VFD1 IO DRAWINGS"},null,null,null,null,null,null,null,null,null,null,"UL14_9_VFD1/UL15_10_VFD1/UL15_11_VFD1/UL15_3_VFD1 IO DRAWINGS"]
["PS5_10_VFD1","PS5_10_VFD1_IO1","IO1",null,"PS5_10_JR1_PB_LT","JAM RESET PUSHBUTTON LIGHT",null,"PS6_1_VFD1",null,null,{"$f":"_xlfn.CONCAT(H82,\"/\",H83,\"/\",H84,\"/\",H85,\" IO DRAWINGS\")","v":"UL15_4_VFD1/UL15_5_VFD1/UL15_6_VFD1/UL15_7_VFD1 IO DRAWINGS"},null,null,null,null,null,null,null,null,null,null,"UL15_4_VFD1/UL15_5_VFD1/UL15_6_VFD1/UL15_7_VFD1 IO DRAWINGS"]
["PS5_10_VFD1","PS5_10_VFD1_SI0","SI0",null,"SPARE",null,null,"PS6_10_VFD1",null,null,{"$f":"_xlfn.CONCAT(H87,\"/\",H88,\"/\",H89,\"/\",H90,\" IO DRAWINGS\")","v":"UL15_8_VFD1/UL15_9_VFD1/UL16_1_VFD1/UL16_2_VFD1 IO DRAWINGS"},null,null,null,null,null,null,null,null,null,null,"UL15_8_VFD1/UL15_9_VFD1/UL16_1_VFD1/UL16_2_VFD1 IO DRAWINGS"]
["PS5_10_VFD1","PS5_10_VFD1_SI1","SI1",null,"SPARE",null,null,"PS6_11_VFD1",null,null,{"$f":"_xlfn.CONCAT(H92,\"/\",H93,\"/\",H94,\"/\",H95,\" IO DRAWINGS\")","v":"UL16_3_VFD1/UL16_4_VFD1/UL16_5_VFD1/UL16_6_VFD1 IO DRAWINGS"},null,null,null,null,null,null,null,null,null,null,"UL16_3_VFD1/UL16_4_VFD1/UL16_5_VFD1/UL16_6_VFD1 IO DRAWINGS"]
["PS5_10_VFD1","PS5_10_VFD1_SI2","SI2",null,"SPARE",null,null,null,null,null,{"$f":"_xlfn.CONCAT(H97,\"/\",H98,\"/\",H99,\"/\",H100,\" IO DRAWINGS\")","v":"UL16_7_VFD1/UL16_8_VFD1/UL16_9_VFD1/UL17_10_VFD1 IO DRAWINGS"},null,null,null,null,null,null,null,null,null,null,"UL16_7_VFD1/UL16_8_VFD1/UL16_9_VFD1/UL17_10_VFD1 IO DRAWINGS"]
["PS5_10_VFD1","PS5_10_VFD1_SI3","SI3",null,"SPARE",null,null,"PS6_12_VFD1",604,null,{"$f":"_xlfn.CONCAT(H102,\"/\",H103,\"/\",H104,\"/\",H105,\" IO DRAWINGS\")","v":"UL17_3_VFD1/UL17_4_VFD1/UL17_5_VFD1/UL17_6_VFD1 IO DRAWINGS"},null,null,null,null,null,null,null,null,null,null,"UL17_3_VFD1/UL17_4_VFD1/UL17_5_VFD1/UL17_6_VFD1 IO DRAWINGS"]
["PS5_10_VFD1","PS5_10_VFD1_SO0","SO0",null,"SPARE",null,null,"PS6_13_VFD1",null,null,{"$f":"_xlfn.CONCAT(H107,\"/\",H108,\"/\",H109,\"/\",H110,\" IO DRAWINGS\")","v":"UL17_7_VFD1/UL17_8_VFD1/UL17_9_VFD1/UL18_10_VFD1 IO DRAWINGS"},null,null,null,null,null,null,null,null,null,null,"UL17_7_VFD1/UL17_8_VFD1/UL17_9_VFD1/UL18_10_VFD1 IO DRAWINGS"]
["PS5_11_VFD1","PS5_11_VFD1_I0","I0",null,"PS5_11_DISC","DISCONNECT AUX",null,"PS6_2_VFD1",null,null,{"$f":"_xlfn.CONCAT(H112,\"/\",H113,\"/\",H114,\"/\",H115,\" IO DRAWINGS\")","v":"UL18_11_VFD1/UL18_12_VFD1/UL18_13A_VFD1/UL18_13B_VFD1 IO DRAWINGS"},null,null,null,null,null,null,null,null,null,null,"UL18_11_VFD1/UL18_12_VFD1/UL18_13A_VFD1/UL18_13B_VFD1 IO DRAWINGS"]
["PS5_11_VFD1","PS5_11_VFD1_I1","I1",null,"SPARE",null,null,"PS6_3_VFD1",null,null,{"$f":"_xlfn.CONCAT(H117,\"/\",H118,\"/\",H119,\"/\",H120,\" IO DRAWINGS\")","v":"UL18_14_VFD1/UL18_15_VFD1/UL18_16_VFD1/UL18_3_VFD1 IO DRAWINGS"},null,null,null,null,null,null,null,null,null,null,"UL18_14_VFD1/UL18_15_VFD1/UL18_16_VFD1/UL18_3_VFD1 IO DRAWINGS"]
["PS5_11_VFD1","PS5_11_VFD1_I2","I2",null,"SPARE",null,null,null,null,null,{"$f":"_xlfn.CONCAT(H122,\"/\",H123,\"/\",H124,\"/\",H125,\" IO DRAWINGS\")","v":"UL18_4_VFD1/UL18_5_VFD1/UL18_6_VFD1/UL18_7_VFD1 IO DRAWINGS"},null,null,null,null,null,null,null,null,null,null,"UL18_4_VFD1/UL18_5_VFD1/UL18_6_VFD1/UL18_7_VFD1 IO DRAWINGS"]
["PS5_11_VFD1","PS5_11_VFD1_I3","I3",null,"SPARE",null,null,"PS6_4_VFD1",605,null,{"$f":"_xlfn.CONCAT(H127,\"/\",H128,\"/\",H129,\"/\",H130,\" IO DRAWINGS\")","v":"UL18_8_VFD1/UL18_9_VFD1/UL19_1_VFD1/UL19_2_VFD1 IO DRAWINGS"},null,null,null,null,null,null,null,null,null,null,"UL18_8_VFD1/UL18_9_VFD1/UL19_1_VFD1/UL19_2_VFD1 IO DRAWINGS"]
["PS5_11_VFD1","PS5_11_VFD1_IO0","IO0",null,"PS5_11_JR1_PB","JAM RESET PUSHBUTTON",null,"PS6_5_VFD1",null,null,{"$f":"_xlfn.CONCAT(H132,\"/\",H133,\"/\",H134,\"/\",H135,\" IO DRAWINGS\")","v":"UL19_3_VFD1/UL19_4_VFD1/UL19_5_VFD1/UL19_6_VFD1 IO DRAWINGS"},null,null,null,null,null,null,null,null,null,null,"UL19_3_VFD1/UL19_4_VFD1/UL19_5_VFD1/UL19_6_VFD1 IO DRAWINGS"]
["PS5_11_VFD1","PS5_11_VFD1_IO1","IO1",null,"PS5_11_JR1_PB_LT","JAM RESET PUSHBUTTON LIGHT",null,"PS6_6_VFD1",null,null,{"$f":"_xlfn.CONCAT(H137,\"/\",H138,\"/\",H139,\"/\",H140,\" IO DRAWINGS\")","v":"UL19_7_VFD1/UL19_8_VFD1/UL19_9_VFD1/UL20_10_VFD1 IO DRAWINGS"},null,null,null,null,null,null,null,null,null,null,"UL19_7_VFD1/UL19_8_VFD1/UL19_9_VFD1/UL20_10_VFD1 IO DRAWINGS"]
["PS5_11_VFD1","PS5_11_VFD1_SI0","SI0",null,"SPARE",null,null,"PS6_7_VFD1",null,null,{"$f":"_xlfn.CONCAT(H142,\"/\",H143,\"/\",H144,\"/\",H145,\" IO DRAWINGS\")","v":"UL20_11_VFD1/UL20_3_VFD1/UL20_4_VFD1/UL20_5_VFD1 IO DRAWINGS"},null,null,null,null,null,null,null,null,null,null,"UL20_11_VFD1/UL20_3_VFD1/UL20_4_VFD1/UL20_5_VFD1 IO DRAWINGS"]
["PS5_11_VFD1","PS5_11_VFD1_SI1","SI1",null,"SPARE",null,null,null,null,null,{"$f":"_xlfn.CONCAT(H147,\"/\",H148,\"/\",H149,\"/\",H150,\" IO DRAWINGS\")","v":"UL20_6_VFD1/UL20_7_VFD1/UL20_8_VFD1/UL20_9_VFD1 IO DRAWINGS"},null,null,null,null,null,null,null,null,null,null,"UL20_6_VFD1/UL20_7_VFD1/UL20_8_VFD1/UL20_9_VFD1 IO DRAWINGS"]
["PS5_11_VFD1","PS5_11_VFD1_SI2","SI2",null,"SPARE",null,null,"PS6_8_VFD1",606,null,{"$f":"_xlfn.CONCAT(H152,\"/\",H153,\"/\",H154,\"/\",H155,\" IO DRAWINGS\")","v":"UL21_10_VFD1/UL21_11_VFD1/UL21_12_VFD1/UL21_13_VFD1 IO DRAWINGS"},null,null,null,null,null,null,null,null,null,null,"UL21_10_VFD1/UL21_11_VFD1/UL21_12_VFD1/UL21_13_VFD1 IO DRAWINGS"]
["PS5_11_VFD1","PS5_11_VFD1_SI3","SI3",null,"SPARE",null,null,"PS6_9_VFD1",null,null,{"$f":"_xlfn.CONCAT(H157,\"/\",H158,\"/\",H159,\"/\",H160,\" IO DRAWINGS\")","v":"UL21_14A_VFD1/UL21_14B_VFD1/UL21_15_VFD1/UL21_16_VFD1 IO DRAWINGS"},null,null,null,null,null,null,null,null,null,null,"UL21_14A_VFD1/UL21_14B_VFD1/UL21_15_VFD1/UL21_16_VFD1 IO DRAWINGS"]
["PS5_11_VFD1","PS5_11_VFD1_SO0","SO0",null,"PS5_11_BCN1_A","AMBER BEACON LIGHT",null,"PS7_1_VFD1",null,null,{"$f":"_xlfn.CONCAT(H162,\"/\",H163,\"/\",H164,\"/\",H165,\" IO DRAWINGS\")","v":"UL21_17_VFD1/UL21_3_VFD1/UL21_4_VFD1/UL21_5_VFD1 IO DRAWINGS"},null,null,null,null,null,null,null,null,null,null,"UL21_17_VFD1/UL21_3_VFD1/UL21_4_VFD1/UL21_5_VFD1 IO DRAWINGS"]
["PS5_12_VFD1","PS5_12_VFD1_I0","I0",null,"PS5_12_DISC","DISCONNECT AUX",null,"PS7_10_VFD1",null,null,{"$f":"_xlfn.CONCAT(H167,\"/\",H168,\"/\",H169,\"/\",H170,\" IO DRAWINGS\")","v":"UL21_6_VFD1/UL21_7_VFD1/UL21_8_VFD1/UL21_9_VFD1 IO DRAWINGS"},null,null,null,null,null,null,null,null,null,null,"UL21_6_VFD1/UL21_7_VFD1/UL21_8_VFD1/UL21_9_VFD1 IO DRAWINGS"]
["PS5_12_VFD1","PS5_12_VFD1_I1","I1",null,"SPARE",null,null,null,null,null,{"$f":"_xlfn.CONCAT(H172,\"/\",H173,\"/\",H174,\"/\",H175,\" IO DRAWINGS\")","v":"UL13_2_FIO1/UL14_3_FIO1/UL15_3_FIO1/UL16_2_FIO1 IO DRAWINGS"},null,null,null,null,null,null,null,null,null,null,"UL13_2_FIO1/UL14_3_FIO1/UL15_3_FIO1/UL16_2_FIO1 IO DRAWINGS"]
["PS5_12_VFD1","PS5_12_VFD1_I2","I2",null,"PS5_12_TPE1","TRACKING PHOTOEYE",null,"PS7_11_VFD1",607,null,{"$f":"_xlfn.CONCAT(H177,\"/\",H178,\"/\",H179,\"/\",H180,\" IO DRAWINGS\")","v":"UL17_3_FIO1/UL18_3_FIO1/UL19_2_FIO1/UL20_3_FIO1 IO DRAWINGS"},null,null,null,null,null,null,null,null,null,null,"UL17_3_FIO1/UL18_3_FIO1/UL19_2_FIO1/UL20_3_FIO1 IO DRAWINGS"]
["PS5_12_VFD1","PS5_12_VFD1_I3","I3",null,"PS5_12_TPE2","TRACKING PHOTOEYE",null,"PS7_12_VFD1",null,null,{"$f":"_xlfn.CONCAT(H182,\" IO DRAWINGS\")","v":"UL21_3_FIO1 IO DRAWINGS"},null,null,null,null,null,null,null,null,null,null,"UL21_3_FIO1 IO DRAWINGS"]
["PS5_12_VFD1","PS5_12_VFD1_IO0","IO0",null,"SPARE",null,null,"PS7_13_VFD1"]
["PS5_12_VFD1","PS5_12_VFD1_IO1","IO1",null,"SPARE",null,null,"PS7_14_VFD1"]
["PS5_12_VFD1","PS5_12_VFD1_SI0","SI0",null,"SPARE"]
["PS5_12_VFD1","PS5_12_VFD1_SI1","SI1",null,"SPARE",null,null,"PS7_2_VFD1",608]
["PS5_12_VFD1","PS5_12_VFD1_SI2","SI2",null,"SPARE",null,null,"PS7_3_VFD1"]
["PS5_12_VFD1","PS5_12_VFD1_SI3","SI3",null,"SPARE",null,null,"PS7_4_VFD1"]
["PS5_12_VFD1","PS5_12_VFD1_SO0","SO0",null,"SPARE",null,null,"PS7_5_VFD1"]
["PS5_13_VFD1","PS5_13_VFD1_I0","I0",null,"PS5_13_DISC","DISCONNECT AUX"]
["PS5_13_VFD1","PS5_13_VFD1_I1","I1",null,"SPARE",null,null,"PS7_6_VFD1",609]
["PS5_13_VFD1","PS5_13_VFD1_I2","I2",null,"PS5_13_TPE1","TRACKING PHOTOEYE",null,"PS7_7_VFD1"]
["PS5_13_VFD1","PS5_13_VFD1_I3","I3",null,"SPARE",null,null,"PS7_8_VFD1"]
["PS5_13_VFD1","PS5_13_VFD1_IO0","IO0",null,"SPARE",null,null,"PS7_9_VFD1"]
["PS5_13_VFD1","PS5_13_VFD1_IO1","IO1",null,"SPARE"]
["PS5_13_VFD1","PS5_13_VFD1_SI0","SI0",null,"SPARE",null,null,"UL13_1_VFD1",610]
["PS5_13_VFD1","PS5_13_VFD1_SI1","SI1",null,"SPARE",null,null,"UL13_10_VFD1"]
["PS5_13_VFD1","PS5_13_VFD1_SI2","SI2",null,"SPARE",null,null,"UL13_11_VFD1"]
["PS5_13_VFD1","PS5_13_VFD1_SI3","SI3",null,"SPARE",null,null,"UL13_12_VFD1"]
["PS5_13_VFD1","PS5_13_VFD1_SO0","SO0",null,"SPARE"]
["PS5_2_VFD1","PS5_2_VFD1_I0","I0",null,"PS5_2_DISC","DISCONNECT AUX",null,"UL13_2_VFD1",611]
["PS5_2_VFD1","PS5_2_VFD1_I1","I1",null,"SPARE",null,null,"UL13_3_VFD1"]
["PS5_2_VFD1","PS5_2_VFD1_I2","I2",null,"PS5_2_TPE1","TRACKING PHOTOEYE",null,"UL13_4_VFD1"]
["PS5_2_VFD1","PS5_2_VFD1_I3","I3",null,"PS5_2_TPE2","TRACKING PHOTOEYE",null,"UL13_5_VFD1"]
["PS5_2_VFD1","PS5_2_VFD1_IO0","IO0",null,"PS5_1_S2_PB","START PUSHBUTTON"]
["PS5_2_VFD1","PS5_2_VFD1_IO1","IO1",null,"PS5_1_S2_PB_LT","START PUSHBUTTON LIGHT",null,"UL13_6_VFD1",612]
["PS5_2_VFD1","PS5_2_VFD1_SI0","SI0",null,"SPARE",null,null,"UL13_7_VFD1"]
["PS5_2_VFD1","PS5_2_VFD1_SI1","SI1",null,"SPARE",null,null,"UL13_8_VFD1"]
["PS5_2_VFD1","PS5_2_VFD1_SI2","SI2",null,"SPARE",null,null,"UL13_9A_VFD1"]
["PS5_2_VFD1","PS5_2_VFD1_SI3","SI3",null,"SPARE"]
["PS5_2_VFD1","PS5_2_VFD1_SO0","SO0",null,"SPARE",null,null,"UL13_9B_VFD1",613]
["PS5_3_VFD1","PS5_3_VFD1_I0","I0",null,"PS5_3_DISC","DISCONNECT AUX",null,"UL14_10_VFD1"]
["PS5_3_VFD1","PS5_3_VFD1_I1","I1",null,"SPARE",null,null,"UL14_3_VFD1"]
["PS5_3_VFD1","PS5_3_VFD1_I2","I2",null,"SPARE",null,null,"UL14_4_VFD1"]
["PS5_3_VFD1","PS5_3_VFD1_I3","I3",null,"SPARE"]
["PS5_3_VFD1","PS5_3_VFD1_IO0","IO0",null,"PS5_2_BCN1_A","AMBER BEACON LIGHT",null,"UL14_5_VFD1",614]
["PS5_3_VFD1","PS5_3_VFD1_IO1","IO1",null,"PS5_2_BCN1_R","RED BEACON LIGHT",null,"UL14_6_VFD1"]
["PS5_3_VFD1","PS5_3_VFD1_SI0","SI0",null,"SPARE",null,null,"UL14_7_VFD1"]
["PS5_3_VFD1","PS5_3_VFD1_SI1","SI1",null,"SPARE",null,null,"UL14_8_VFD1"]
["PS5_3_VFD1","PS5_3_VFD1_SI2","SI2",null,"SPARE"]
["PS5_3_VFD1","PS5_3_VFD1_SI3","SI3",null,"SPARE",null,null,"UL14_9_VFD1",615]
["PS5_3_VFD1","PS5_3_VFD1_SO0","SO0",null,"SPARE",null,null,"UL15_10_VFD1"]
["PS5_4_VFD1","PS5_4_VFD1_I0","I0",null,"PS5_4_DISC","DISCONNECT AUX",null,"UL15_11_VFD1"]
["PS5_4_VFD1","PS5_4_VFD1_I1","I1",null,"SPARE",null,null,"UL15_3_VFD1"]
["PS5_4_VFD1","PS5_4_VFD1_I2","I2",null,"PS5_4_TPE1","TRACKING PHOTOEYE"]
["PS5_4_VFD1","PS5_4_VFD1_I3","I3",null,"PS5_4_TPE2","TRACKING PHOTOEYE",null,"UL15_4_VFD1",616]
["PS5_4_VFD1","PS5_4_VFD1_IO0","IO0",null,"SPARE",null,null,"UL15_5_VFD1"]
["PS5_4_VFD1","PS5_4_VFD1_IO1","IO1",null,"SPARE",null,null,"UL15_6_VFD1"]
["PS5_4_VFD1","PS5_4_VFD1_SI0","SI0",null,"SPARE",null,null,"UL15_7_VFD1"]
["PS5_4_VFD1","PS5_4_VFD1_SI1","SI1",null,"SPARE"]
["PS5_4_VFD1","PS5_4_VFD1_SI2","SI2",null,"SPARE",null,null,"UL15_8_VFD1",617]
["PS5_4_VFD1","PS5_4_VFD1_SI3","SI3",null,"SPARE",null,null,"UL15_9_VFD1"]
["PS5_4_VFD1","PS5_4_VFD1_SO0","SO0",null,"SPARE",null,null,"UL16_1_VFD1"]
["PS5_5_VFD1","PS5_5_VFD1_I0","I0",null,"PS5_5_DISC","DISCONNECT AUX",null,"UL16_2_VFD1"]
["PS5_5_VFD1","PS5_5_VFD1_I1","I1",null,"SPARE"]
["PS5_5_VFD1","PS5_5_VFD1_I2","I2",null,"PS5_5_TPE1","TRACKING PHOTOEYE",null,"UL16_3_VFD1",618]
["PS5_5_VFD1","PS5_5_VFD1_I3","I3",null,"SPARE",null,null,"UL16_4_VFD1"]
["PS5_5_VFD1","PS5_5_VFD1_IO0","IO0",null,"SPARE",null,null,"UL16_5_VFD1"]
["PS5_5_VFD1","PS5_5_VFD1_IO1","IO1",null,"SPARE",null,null,"UL16_6_VFD1"]
["PS5_5_VFD1","PS5_5_VFD1_SI0","SI0",null,"SPARE"]
["PS5_5_VFD1","PS5_5_VFD1_SI1","SI1",null,"SPARE",null,null,"UL16_7_VFD1",619]
["PS5_5_VFD1","PS5_5_VFD1_SI2","SI2",null,"SPARE",null,null,"UL16_8_VFD1"]
["PS5_5_VFD1","PS5_5_VFD1_SI3","SI3",null,"SPARE",null,null,"UL16_9_VFD1"]
["PS5_5_VFD1","PS5_5_VFD1_SO0","SO0",null,"SPARE",null,null,"UL17_10_VFD1"]
["PS5_6_VFD1","PS5_6_VFD1_I0","I0",null,"PS5_6_DISC","DISCONNECT AUX"]
["PS5_6_VFD1","PS5_6_VFD1_I1","I1",null,"SPARE",null,null,"UL17_3_VFD1",620]
["PS5_6_VFD1","PS5_6_VFD1_I2","I2",null,"SPARE",null,null,"UL17_4_VFD1"]
["PS5_6_VFD1","PS5_6_VFD1_I3","I3",null,"SPARE",null,null,"UL17_5_VFD1"]
["PS5_6_VFD1","PS5_6_VFD1_IO0","IO0",null,"PS5_6_JR1_PB","JAM RESET PUSHBUTTON",null,"UL17_6_VFD1"]
["PS5_6_VFD1","PS5_6_VFD1_IO1","IO1",null,"PS5_6_JR1_PB_LT","JAM RESET PUSHBUTTON LIGHT"]
["PS5_6_VFD1","PS5_6_VFD1_SI0","SI0",null,"SPARE",null,null,"UL17_7_VFD1",621]
["PS5_6_VFD1","PS5_6_VFD1_SI1","SI1",null,"SPARE",null,null,"UL17_8_VFD1"]
["PS5_6_VFD1","PS5_6_VFD1_SI2","SI2",null,"SPARE",null,null,"UL17_9_VFD1"]
["PS5_6_VFD1","PS5_6_VFD1_SI3","SI3",null,"SPARE",null,null,"UL18_10_VFD1"]
["PS5_6_VFD1","PS5_6_VFD1_SO0","SO0",null,"PS5_6_BCN1_A","AMBER BEACON LIGHT"]
["PS5_7_VFD1","PS5_7_VFD1_I0","I0",null,"PS5_7_DISC","DISCONNECT AUX",null,"UL18_11_VFD1",622]
["PS5_7_VFD1","PS5_7_VFD1_I1","I1",null,"SPARE",null,null,"UL18_12_VFD1"]
["PS5_7_VFD1","PS5_7_VFD1_I2","I2",null,"PS5_7_TPE1","TRACKING PHOTOEYE",null,"UL18_13A_VFD1"]
["PS5_7_VFD1","PS5_7_VFD1_I3","I3",null,"SPARE",null,null,"UL18_13B_VFD1"]
["PS5_7_VFD1","PS5_7_VFD1_IO0","IO0",null,"SPARE"]
["PS5_7_VFD1","PS5_7_VFD1_IO1","IO1",null,"SPARE",null,null,"UL18_14_VFD1",623]
["PS5_7_VFD1","PS5_7_VFD1_SI0","SI0",null,"SPARE",null,null,"UL18_15_VFD1"]
["PS5_7_VFD1","PS5_7_VFD1_SI1","SI1",null,"SPARE",null,null,"UL18_16_VFD1"]
["PS5_7_VFD1","PS5_7_VFD1_SI2","SI2",null,"SPARE",null,null,"UL18_3_VFD1"]
["PS5_7_VFD1","PS5_7_VFD1_SI3","SI3",null,"SPARE"]
["PS5_7_VFD1","PS5_7_VFD1_SO0","SO0",null,"SPARE",null,null,"UL18_4_VFD1",624]
["PS5_8_VFD1","PS5_8_VFD1_I0","I0",null,"PS5_8_DISC","DISCONNECT AUX",null,"UL18_5_VFD1"]
["PS5_8_VFD1","PS5_8_VFD1_I1","I1",null,"SPARE",null,null,"UL18_6_VFD1"]
["PS5_8_VFD1","PS5_8_VFD1_I2","I2",null,"PS5_8_TPE1","TRACKING PHOTOEYE",null,"UL18_7_VFD1"]
["PS5_8_VFD1","PS5_8_VFD1_I3","I3",null,"PS5_8_TPE2","TRACKING PHOTOEYE"]
["PS5_8_VFD1","PS5_8_VFD1_IO0","IO0",null,"PS5_9_JR2_PB","JAM RESET PUSHBUTTON",null,"UL18_8_VFD1",625]
["PS5_8_VFD1","PS5_8_VFD1_IO1","IO1",null,"PS5_9_JR2_PB_LT","JAM RESET PUSHBUTTON LIGHT",null,"UL18_9_VFD1"]
["PS5_8_VFD1","PS5_8_VFD1_SI0","SI0",null,"SPARE",null,null,"UL19_1_VFD1"]
["PS5_8_VFD1","PS5_8_VFD1_SI1","SI1",null,"SPARE",null,null,"UL19_2_VFD1"]
["PS5_8_VFD1","PS5_8_VFD1_SI2","SI2",null,"SPARE"]
["PS5_8_VFD1","PS5_8_VFD1_SI3","SI3",null,"SPARE",null,null,"UL19_3_VFD1",626]
["PS5_8_VFD1","PS5_8_VFD1_SO0","SO0",null,"SPARE",null,null,"UL19_4_VFD1"]
["PS5_9_VFD1","PS5_9_VFD1_I0","I0",null,"PS5_9_DISC","DISCONNECT AUX",null,"UL19_5_VFD1"]
["PS5_9_VFD1","PS5_9_VFD1_I1","I1",null,"SPARE",null,null,"UL19_6_VFD1"]
["PS5_9_VFD1","PS5_9_VFD1_I2","I2",null,"SPARE"]
["PS5_9_VFD1","PS5_9_VFD1_I3","I3",null,"SPARE",null,null,"UL19_7_VFD1",627]
["PS5_9_VFD1","PS5_9_VFD1_IO0","IO0",null,"PS5_9_JR1_PB","JAM RESET PUSHBUTTON",null,"UL19_8_VFD1"]
["PS5_9_VFD1","PS5_9_VFD1_IO1","IO1",null,"PS5_9_JR1_PB_LT","JAM RESET PUSHBUTTON LIGHT",null,"UL19_9_VFD1"]
["PS5_9_VFD1","PS5_9_VFD1_SI0","SI0",null,"SPARE",null,null,"UL20_10_VFD1"]
["PS5_9_VFD1","PS5_9_VFD1_SI1","SI1",null,"SPARE"]
["PS5_9_VFD1","PS5_9_VFD1_SI2","SI2",null,"SPARE",null,null,"UL20_11_VFD1",628]
["PS5_9_VFD1","PS5_9_VFD1_SI3","SI3",null,"SPARE",null,null,"UL20_3_VFD1"]
["PS5_9_VFD1","PS5_9_VFD1_SO0","SO0",null,"PS5_9_BCN1_A","AMBER BEACON LIGHT",null,"UL20_4_VFD1"]
["PS6_1_VFD1","PS6_1_VFD1_I0","I0",null,"PS6_1_DISC","DISCONNECT AUX",null,"UL20_5_VFD1"]
["PS6_1_VFD1","PS6_1_VFD1_I1","I1",null,"SPARE"]
["PS6_1_VFD1","PS6_1_VFD1_I2","I2",null,"SPARE",null,null,"UL20_6_VFD1",629]
["PS6_1_VFD1","PS6_1_VFD1_I3","I3",null,"SPARE",null,null,"UL20_7_VFD1"]
["PS6_1_VFD1","PS6_1_VFD1_IO0","IO0",null,"PS6_1_S1_PB","START PUSHBUTTON",null,"UL20_8_VFD1"]
["PS6_1_VFD1","PS6_1_VFD1_IO1","IO1",null,"PS6_1_S1_PB_LT","START PUSHBUTTON LIGHT",null,"UL20_9_VFD1"]
["PS6_1_VFD1","PS6_1_VFD1_SI0","SI0",null,"PS6_1_EPC1","E-STOP PULLCORD"]
["PS6_1_VFD1","PS6_1_VFD1_SI1","SI1",null,"PS6_1_EPC1_2","E-STOP PULLCORD",null,"UL21_10_VFD1",630]
["PS6_1_VFD1","PS6_1_VFD1_SI2","SI2",null,"PS6_1_EPC2","E-STOP PULLCORD",null,"UL21_11_VFD1"]
["PS6_1_VFD1","PS6_1_VFD1_SI3","SI3",null,"PS6_1_EPC2_2","E-STOP PULLCORD",null,"UL21_12_VFD1"]
["PS6_1_VFD1","PS6_1_VFD1_SO0","SO0",null,"PS6_1_BCN1_R","RED BEACON LIGHT",null,"UL21_13_VFD1"]
["PS6_10_VFD1","PS6_10_VFD1_I0","I0",null,"PS6_10_DISC","DISCONNECT AUX"]
["PS6_10_VFD1","PS6_10_VFD1_I1","I1",null,"SPARE",null,null,"UL21_14A_VFD1",631]
["PS6_10_VFD1","PS6_10_VFD1_I2","I2",null,"PS6_10_TPE1","TRACKING PHOTOEYE",null,"UL21_14B_VFD1"]
["PS6_10_VFD1","PS6_10_VFD1_I3","I3",null,"PS6_10_TPE2","TRACKING PHOTOEYE",null,"UL21_15_VFD1"]
["PS6_10_VFD1","PS6_10_VFD1_IO0","IO0",null,"SPARE",null,null,"UL21_16_VFD1"]
["PS6_10_VFD1","PS6_10_VFD1_IO1","IO1",null,"SPARE"]
["PS6_10_VFD1","PS6_10_VFD1_SI0","SI0",null,"SPARE",null,null,"UL21_17_VFD1",632]
["PS6_10_VFD1","PS6_10_VFD1_SI1","SI1",null,"SPARE",null,null,"UL21_3_VFD1"]
["PS6_10_VFD1","PS6_10_VFD1_SI2","SI2",null,"SPARE",null,null,"UL21_4_VFD1"]
["PS6_10_VFD1","PS6_10_VFD1_SI3","SI3",null,"SPARE",null,null,"UL21_5_VFD1"]
["PS6_10_VFD1","PS6_10_VFD1_SO0","SO0",null,"SPARE"]
["PS6_11_VFD1","PS6_11_VFD1_I0","I0",null,"PS6_11_DISC","DISCONNECT AUX",null,"UL21_6_VFD1",633]
["PS6_11_VFD1","PS6_11_VFD1_I1","I1",null,"SPARE",null,null,"UL21_7_VFD1"]
["PS6_11_VFD1","PS6_11_VFD1_I2","I2",null,"SPARE",null,null,"UL21_8_VFD1"]
["PS6_11_VFD1","PS6_11_VFD1_I3","I3",null,"SPARE",null,null,"UL21_9_VFD1"]
["PS6_11_VFD1","PS6_11_VFD1_IO0","IO0",null,"PS6_11_JR1_PB","JAM RESET PUSHBUTTON"]
["PS6_11_VFD1","PS6_11_VFD1_IO1","IO1",null,"PS6_11_JR1_PB_LT","JAM RESET PUSHBUTTON LIGHT",null,"UL13_2_FIO1",634]
["PS6_11_VFD1","PS6_11_VFD1_SI0","SI0",null,"SPARE",null,null,"UL14_3_FIO1"]
["PS6_11_VFD1","PS6_11_VFD1_SI1","SI1",null,"SPARE",null,null,"UL15_3_FIO1"]
["PS6_11_VFD1","PS6_11_VFD1_SI2","SI2",null,"SPARE",null,null,"UL16_2_FIO1"]
["PS6_11_VFD1","PS6_11_VFD1_SI3","SI3",null,"SPARE"]
["PS6_11_VFD1","PS6_11_VFD1_SO0","SO0",null,"PS6_11_BCN1_A","AMBER BEACON LIGHT",null,"UL17_3_FIO1",635]
["PS6_12_VFD1","PS6_12_VFD1_I0","I0",null,"PS6_12_DISC","DISCONNECT AUX",null,"UL18_3_FIO1"]
["PS6_12_VFD1","PS6_12_VFD1_I1","I1",null,"SPARE",null,null,"UL19_2_FIO1"]
["PS6_12_VFD1","PS6_12_VFD1_I2","I2",null,"PS6_12_TPE1","TRACKING PHOTOEYE",null,"UL20_3_FIO1"]
["PS6_12_VFD1","PS6_12_VFD1_I3","I3",null,"PS6_12_TPE2","TRACKING PHOTOEYE"]
["PS6_12_VFD1","PS6_12_VFD1_IO0","IO0",null,"SPARE",null,null,"UL21_3_FIO1",636]
["PS6_12_VFD1","PS6_12_VFD1_IO1","IO1",null,"SPARE"]
["PS6_12_VFD1","PS6_12_VFD1_SI0","SI0",null,"SPARE"]
["PS6_12_VFD1","PS6_12_VFD1_SI1","SI1",null,"SPARE"]
["PS6_12_VFD1","PS6_12_VFD1_SI2","SI2",null,"SPARE"]
["PS6_12_VFD1","PS6_12_VFD1_SI3","SI3",null,"SPARE"]
["PS6_12_VFD1","PS6_12_VFD1_SO0","SO0",null,"SPARE"]
["PS6_13_VFD1","PS6_13_VFD1_I0","I0",null,"PS6_13_DISC","DISCONNECT AUX"]
["PS6_13_VFD1","PS6_13_VFD1_I1","I1",null,"SPARE"]
["PS6_13_VFD1","PS6_13_VFD1_I2","I2",null,"SPARE"]
["PS6_13_VFD1","PS6_13_VFD1_I3","I3",null,"SPARE"]
["PS6_13_VFD1","PS6_13_VFD1_IO0","IO0",null,"SPARE"]
["PS6_13_VFD1","PS6_13_VFD1_IO1","IO1",null,"SPARE"]
["PS6_13_VFD1","PS6_13_VFD1_SI0","SI0",null,"SPARE"]
["PS6_13_VFD1","PS6_13_VFD1_SI1","SI1",null,"SPARE"]
["PS6_13_VFD1","PS6_13_VFD1_SI2","SI2",null,"SPARE"]
["PS6_13_VFD1","PS6_13_VFD1_SI3","SI3",null,"SPARE"]
["PS6_13_VFD1","PS6_13_VFD1_SO0","SO0",null,"SPARE"]
["PS6_2_VFD1","PS6_2_VFD1_I0","I0",null,"PS6_2_DISC","DISCONNECT AUX"]
["PS6_2_VFD1","PS6_2_VFD1_I1","I1",null,"SPARE"]
["PS6_2_VFD1","PS6_2_VFD1_I2","I2",null,"PS6_2_TPE1","TRACKING PHOTOEYE"]
["PS6_2_VFD1","PS6_2_VFD1_I3","I3",null,"PS6_2_TPE2","TRACKING PHOTOEYE"]
["PS6_2_VFD1","PS6_2_VFD1_IO0","IO0",null,"PS6_1_S2_PB","START PUSHBUTTON"]
["PS6_2_VFD1","PS6_2_VFD1_IO1","IO1",null,"PS6_1_S2_PB_LT","START PUSHBUTTON LIGHT"]
["PS6_2_VFD1","PS6_2_VFD1_SI0","SI0",null,"SPARE"]
["PS6_2_VFD1","PS6_2_VFD1_SI1","SI1",null,"SPARE"]
["PS6_2_VFD1","PS6_2_VFD1_SI2","SI2",null,"SPARE"]
["PS6_2_VFD1","PS6_2_VFD1_SI3","SI3",null,"SPARE"]
["PS6_2_VFD1","PS6_2_VFD1_SO0","SO0",null,"SPARE"]
["PS6_3_VFD1","PS6_3_VFD1_I0","I0",null,"PS6_3_DISC","DISCONNECT AUX"]
["PS6_3_VFD1","PS6_3_VFD1_I1","I1",null,"SPARE"]
["PS6_3_VFD1","PS6_3_VFD1_I2","I2",null,"SPARE"]
["PS6_3_VFD1","PS6_3_VFD1_I3","I3",null,"SPARE"]
["PS6_3_VFD1","PS6_3_VFD1_IO0","IO0",null,"PS6_2_BCN2_A","AMBER BEACON LIGHT"]
["PS6_3_VFD1","PS6_3_VFD1_IO1","IO1",null,"PS6_2_BCN2_R","RED BEACON LIGHT"]
["PS6_3_VFD1","PS6_3_VFD1_SI0","SI0",null,"SPARE"]
["PS6_3_VFD1","PS6_3_VFD1_SI1","SI1",null,"SPARE"]
["PS6_3_VFD1","PS6_3_VFD1_SI2","SI2",null,"SPARE"]
["PS6_3_VFD1","PS6_3_VFD1_SI3","SI3",null,"SPARE"]
["PS6_3_VFD1","PS6_3_VFD1_SO0","SO0",null,"SPARE"]
["PS6_4_VFD1","PS6_4_VFD1_I0","I0",null,"PS6_4_DISC","DISCONNECT AUX"]
["PS6_4_VFD1","PS6_4_VFD1_I1","I1",null,"SPARE"]
["PS6_4_VFD1","PS6_4_VFD1_I2","I2",null,"PS6_4_TPE1","TRACKING PHOTOEYE"]
["PS6_4_VFD1","PS6_4_VFD1_I3","I3",null,"PS6_4_TPE2","TRACKING PHOTOEYE"]
["PS6_4_VFD1","PS6_4_VFD1_IO0","IO0",null,"SPARE"]
["PS6_4_VFD1","PS6_4_VFD1_IO1","IO1",null,"SPARE"]
["PS6_4_VFD1","PS6_4_VFD1_SI0","SI0",null,"SPARE"]
["PS6_4_VFD1","PS6_4_VFD1_SI1","SI1",null,"SPARE"]
["PS6_4_VFD1","PS6_4_VFD1_SI2","SI2",null,"SPARE"]
["PS6_4_VFD1","PS6_4_VFD1_SI3","SI3",null,"SPARE"]
["PS6_4_VFD1","PS6_4_VFD1_SO0","SO0",null,"SPARE"]
["PS6_5_VFD1","PS6_5_VFD1_I0","I0",null,"PS6_5_DISC","DISCONNECT AUX"]
["PS6_5_VFD1","PS6_5_VFD1_I1","I1",null,"SPARE"]
["PS6_5_VFD1","PS6_5_VFD1_I2","I2",null,"PS6_5_TPE1","TRACKING PHOTOEYE"]
["PS6_5_VFD1","PS6_5_VFD1_I3","I3",null,"SPARE"]
["PS6_5_VFD1","PS6_5_VFD1_IO0","IO0",null,"PS6_6_BCN1_A","AMBER BEACON LIGHT"]
["PS6_5_VFD1","PS6_5_VFD1_IO1","IO1",null,"PS6_6_BCN1_H","ALARM HORN"]
["PS6_5_VFD1","PS6_5_VFD1_SI0","SI0",null,"SPARE"]
["PS6_5_VFD1","PS6_5_VFD1_SI1","SI1",null,"SPARE"]
["PS6_5_VFD1","PS6_5_VFD1_SI2","SI2",null,"SPARE"]
["PS6_5_VFD1","PS6_5_VFD1_SI3","SI3",null,"SPARE"]
["PS6_5_VFD1","PS6_5_VFD1_SO0","SO0",null,"SPARE"]
["PS6_6_VFD1","PS6_6_VFD1_I0","I0",null,"PS6_6_DISC","DISCONNECT AUX"]
["PS6_6_VFD1","PS6_6_VFD1_I1","I1",null,"SPARE"]
["PS6_6_VFD1","PS6_6_VFD1_I2","I2",null,"SPARE"]
["PS6_6_VFD1","PS6_6_VFD1_I3","I3",null,"SPARE"]
["PS6_6_VFD1","PS6_6_VFD1_IO0","IO0",null,"PS6_6_JR1_PB","JAM RESET PUSHBUTTON"]
["PS6_6_VFD1","PS6_6_VFD1_IO1","IO1",null,"PS6_6_JR1_PB_LT","JAM RESET PUSHBUTTON LIGHT"]
["PS6_6_VFD1","PS6_6_VFD1_SI0","SI0",null,"SPARE"]
["PS6_6_VFD1","PS6_6_VFD1_SI1","SI1",null,"SPARE"]
["PS6_6_VFD1","PS6_6_VFD1_SI2","SI2",null,"SPARE"]
["PS6_6_VFD1","PS6_6_VFD1_SI3","SI3",null,"SPARE"]
["PS6_6_VFD1","PS6_6_VFD1_SO0","SO0",null,"SPARE"]
["PS6_7_VFD1","PS6_7_VFD1_I0","I0",null,"PS6_7_DISC","DISCONNECT AUX"]
["PS6_7_VFD1","PS6_7_VFD1_I1","I1",null,"SPARE"]
["PS6_7_VFD1","PS6_7_VFD1_I2","I2",null,"PS6_7_TPE1","TRACKING PHOTOEYE"]
["PS6_7_VFD1","PS6_7_VFD1_I3","I3",null,"SPARE"]
["PS6_7_VFD1","PS6_7_VFD1_IO0","IO0",null,"SPARE"]
["PS6_7_VFD1","PS6_7_VFD1_IO1","IO1",null,"SPARE"]
["PS6_7_VFD1","PS6_7_VFD1_SI0","SI0",null,"SPARE"]
["PS6_7_VFD1","PS6_7_VFD1_SI1","SI1",null,"SPARE"]
["PS6_7_VFD1","PS6_7_VFD1_SI2","SI2",null,"SPARE"]
["PS6_7_VFD1","PS6_7_VFD1_SI3","SI3",null,"SPARE"]
["PS6_7_VFD1","PS6_7_VFD1_SO0","SO0",null,"SPARE"]
["PS6_8_VFD1","PS6_8_VFD1_I0","I0",null,"PS6_8_DISC","DISCONNECT AUX"]
["PS6_8_VFD1","PS6_8_VFD1_I1","I1",null,"SPARE"]
["PS6_8_VFD1","PS6_8_VFD1_I2","I2",null,"PS6_8_TPE1","TRACKING PHOTOEYE"]
["PS6_8_VFD1","PS6_8_VFD1_I3","I3",null,"PS6_8_TPE2","TRACKING PHOTOEYE"]
["PS6_8_VFD1","PS6_8_VFD1_IO0","IO0",null,"PS6_8_JR1_PB","JAM RESET PUSHBUTTON"]
["PS6_8_VFD1","PS6_8_VFD1_IO1","IO1",null,"PS6_8_JR1_PB_LT","JAM RESET PUSHBUTTON LIGHT"]
["PS6_8_VFD1","PS6_8_VFD1_SI0","SI0",null,"SPARE"]
["PS6_8_VFD1","PS6_8_VFD1_SI1","SI1",null,"SPARE"]
["PS6_8_VFD1","PS6_8_VFD1_SI2","SI2",null,"SPARE"]
["PS6_8_VFD1","PS6_8_VFD1_SI3","SI3",null,"SPARE"]
["PS6_8_VFD1","PS6_8_VFD1_SO0","SO0",null,"PS6_8_BCN1_A","AMBER BEACON LIGHT"]
["PS6_9_VFD1","PS6_9_VFD1_I0","I0",null,"PS6_9_DISC","DISCONNECT AUX"]
["PS6_9_VFD1","PS6_9_VFD1_I1","I1",null,"SPARE"]
["PS6_9_VFD1","PS6_9_VFD1_I2","I2",null,"SPARE"]
["PS6_9_VFD1","PS6_9_VFD1_I3","I3",null,"SPARE"]
["PS6_9_VFD1","PS6_9_VFD1_IO0","IO0",null,"PS6_9_JR1_PB","JAM RESET PUSHBUTTON"]
["PS6_9_VFD1","PS6_9_VFD1_IO1","IO1",null,"PS6_9_JR1_PB_LT","JAM RESET PUSHBUTTON LIGHT"]
["PS6_9_VFD1","PS6_9_VFD1_SI0","SI0",null,"SPARE"]
["PS6_9_VFD1","PS6_9_VFD1_SI1","SI1",null,"SPARE"]
["PS6_9_VFD1","PS6_9_VFD1_SI2","SI2",null,"SPARE"]
["PS6_9_VFD1","PS6_9_VFD1_SI3","SI3",null,"SPARE"]
["PS6_9_VFD1","PS6_9_VFD1_SO0","SO0",null,"SPARE"]
["PS7_1_VFD1","PS7_1_VFD1_I0","I0",null,"PS7_1_DISC","DISCONNECT AUX"]
["PS7_1_VFD1","PS7_1_VFD1_I1","I1",null,"SPARE"]
["PS7_1_VFD1","PS7_1_VFD1_I2","I2",null,"SPARE"]
["PS7_1_VFD1","PS7_1_VFD1_I3","I3",null,"SPARE"]
["PS7_1_VFD1","PS7_1_VFD1_IO0","IO0",null,"PS7_1_S1_PB","START PUSHBUTTON"]
["PS7_1_VFD1","PS7_1_VFD1_IO1","IO1",null,"PS7_1_S1_PB_LT","START PUSHBUTTON LIGHT"]
["PS7_1_VFD1","PS7_1_VFD1_SI0","SI0",null,"PS7_1_EPC1","E-STOP PULLCORD"]
["PS7_1_VFD1","PS7_1_VFD1_SI1","SI1",null,"PS7_1_EPC1_2","E-STOP PULLCORD"]
["PS7_1_VFD1","PS7_1_VFD1_SI2","SI2",null,"PS7_1_EPC2","E-STOP PULLCORD"]
["PS7_1_VFD1","PS7_1_VFD1_SI3","SI3",null,"PS7_1_EPC2_2","E-STOP PULLCORD"]
["PS7_1_VFD1","PS7_1_VFD1_SO0","SO0",null,"PS7_1_BCN1_R","RED BEACON LIGHT"]
["PS7_10_VFD1","PS7_10_VFD1_I0","I0",null,"PS7_10_DISC","DISCONNECT AUX"]
["PS7_10_VFD1","PS7_10_VFD1_I1","I1",null,"SPARE"]
["PS7_10_VFD1","PS7_10_VFD1_I2","I2",null,"PS7_10_TPE1","TRACKING PHOTOEYE"]
["PS7_10_VFD1","PS7_10_VFD1_I3","I3",null,"SPARE"]
["PS7_10_VFD1","PS7_10_VFD1_IO0","IO0",null,"PS7_9_S2_PB","START PUSHBUTTON"]
["PS7_10_VFD1","PS7_10_VFD1_IO1","IO1",null,"PS7_9_S2_PB_LT","START PUSHBUTTON LIGHT"]
["PS7_10_VFD1","PS7_10_VFD1_SI0","SI0",null,"SPARE"]
["PS7_10_VFD1","PS7_10_VFD1_SI1","SI1",null,"SPARE"]
["PS7_10_VFD1","PS7_10_VFD1_SI2","SI2",null,"SPARE"]
["PS7_10_VFD1","PS7_10_VFD1_SI3","SI3",null,"SPARE"]
["PS7_10_VFD1","PS7_10_VFD1_SO0","SO0",null,"PS7_9_BCN2_R","RED BEACON LIGHT"]
["PS7_11_VFD1","PS7_11_VFD1_I0","I0",null,"PS7_11_DISC","DISCONNECT AUX"]
["PS7_11_VFD1","PS7_11_VFD1_I1","I1",null,"SPARE"]
["PS7_11_VFD1","PS7_11_VFD1_I2","I2",null,"SPARE"]
["PS7_11_VFD1","PS7_11_VFD1_I3","I3",null,"SPARE"]
["PS7_11_VFD1","PS7_11_VFD1_IO0","IO0",null,"PS7_11_JR1_PB","JAM RESET PUSHBUTTON"]
["PS7_11_VFD1","PS7_11_VFD1_IO1","IO1",null,"PS7_11_JR1_PB_LT","JAM RESET PUSHBUTTON LIGHT"]
["PS7_11_VFD1","PS7_11_VFD1_SI0","SI0",null,"SPARE"]
["PS7_11_VFD1","PS7_11_VFD1_SI1","SI1",null,"SPARE"]
["PS7_11_VFD1","PS7_11_VFD1_SI2","SI2",null,"SPARE"]
["PS7_11_VFD1","PS7_11_VFD1_SI3","SI3",null,"SPARE"]
["PS7_11_VFD1","PS7_11_VFD1_SO0","SO0",null,"PS7_11_BCN1_A","AMBER BEACON LIGHT"]
["PS7_12_VFD1","PS7_12_VFD1_I0","I0",null,"PS7_12_DISC","DISCONNECT AUX"]
["PS7_12_VFD1","PS7_12_VFD1_I1","I1",null,"SPARE"]
["PS7_12_VFD1","PS7_12_VFD1_I2","I2",null,"PS7_12_TPE1","TRACKING PHOTOEYE"]
["PS7_12_VFD1","PS7_12_VFD1_I3","I3",null,"PS7_12_TPE2","TRACKING PHOTOEYE"]
["PS7_12_VFD1","PS7_12_VFD1_IO0","IO0",null,"PS7_13_BCN1_A","AMBER BEACON LIGHT"]
["PS7_12_VFD1","PS7_12_VFD1_IO1","IO1",null,"PS7_13_BCN1_H","ALARM HORN"]
["PS7_12_VFD1","PS7_12_VFD1_SI0","SI0",null,"SPARE"]
["PS7_12_VFD1","PS7_12_VFD1_SI1","SI1",null,"SPARE"]
["PS7_12_VFD1","PS7_12_VFD1_SI2","SI2",null,"SPARE"]
["PS7_12_VFD1","PS7_12_VFD1_SI3","SI3",null,"SPARE"]
["PS7_12_VFD1","PS7_12_VFD1_SO0","SO0",null,"SPARE"]
["PS7_13_VFD1","PS7_13_VFD1_I0","I0",null,"PS7_13_DISC","DISCONNECT AUX"]
["PS7_13_VFD1","PS7_13_VFD1_I1","I1",null,"SPARE"]
["PS7_13_VFD1","PS7_13_VFD1_I2","I2",null,"SPARE"]
["PS7_13_VFD1","PS7_13_VFD1_I3","I3",null,"SPARE"]
["PS7_13_VFD1","PS7_13_VFD1_IO0","IO0",null,"PS7_13_JR1_PB","JAM RESET PUSHBUTTON"]
["PS7_13_VFD1","PS7_13_VFD1_IO1","IO1",null,"PS7_13_JR1_PB_LT","JAM RESET PUSHBUTTON LIGHT"]
["PS7_13_VFD1","PS7_13_VFD1_SI0","SI0",null,"SPARE"]
["PS7_13_VFD1","PS7_13_VFD1_SI1","SI1",null,"SPARE"]
["PS7_13_VFD1","PS7_13_VFD1_SI2","SI2",null,"SPARE"]
["PS7_13_VFD1","PS7_13_VFD1_SI3","SI3",null,"SPARE"]
["PS7_13_VFD1","PS7_13_VFD1_SO0","SO0",null,"SPARE"]
["PS7_14_VFD1","PS7_14_VFD1_I0","I0",null,"PS7_14_DISC","DISCONNECT AUX"]
["PS7_14_VFD1","PS7_14_VFD1_I1","I1",null,"SPARE"]
["PS7_14_VFD1","PS7_14_VFD1_I2","I2",null,"PS7_14_TPE1","TRACKING PHOTOEYE"]
["PS7_14_VFD1","PS7_14_VFD1_I3","I3",null,"PS7_14_TPE2","TRACKING PHOTOEYE"]
["PS7_14_VFD1","PS7_14_VFD1_IO0","IO0",null,"SPARE"]
["PS7_14_VFD1","PS7_14_VFD1_IO1","IO1",null,"SPARE"]
["PS7_14_VFD1","PS7_14_VFD1_SI0","SI0",null,"SPARE"]
["PS7_14_VFD1","PS7_14_VFD1_SI1","SI1",null,"SPARE"]
["PS7_14_VFD1","PS7_14_VFD1_SI2","SI2",null,"SPARE"]
["PS7_14_VFD1","PS7_14_VFD1_SI3","SI3",null,"SPARE"]
["PS7_14_VFD1","PS7_14_VFD1_SO0","SO0",null,"SPARE"]
["PS7_2_VFD1","PS7_2_VFD1_I0","I0",null,"PS7_2_DISC","DISCONNECT AUX"]
["PS7_2_VFD1","PS7_2_VFD1_I1","I1",null,"SPARE"]
["PS7_2_VFD1","PS7_2_VFD1_I2","I2",null,"PS7_2_TPE1","TRACKING PHOTOEYE"]
["PS7_2_VFD1","PS7_2_VFD1_I3","I3",null,"PS7_2_TPE2","TRACKING PHOTOEYE"]
["PS7_2_VFD1","PS7_2_VFD1_IO0","IO0",null,"PS7_1_S2_PB","START PUSHBUTTON"]
["PS7_2_VFD1","PS7_2_VFD1_IO1","IO1",null,"PS7_1_S2_PB_LT","START PUSHBUTTON LIGHT"]
["PS7_2_VFD1","PS7_2_VFD1_SI0","SI0",null,"SPARE"]
["PS7_2_VFD1","PS7_2_VFD1_SI1","SI1",null,"SPARE"]
["PS7_2_VFD1","PS7_2_VFD1_SI2","SI2",null,"SPARE"]
["PS7_2_VFD1","PS7_2_VFD1_SI3","SI3",null,"SPARE"]
["PS7_2_VFD1","PS7_2_VFD1_SO0","SO0",null,"SPARE"]
["PS7_3_VFD1","PS7_3_VFD1_I0","I0",null,"PS7_3_DISC","DISCONNECT AUX"]
["PS7_3_VFD1","PS7_3_VFD1_I1","I1",null,"SPARE"]
["PS7_3_VFD1","PS7_3_VFD1_I2","I2",null,"SPARE"]
["PS7_3_VFD1","PS7_3_VFD1_I3","I3",null,"SPARE"]
["PS7_3_VFD1","PS7_3_VFD1_IO0","IO0",null,"PS7_2_BCN1_A","AMBER BEACON LIGHT"]
["PS7_3_VFD1","PS7_3_VFD1_IO1","IO1",null,"PS7_2_BCN1_R","RED BEACON LIGHT"]
["PS7_3_VFD1","PS7_3_VFD1_SI0","SI0",null,"SPARE"]
["PS7_3_VFD1","PS7_3_VFD1_SI1","SI1",null,"SPARE"]
["PS7_3_VFD1","PS7_3_VFD1_SI2","SI2",null,"SPARE"]
["PS7_3_VFD1","PS7_3_VFD1_SI3","SI3",null,"SPARE"]
["PS7_3_VFD1","PS7_3_VFD1_SO0","SO0",null,"SPARE"]
["PS7_4_VFD1","PS7_4_VFD1_I0","I0",null,"PS7_4_DISC","DISCONNECT AUX"]
["PS7_4_VFD1","PS7_4_VFD1_I1","I1",null,"SPARE"]
["PS7_4_VFD1","PS7_4_VFD1_I2","I2",null,"PS7_4_TPE1","TRACKING PHOTOEYE"]
["PS7_4_VFD1","PS7_4_VFD1_I3","I3",null,"PS7_4_TPE2","TRACKING PHOTOEYE"]
["PS7_4_VFD1","PS7_4_VFD1_IO0","IO0",null,"SPARE"]
["PS7_4_VFD1","PS7_4_VFD1_IO1","IO1",null,"SPARE"]
["PS7_4_VFD1","PS7_4_VFD1_SI0","SI0",null,"SPARE"]
["PS7_4_VFD1","PS7_4_VFD1_SI1","SI1",null,"SPARE"]
["PS7_4_VFD1","PS7_4_VFD1_SI2","SI2",null,"SPARE"]
["PS7_4_VFD1","PS7_4_VFD1_SI3","SI3",null,"SPARE"]
["PS7_4_VFD1","PS7_4_VFD1_SO0","SO0",null,"SPARE"]
["PS7_5_VFD1","PS7_5_VFD1_I0","I0",null,"PS7_5_DISC","DISCONNECT AUX"]
["PS7_5_VFD1","PS7_5_VFD1_I1","I1",null,"SPARE"]
["PS7_5_VFD1","PS7_5_VFD1_I2","I2",null,"PS7_5_TPE1","TRACKING PHOTOEYE"]
["PS7_5_VFD1","PS7_5_VFD1_I3","I3",null,"SPARE"]
["PS7_5_VFD1","PS7_5_VFD1_IO0","IO0",null,"SPARE"]
["PS7_5_VFD1","PS7_5_VFD1_IO1","IO1",null,"SPARE"]
["PS7_5_VFD1","PS7_5_VFD1_SI0","SI0",null,"SPARE"]
["PS7_5_VFD1","PS7_5_VFD1_SI1","SI1",null,"SPARE"]
["PS7_5_VFD1","PS7_5_VFD1_SI2","SI2",null,"SPARE"]
["PS7_5_VFD1","PS7_5_VFD1_SI3","SI3",null,"SPARE"]
["PS7_5_VFD1","PS7_5_VFD1_SO0","SO0",null,"SPARE"]
["PS7_6_VFD1","PS7_6_VFD1_I0","I0",null,"PS7_6_DISC","DISCONNECT AUX"]
["PS7_6_VFD1","PS7_6_VFD1_I1","I1",null,"SPARE"]
["PS7_6_VFD1","PS7_6_VFD1_I2","I2",null,"PS7_6_TPE1","TRACKING PHOTOEYE"]
["PS7_6_VFD1","PS7_6_VFD1_I3","I3",null,"SPARE"]
["PS7_6_VFD1","PS7_6_VFD1_IO0","IO0",null,"SPARE"]
["PS7_6_VFD1","PS7_6_VFD1_IO1","IO1",null,"SPARE"]
["PS7_6_VFD1","PS7_6_VFD1_SI0","SI0",null,"SPARE"]
["PS7_6_VFD1","PS7_6_VFD1_SI1","SI1",null,"SPARE"]
["PS7_6_VFD1","PS7_6_VFD1_SI2","SI2",null,"SPARE"]
["PS7_6_VFD1","PS7_6_VFD1_SI3","SI3",null,"SPARE"]
["PS7_6_VFD1","PS7_6_VFD1_SO0","SO0",null,"SPARE"]
["PS7_7_VFD1","PS7_7_VFD1_I0","I0",null,"PS7_7_DISC","DISCONNECT AUX"]
["PS7_7_VFD1","PS7_7_VFD1_I1","I1",null,"SPARE"]
["PS7_7_VFD1","PS7_7_VFD1_I2","I2",null,"PS7_7_TPE1","TRACKING PHOTOEYE"]
["PS7_7_VFD1","PS7_7_VFD1_I3","I3",null,"SPARE"]
["PS7_7_VFD1","PS7_7_VFD1_IO0","IO0",null,"SPARE"]
["PS7_7_VFD1","PS7_7_VFD1_IO1","IO1",null,"SPARE"]
["PS7_7_VFD1","PS7_7_VFD1_SI0","SI0",null,"SPARE"]
["PS7_7_VFD1","PS7_7_VFD1_SI1","SI1",null,"SPARE"]
["PS7_7_VFD1","PS7_7_VFD1_SI2","SI2",null,"SPARE"]
["PS7_7_VFD1","PS7_7_VFD1_SI3","SI3",null,"SPARE"]
["PS7_7_VFD1","PS7_7_VFD1_SO0","SO0",null,"SPARE"]
["PS7_8_VFD1","PS7_8_VFD1_I0","I0",null,"PS7_8_DISC","DISCONNECT AUX"]
["PS7_8_VFD1","PS7_8_VFD1_I1","I1",null,"SPARE"]
["PS7_8_VFD1","PS7_8_VFD1_I2","I2",null,"PS7_8_TPE1","TRACKING PHOTOEYE"]
["PS7_8_VFD1","PS7_8_VFD1_I3","I3",null,"SPARE"]
["PS7_8_VFD1","PS7_8_VFD1_IO0","IO0",null,"SPARE"]
["PS7_8_VFD1","PS7_8_VFD1_IO1","IO1",null,"SPARE"]
["PS7_8_VFD1","PS7_8_VFD1_SI0","SI0",null,"SPARE"]
["PS7_8_VFD1","PS7_8_VFD1_SI1","SI1",null,"SPARE"]
["PS7_8_VFD1","PS7_8_VFD1_SI2","SI2",null,"SPARE"]
["PS7_8_VFD1","PS7_8_VFD1_SI3","SI3",null,"SPARE"]
["PS7_8_VFD1","PS7_8_VFD1_SO0","SO0",null,"SPARE"]
["PS7_9_VFD1","PS7_9_VFD1_I0","I0",null,"PS7_9_DISC","DISCONNECT AUX"]
["PS7_9_VFD1","PS7_9_VFD1_I1","I1",null,"SPARE"]
["PS7_9_VFD1","PS7_9_VFD1_I2","I2",null,"PS7_9_TPE1","TRACKING PHOTOEYE"]
["PS7_9_VFD1","PS7_9_VFD1_I3","I3",null,"SPARE"]
["PS7_9_VFD1","PS7_9_VFD1_IO0","IO0",null,"PS7_9_S1_PB","START PUSHBUTTON"]
["PS7_9_VFD1","PS7_9_VFD1_IO1","IO1",null,"PS7_9_S1_PB_LT","START PUSHBUTTON LIGHT"]
["PS7_9_VFD1","PS7_9_VFD1_SI0","SI0",null,"PS7_9_EPC1","E-STOP PULLCORD"]
["PS7_9_VFD1","PS7_9_VFD1_SI1","SI1",null,"PS7_9_EPC1_2","E-STOP PULLCORD"]
["PS7_9_VFD1","PS7_9_VFD1_SI2","SI2",null,"PS7_9_EPC2","E-STOP PULLCORD"]
["PS7_9_VFD1","PS7_9_VFD1_SI3","SI3",null,"PS7_9_EPC2_2","E-STOP PULLCORD"]
["PS7_9_VFD1","PS7_9_VFD1_SO0","SO0",null,"PS7_9_BCN1_R","RED BEACON LIGHT"]
["UL13_1_VFD1","UL13_1_VFD1_I0","I0",null,"UL13_1_DISC","DISCONNECT AUX"]
["UL13_1_VFD1","UL13_1_VFD1_I1","I1",null,"SPARE"]
["UL13_1_VFD1","UL13_1_VFD1_I2","I2",null,"UL13_1_TPE1","TRACKING PHOTOEYE"]
["UL13_1_VFD1","UL13_1_VFD1_I3","I3",null,"UL13_1_SS1_STPB","SS STATION STOP PUSHBUTTON","2025-07-01"]
["UL13_1_VFD1","UL13_1_VFD1_IO0","IO0",null,"UL13_1_SS1_SPB","SS STATION START PUSHBUTTON"]
["UL13_1_VFD1","UL13_1_VFD1_IO1","IO1",null,"UL13_1_SS1_SPB_LT","SS STATION START PUSHBUTTON LIGHT"]
["UL13_1_VFD1","UL13_1_VFD1_SI0","SI0",null,"UL13_1_EPC1","E-STOP PULLCORD"]
["UL13_1_VFD1","UL13_1_VFD1_SI1","SI1",null,"UL13_1_EPC1_2","E-STOP PULLCORD"]
["UL13_1_VFD1","UL13_1_VFD1_SI2","SI2",null,"UL13_1_EPC2","E-STOP PULLCORD"]
["UL13_1_VFD1","UL13_1_VFD1_SI3","SI3",null,"UL13_1_EPC2_2","E-STOP PULLCORD"]
["UL13_1_VFD1","UL13_1_VFD1_SO0","SO0",null,"SPARE"]
["UL13_10_VFD1","UL13_10_VFD1_I0","I0",null,"UL13_10_DISC","DISCONNECT AUX"]
["UL13_10_VFD1","UL13_10_VFD1_I1","I1",null,"UL13_10_ENC1","ENCODER"]
["UL13_10_VFD1","UL13_10_VFD1_I2","I2",null,"UL13_10_TPE1","TRACKING PHOTOEYE"]
["UL13_10_VFD1","UL13_10_VFD1_I3","I3",null,"UL13_10_TPE2","TRACKING PHOTOEYE"]
["UL13_10_VFD1","UL13_10_VFD1_IO0","IO0",null,"SPARE"]
["UL13_10_VFD1","UL13_10_VFD1_IO1","IO1",null,"SPARE"]
["UL13_10_VFD1","UL13_10_VFD1_SI0","SI0",null,"SPARE"]
["UL13_10_VFD1","UL13_10_VFD1_SI1","SI1",null,"SPARE"]
["UL13_10_VFD1","UL13_10_VFD1_SI2","SI2",null,"SPARE"]
["UL13_10_VFD1","UL13_10_VFD1_SI3","SI3",null,"SPARE"]
["UL13_10_VFD1","UL13_10_VFD1_SO0","SO0",null,"SPARE"]
["UL13_11_VFD1","UL13_11_VFD1_I0","I0",null,"UL13_11_DISC","DISCONNECT AUX"]
["UL13_11_VFD1","UL13_11_VFD1_I1","I1",null,"UL13_11_ENC1","ENCODER"]
["UL13_11_VFD1","UL13_11_VFD1_I2","I2",null,"UL13_11_TPE1","TRACKING PHOTOEYE"]
["UL13_11_VFD1","UL13_11_VFD1_I3","I3",null,"SPARE"]
["UL13_11_VFD1","UL13_11_VFD1_IO0","IO0",null,"SPARE"]
["UL13_11_VFD1","UL13_11_VFD1_IO1","IO1",null,"SPARE"]
["UL13_11_VFD1","UL13_11_VFD1_SI0","SI0",null,"SPARE"]
["UL13_11_VFD1","UL13_11_VFD1_SI1","SI1",null,"SPARE"]
["UL13_11_VFD1","UL13_11_VFD1_SI2","SI2",null,"SPARE"]
["UL13_11_VFD1","UL13_11_VFD1_SI3","SI3",null,"SPARE"]
["UL13_11_VFD1","UL13_11_VFD1_SO0","SO0",null,"SPARE"]
["UL13_12_VFD1","UL13_12_VFD1_I0","I0",null,"UL13_12_DISC","DISCONNECT AUX"]
["UL13_12_VFD1","UL13_12_VFD1_I1","I1",null,"SPARE"]
["UL13_12_VFD1","UL13_12_VFD1_I2","I2",null,"SPARE"]
["UL13_12_VFD1","UL13_12_VFD1_I3","I3",null,"SPARE"]
["UL13_12_VFD1","UL13_12_VFD1_IO0","IO0",null,"SPARE"]
["UL13_12_VFD1","UL13_12_VFD1_IO1","IO1",null,"SPARE"]
["UL13_12_VFD1","UL13_12_VFD1_SI0","SI0",null,"SPARE"]
["UL13_12_VFD1","UL13_12_VFD1_SI1","SI1",null,"SPARE"]
["UL13_12_VFD1","UL13_12_VFD1_SI2","SI2",null,"SPARE"]
["UL13_12_VFD1","UL13_12_VFD1_SI3","SI3",null,"SPARE"]
["UL13_12_VFD1","UL13_12_VFD1_SO0","SO0",null,"SPARE"]
["UL13_12_VFD1","UL13_12_VFD1_ENC1","ENC1",null,"UL13_12_ENC1",null,"2025-06-06"]
["UL13_2_VFD1","UL13_2_VFD1_I0","I0",null,"UL13_2_DISC","DISCONNECT AUX"]
["UL13_2_VFD1","UL13_2_VFD1_I1","I1",null,"SPARE"]
["UL13_2_VFD1","UL13_2_VFD1_I2","I2",null,"UL13_2_TPE1","TRACKING PHOTOEYE"]
["UL13_2_VFD1","UL13_2_VFD1_I3","I3",null,"SPARE"]
["UL13_2_VFD1","UL13_2_VFD1_IO0","IO0",null,"SPARE"]
["UL13_2_VFD1","UL13_2_VFD1_IO1","IO1",null,"SPARE"]
["UL13_2_VFD1","UL13_2_VFD1_SI0","SI0",null,"SPARE"]
["UL13_2_VFD1","UL13_2_VFD1_SI1","SI1",null,"SPARE"]
["UL13_2_VFD1","UL13_2_VFD1_SI2","SI2",null,"SPARE"]
["UL13_2_VFD1","UL13_2_VFD1_SI3","SI3",null,"SPARE"]
["UL13_2_VFD1","UL13_2_VFD1_SO0","SO0",null,"SPARE"]
["UL13_3_VFD1","UL13_3_VFD1_I0","I0",null,"UL13_3_DISC","DISCONNECT AUX"]
["UL13_3_VFD1","UL13_3_VFD1_I1","I1",null,"SPARE"]
["UL13_3_VFD1","UL13_3_VFD1_I2","I2",null,"UL13_3_TPE1","TRACKING PHOTOEYE"]
["UL13_3_VFD1","UL13_3_VFD1_I3","I3",null,"SPARE"]
["UL13_3_VFD1","UL13_3_VFD1_IO0","IO0",null,"SPARE"]
["UL13_3_VFD1","UL13_3_VFD1_IO1","IO1",null,"SPARE"]
["UL13_3_VFD1","UL13_3_VFD1_SI0","SI0",null,"SPARE"]
["UL13_3_VFD1","UL13_3_VFD1_SI1","SI1",null,"SPARE"]
["UL13_3_VFD1","UL13_3_VFD1_SI2","SI2",null,"SPARE"]
["UL13_3_VFD1","UL13_3_VFD1_SI3","SI3",null,"SPARE"]
["UL13_3_VFD1","UL13_3_VFD1_SO0","SO0",null,"SPARE"]
["UL13_4_VFD1","UL13_4_VFD1_I0","I0",null,"UL13_4_DISC","DISCONNECT AUX"]
["UL13_4_VFD1","UL13_4_VFD1_I1","I1",null,"UL13_4_ENC1","ENCODER"]
["UL13_4_VFD1","UL13_4_VFD1_I2","I2",null,"UL13_4_TPE1","TRACKING PHOTOEYE"]
["UL13_4_VFD1","UL13_4_VFD1_I3","I3",null,"SPARE"]
["UL13_4_VFD1","UL13_4_VFD1_IO0","IO0",null,"UL13_4_S1_PB","START PUSHBUTTON"]
["UL13_4_VFD1","UL13_4_VFD1_IO1","IO1",null,"UL13_4_S1_PB_LT","START PUSHBUTTON LIGHT"]
["UL13_4_VFD1","UL13_4_VFD1_SI0","SI0",null,"UL13_4_EPC1","E-STOP PULLCORD"]
["UL13_4_VFD1","UL13_4_VFD1_SI1","SI1",null,"UL13_4_EPC1_2","E-STOP PULLCORD"]
["UL13_4_VFD1","UL13_4_VFD1_SI2","SI2",null,"UL13_4_EPC2","E-STOP PULLCORD"]
["UL13_4_VFD1","UL13_4_VFD1_SI3","SI3",null,"UL13_4_EPC2_2","E-STOP PULLCORD"]
["UL13_4_VFD1","UL13_4_VFD1_SO0","SO0",null,"UL13_4_BCN1_R","RED BEACON LIGHT"]
["UL13_5_VFD1","UL13_5_VFD1_I0","I0",null,"UL13_5_DISC","DISCONNECT AUX"]
["UL13_5_VFD1","UL13_5_VFD1_I1","I1",null,"UL13_5_ENC1","ENCODER"]
["UL13_5_VFD1","UL13_5_VFD1_I2","I2",null,"UL13_5_TPE1","TRACKING PHOTOEYE"]
["UL13_5_VFD1","UL13_5_VFD1_I3","I3",null,"SPARE"]
["UL13_5_VFD1","UL13_5_VFD1_IO0","IO0",null,"UL13_4_S2_PB","START PUSHBUTTON"]
["UL13_5_VFD1","UL13_5_VFD1_IO1","IO1",null,"UL13_4_S2_PB_LT","START PUSHBUTTON LIGHT"]
["UL13_5_VFD1","UL13_5_VFD1_SI0","SI0",null,"SPARE"]
["UL13_5_VFD1","UL13_5_VFD1_SI1","SI1",null,"SPARE"]
["UL13_5_VFD1","UL13_5_VFD1_SI2","SI2",null,"SPARE"]
["UL13_5_VFD1","UL13_5_VFD1_SI3","SI3",null,"SPARE"]
["UL13_5_VFD1","UL13_5_VFD1_SO0","SO0",null,"UL13_4_BCN2_R","RED BEACON LIGHT"]
["UL13_6_VFD1","UL13_6_VFD1_I0","I0",null,"SPARE"]
["UL13_6_VFD1","UL13_6_VFD_I1","I1",null,"UL13_6_ENC1","ENCODER"]
["UL13_6_VFD1","UL13_6_VFD1_I2","I2",null,"UL13_6_TPE1","TRACKING PHOTOEYE"]
["UL13_6_VFD1","UL13_6_VFD1_I3","I3",null,"SPARE"]
["UL13_6_VFD1","UL13_6_VFD1_IO0","IO0",null,"UL13_8_S2_PB","START PUSHBUTTON"]
["UL13_6_VFD1","UL13_6_VFD1_IO1","IO1",null,"UL13_8_S2_PB_LT","START PUSHBUTTON LIGHT"]
["UL13_6_VFD1","UL13_6_VFD1_SI0","SI0",null,"SPARE"]
["UL13_6_VFD1","UL13_6_VFD1_SI1","SI1",null,"SPARE"]
["UL13_6_VFD1","UL13_6_VFD1_SI2","SI2",null,"SPARE"]
["UL13_6_VFD1","UL13_6_VFD1_SI3","SI3",null,"SPARE"]
["UL13_6_VFD1","UL13_6_VFD1_SO0","SO0",null,"SPARE"]
["UL13_7_VFD1","UL13_7_VFD1_I0","I0",null,"UL13_7_DISC","DISCONNECT AUX"]
["UL13_7_VFD1","UL13_7_VFD1_I1","I1",null,"UL13_7_ENC1","ENCODER"]
["UL13_7_VFD1","UL13_7_VFD1_I2","I2",null,"UL13_7_TPE1","TRACKING PHOTOEYE"]
["UL13_7_VFD1","UL13_7_VFD1_I3","I3",null,"SPARE"]
["UL13_7_VFD1","UL13_7_VFD1_IO0","IO0",null,"UL13_8_S1_PB","START PUSHBUTTON"]
["UL13_7_VFD1","UL13_7_VFD1_IO1","IO1",null,"UL13_8_S1_PB_LT","START PUSHBUTTON LIGHT"]
["UL13_7_VFD1","UL13_7_VFD1_SI0","SI0",null,"SPARE"]
["UL13_7_VFD1","UL13_7_VFD1_SI1","SI1",null,"SPARE"]
["UL13_7_VFD1","UL13_7_VFD1_SI2","SI2",null,"SPARE"]
["UL13_7_VFD1","UL13_7_VFD1_SI3","SI3",null,"SPARE"]
["UL13_7_VFD1","UL13_7_VFD1_SO0","SO0",null,"SPARE"]
["UL13_8_VFD1","UL13_8_VFD1_I0","I0",null,"UL13_8_DISC","DISCONNECT AUX"]
["UL13_8_VFD1","UL13_8_VFD1_I1","I1",null,"UL13_8_ENC1","ENCODER"]
["UL13_8_VFD1","UL13_8_VFD1_I2","I2",null,"UL13_8_TPE1","TRACKING PHOTOEYE"]
["UL13_8_VFD1","UL13_8_VFD1_I3","I3",null,"UL13_8_TPE2","TRACKING PHOTOEYE"]
["UL13_8_VFD1","UL13_8_VFD1_IO0","IO0",null,"UL13_8_BCN1_A","AMBER BEACON LIGHT"]
["UL13_8_VFD1","UL13_8_VFD1_IO1","IO1",null,"UL13_8_BCN1_R","RED BEACON LIGHT"]
["UL13_8_VFD1","UL13_8_VFD1_SI0","SI0",null,"UL13_8_EPC1","E-STOP PULLCORD"]
["UL13_8_VFD1","UL13_8_VFD1_SI1","SI1",null,"UL13_8_EPC1_2","E-STOP PULLCORD"]
["UL13_8_VFD1","UL13_8_VFD1_SI2","SI2",null,"UL13_8_EPC2","E-STOP PULLCORD"]
["UL13_8_VFD1","UL13_8_VFD1_SI3","SI3",null,"UL13_8_EPC2_2","E-STOP PULLCORD"]
["UL13_8_VFD1","UL13_8_VFD1_SO0","SO0",null,"UL13_8_BCN2_R","RED BEACON LIGHT"]
["UL13_9A_VFD1","UL13_9A_VFD1_I0","I0",null,"UL13_9A_DISC","DISCONNECT AUX"]
["UL13_9A_VFD1","UL13_9A_VFD1_I1","I1",null,"UL13_8_TPE3","TRACKING PHOTOEYE"]
["UL13_9A_VFD1","UL13_9A_VFD1_I2","I2",null,"UL13_8_TPE4","TRACKING PHOTOEYE"]
["UL13_9A_VFD1","UL13_9A_VFD1_I3","I3",null,"UL13_8_TPE5","TRACKING PHOTOEYE"]
["UL13_9A_VFD1","UL13_9A_VFD1_IO0","IO0",null,"UL13_8_JR1_PB","JAM RESET PUSHBUTTON"]
["UL13_9A_VFD1","UL13_9A_VFD1_IO1","IO1",null,"UL13_8_JR1_PB_LT","JAM RESET PUSHBUTTON LIGHT"]
["UL13_9A_VFD1","UL13_9A_VFD1_SI0","SI0",null,"SPARE"]
["UL13_9A_VFD1","UL13_9A_VFD1_SI1","SI1",null,"SPARE"]
["UL13_9A_VFD1","UL13_9A_VFD1_SI2","SI2",null,"SPARE"]
["UL13_9A_VFD1","UL13_9A_VFD1_SI3","SI3",null,"SPARE"]
["UL13_9A_VFD1","UL13_9A_VFD1_SO0","SO0",null,"SPARE"]
["UL13_9B_VFD1","UL13_9B_VFD1_I0","I0",null,"UL13_9B_DISC","DISCONNECT AUX"]
["UL13_9B_VFD1","UL13_9B_VFD1_I1","I1",null,"SPARE"]
["UL13_9B_VFD1","UL13_9B_VFD1_I2","I2",null,"SPARE"]
["UL13_9B_VFD1","UL13_9B_VFD1_I3","I3",null,"SPARE"]
["UL13_9B_VFD1","UL13_9B_VFD1_IO0","IO0",null,"UL13_8_JR2_PB","JAM RESET PUSHBUTTON"]
["UL13_9B_VFD1","UL13_9B_VFD1_IO1","IO1",null,"UL13_8_JR2_PB_LT","JAM RESET PUSHBUTTON LIGHT"]
["UL13_9B_VFD1","UL13_9B_VFD1_SI0","SI0",null,"SPARE"]
["UL13_9B_VFD1","UL13_9B_VFD1_SI1","SI1",null,"SPARE"]
["UL13_9B_VFD1","UL13_9B_VFD1_SI2","SI2",null,"SPARE"]
["UL13_9B_VFD1","UL13_9B_VFD1_SI3","SI3",null,"SPARE"]
["UL13_9B_VFD1","UL13_9B_VFD1_SO0","SO0",null,"SPARE"]
["UL14_10_VFD1","UL14_10_VFD1_I0","I0",null,"UL14_10_DISC","DISCONNECT AUX"]
["UL14_10_VFD1","UL14_10_VFD1_I1","I1",null,"SPARE"]
["UL14_10_VFD1","UL14_10_VFD1_I2","I2",null,"SPARE"]
["UL14_10_VFD1","UL14_10_VFD1_I3","I3",null,"SPARE"]
["UL14_10_VFD1","UL14_10_VFD1_IO0","IO0",null,"SPARE"]
["UL14_10_VFD1","UL14_10_VFD1_IO1","IO1",null,"SPARE"]
["UL14_10_VFD1","UL14_10_VFD1_SI0","SI0",null,"SPARE"]
["UL14_10_VFD1","UL14_10_VFD1_SI1","SI1",null,"SPARE"]
["UL14_10_VFD1","UL14_10_VFD1_SI2","SI2",null,"SPARE"]
["UL14_10_VFD1","UL14_10_VFD1_SI3","SI3",null,"SPARE"]
["UL14_10_VFD1","UL14_10_VFD1_SO0","SO0",null,"SPARE"]
["UL14_3_VFD1","UL14_3_VFD1_I0","I0",null,"UL14_3_DISC","DISCONNECT AUX"]
["UL14_3_VFD1","UL14_3_VFD1_I1","I1",null,"UL14_3_ENC1","ENCODER"]
["UL14_3_VFD1","UL14_3_VFD1_I2","I2",null,"UL14_3_TPE1","TRACKING PHOTOEYE"]
["UL14_3_VFD1","UL14_3_VFD1_I3","I3",null,"UL14_3_TPE2","TRACKING PHOTOEYE"]
["UL14_3_VFD1","UL14_3_VFD1_IO0","IO0",null,"SPARE"]
["UL14_3_VFD1","UL14_3_VFD1_IO1","IO1",null,"SPARE"]
["UL14_3_VFD1","UL14_3_VFD1_SI0","SI0",null,"UL14_3_EPC1","E-STOP PULLCORD"]
["UL14_3_VFD1","UL14_3_VFD1_SI1","SI1",null,"UL14_3_EPC1_2","E-STOP PULLCORD"]
["UL14_3_VFD1","UL14_3_VFD1_SI2","SI2",null,"UL14_3_EPC2","E-STOP PULLCORD"]
["UL14_3_VFD1","UL14_3_VFD1_SI3","SI3",null,"UL14_3_EPC2_2","E-STOP PULLCORD"]
["UL14_3_VFD1","UL14_3_VFD1_SO0","SO0",null,"UL14_1_STO1","E-STOP OK"]
["UL14_4_VFD1","UL14_4_VFD1_I0","I0",null,"UL14_4_DISC","DISCONNECT AUX"]
["UL14_4_VFD1","UL14_4_VFD1_I1","I1",null,"UL14_4_ENC1","ENCODER"]
["UL14_4_VFD1","UL14_4_VFD1_I2","I2",null,"UL14_4_TPE1","TRACKING PHOTOEYE"]
["UL14_4_VFD1","UL14_4_VFD1_I3","I3",null,"SPARE"]
["UL14_4_VFD1","UL14_4_VFD1_IO0","IO0",null,"UL14_4_S1_PB","START PUSHBUTTON"]
["UL14_4_VFD1","UL14_4_VFD1_IO1","IO1",null,"UL14_4_S1_PB_LT","START PUSHBUTTON LIGHT"]
["UL14_4_VFD1","UL14_4_VFD1_SI0","SI0",null,"UL14_4_EPC1","E-STOP PULLCORD"]
["UL14_4_VFD1","UL14_4_VFD1_SI1","SI1",null,"UL14_4_EPC1_2","E-STOP PULLCORD"]
["UL14_4_VFD1","UL14_4_VFD1_SI2","SI2",null,"UL14_4_EPC2","E-STOP PULLCORD"]
["UL14_4_VFD1","UL14_4_VFD1_SI3","SI3",null,"UL14_4_EPC2_2","E-STOP PULLCORD"]
["UL14_4_VFD1","UL14_4_VFD1_SO0","SO0",null,"UL14_4_BCN1_R","RED BEACON LIGHT"]
["UL14_5_VFD1","UL14_5_VFD1_I0","I0",null,"UL14_5_DISC","DISCONNECT AUX"]
["UL14_5_VFD1","UL14_5_VFD1_I1","I1",null,"UL14_5_ENC1","ENCODER"]
["UL14_5_VFD1","UL14_5_VFD1_I2","I2",null,"UL14_5_TPE1","TRACKING PHOTOEYE"]
["UL14_5_VFD1","UL14_5_VFD1_I3","I3",null,"SPARE"]
["UL14_5_VFD1","UL14_5_VFD1_IO0","IO0",null,"UL14_4_S2_PB","START PUSHBUTTON"]
["UL14_5_VFD1","UL14_5_VFD1_IO1","IO1",null,"UL14_4_S2_PB_LT","START PUSHBUTTON LIGHT"]
["UL14_5_VFD1","UL14_5_VFD1_SI0","SI0",null,"SPARE"]
["UL14_5_VFD1","UL14_5_VFD1_SI1","SI1",null,"SPARE"]
["UL14_5_VFD1","UL14_5_VFD1_SI2","SI2",null,"SPARE"]
["UL14_5_VFD1","UL14_5_VFD1_SI3","SI3",null,"SPARE"]
["UL14_5_VFD1","UL14_5_VFD1_SO0","SO0",null,"UL14_4_BCN2_R","RED BEACON LIGHT"]
["UL14_6_VFD1","UL14_6_VFD1_I0","I0",null,"UL14_6_DISC","DISCONNECT AUX"]
["UL14_6_VFD1","UL14_6_VFD1_I1","I1",null,"UL14_6_ENC1","ENCODER"]
["UL14_6_VFD1","UL14_6_VFD1_I2","I2",null,"SPARE"]
["UL14_6_VFD1","UL14_6_VFD1_I3","I3",null,"SPARE"]
["UL14_6_VFD1","UL14_6_VFD1_IO0","IO0",null,"SPARE"]
["UL14_6_VFD1","UL14_6_VFD1_IO1","IO1",null,"SPARE"]
["UL14_6_VFD1","UL14_6_VFD1_SI0","SI0",null,"SPARE"]
["UL14_6_VFD1","UL14_6_VFD1_SI1","SI1",null,"SPARE"]
["UL14_6_VFD1","UL14_6_VFD1_SI2","SI2",null,"SPARE"]
["UL14_6_VFD1","UL14_6_VFD1_SI3","SI3",null,"SPARE"]
["UL14_6_VFD1","UL14_6_VFD1_SO0","SO0",null,"SPARE"]
["UL14_7_VFD1","UL14_7_VFD1_I0","I0",null,"UL14_7_DISC","DISCONNECT AUX"]
["UL14_7_VFD1","UL14_7_VFD1_I1","I1",null,"UL14_7_ENC1","ENCODER"]
["UL14_7_VFD1","UL14_7_VFD1_I2","I2",null,"UL14_7_TPE1","TRACKING PHOTOEYE"]
["UL14_7_VFD1","UL14_7_VFD1_I3","I3",null,"UL14_7_TPE2","TRACKING PHOTOEYE"]
["UL14_7_VFD1","UL14_7_VFD1_IO0","IO0",null,"SPARE"]
["UL14_7_VFD1","UL14_7_VFD1_IO1","IO1",null,"SPARE"]
["UL14_7_VFD1","UL14_7_VFD1_SI0","SI0",null,"SPARE"]
["UL14_7_VFD1","UL14_7_VFD1_SI1","SI1",null,"SPARE"]
["UL14_7_VFD1","UL14_7_VFD1_SI2","SI2",null,"SPARE"]
["UL14_7_VFD1","UL14_7_VFD1_SI3","SI3",null,"SPARE"]
["UL14_7_VFD1","UL14_7_VFD1_SO0","SO0",null,"SPARE"]
["UL14_8_VFD1","UL14_8_VFD1_I0","I0",null,"UL14_8_DISC","DISCONNECT AUX"]
["UL14_8_VFD1","UL14_8_VFD1_I1","I1",null,"UL14_8_ENC1","ENCODER"]
["UL14_8_VFD1","UL14_8_VFD1_I2","I2",null,"UL14_8_TPE1","TRACKING PHOTOEYE"]
["UL14_8_VFD1","UL14_8_VFD1_I3","I3",null,"SPARE"]
["UL14_8_VFD1","UL14_8_VFD1_IO0","IO0",null,"SPARE"]
["UL14_8_VFD1","UL14_8_VFD1_IO1","IO1",null,"SPARE"]
["UL14_8_VFD1","UL14_8_VFD1_SI0","SI0",null,"SPARE"]
["UL14_8_VFD1","UL14_8_VFD1_SI1","SI1",null,"SPARE"]
["UL14_8_VFD1","UL14_8_VFD1_SI2","SI2",null,"SPARE"]
["UL14_8_VFD1","UL14_8_VFD1_SI3","SI3",null,"SPARE"]
["UL14_8_VFD1","UL14_8_VFD1_SO0","SO0",null,"SPARE"]
["UL14_9_VFD1","UL14_9_VFD1_I0","I0",null,"UL14_9_DISC","DISCONNECT AUX"]
["UL14_9_VFD1","UL14_9_VFD1_I1","I1",null,"UL14_9_ENC1","ENCODER"]
["UL14_9_VFD1","UL14_9_VFD1_I2","I2",null,"UL14_9_TPE1","TRACKING PHOTOEYE"]
["UL14_9_VFD1","UL14_9_VFD1_I3","I3",null,"SPARE"]
["UL14_9_VFD1","UL14_9_VFD1_IO0","IO0",null,"SPARE"]
["UL14_9_VFD1","UL14_9_VFD1_IO1","IO1",null,"SPARE"]
["UL14_9_VFD1","UL14_9_VFD1_SI0","SI0",null,"SPARE"]
["UL14_9_VFD1","UL14_9_VFD1_SI1","SI1",null,"SPARE"]
["UL14_9_VFD1","UL14_9_VFD1_SI2","SI2",null,"SPARE"]
["UL14_9_VFD1","UL14_9_VFD1_SI3","SI3",null,"SPARE"]
["UL14_9_VFD1","UL14_9_VFD1_SO0","SO0",null,"SPARE"]
["UL15_10_VFD1","UL15_10_VFD1_I0","I0",null,"UL15_10_DISC","DISCONNECT AUX"]
["UL15_10_VFD1","UL15_10_VFD1_I1","I1",null,"UL15_10_ENC1","ENCODER"]
["UL15_10_VFD1","UL15_10_VFD1_I2","I2",null,"UL15_10_TPE1","TRACKING PHOTOEYE"]
["UL15_10_VFD1","UL15_10_VFD1_I3","I3",null,"SPARE"]
["UL15_10_VFD1","UL15_10_VFD1_IO0","IO0",null,"SPARE"]
["UL15_10_VFD1","UL15_10_VFD1_IO1","IO1",null,"SPARE"]
["UL15_10_VFD1","UL15_10_VFD1_SI0","SI0",null,"SPARE"]
["UL15_10_VFD1","UL15_10_VFD1_SI1","SI1",null,"SPARE"]
["UL15_10_VFD1","UL15_10_VFD1_SI2","SI2",null,"SPARE"]
["UL15_10_VFD1","UL15_10_VFD1_SI3","SI3",null,"SPARE"]
["UL15_10_VFD1","UL15_10_VFD1_SO0","SO0",null,"SPARE"]
["UL15_11_VFD1","UL15_11_VFD1_I0","I0",null,"UL15_11_DISC","DISCONNECT AUX"]
["UL15_11_VFD1","UL15_11_VFD1_I1","I1",null,"UL15_11_ENC1","ENCODER"]
["UL15_11_VFD1","UL15_11_VFD1_I2","I2",null,"SPARE"]
["UL15_11_VFD1","UL15_11_VFD1_I3","I3",null,"SPARE"]
["UL15_11_VFD1","UL15_11_VFD1_IO0","IO0",null,"SPARE"]
["UL15_11_VFD1","UL15_11_VFD1_IO1","IO1",null,"SPARE"]
["UL15_11_VFD1","UL15_11_VFD1_SI0","SI0",null,"SPARE"]
["UL15_11_VFD1","UL15_11_VFD1_SI1","SI1",null,"SPARE"]
["UL15_11_VFD1","UL15_11_VFD1_SI2","SI2",null,"SPARE"]
["UL15_11_VFD1","UL15_11_VFD1_SI3","SI3",null,"SPARE"]
["UL15_11_VFD1","UL15_11_VFD1_SO0","SO0",null,"SPARE"]
["UL15_3_VFD1","UL15_3_VFD1_I0","I0",null,"UL15_3_DISC","DISCONNECT AUX"]
["UL15_3_VFD1","UL15_3_VFD1_I1","I1",null,"UL15_3_ENC1","ENCODER"]
["UL15_3_VFD1","UL15_3_VFD1_I2","I2",null,"UL15_3_TPE1","TRACKING PHOTOEYE"]
["UL15_3_VFD1","UL15_3_VFD1_I3","I3",null,"UL15_3_TPE2","TRACKING PHOTOEYE"]
["UL15_3_VFD1","UL15_3_VFD1_IO0","IO0",null,"SPARE"]
["UL15_3_VFD1","UL15_3_VFD1_IO1","IO1",null,"SPARE"]
["UL15_3_VFD1","UL15_3_VFD1_SI0","SI0",null,"UL15_3_EPC1","E-STOP PULLCORD"]
["UL15_3_VFD1","UL15_3_VFD1_SI1","SI1",null,"UL15_3_EPC1_2","E-STOP PULLCORD"]
["UL15_3_VFD1","UL15_3_VFD1_SI2","SI2",null,"UL15_3_EPC2","E-STOP PULLCORD"]
["UL15_3_VFD1","UL15_3_VFD1_SI3","SI3",null,"UL15_3_EPC2_2","E-STOP PULLCORD"]
["UL15_3_VFD1","UL15_3_VFD1_SO0","SO0",null,"UL15_1_STO1","E-STOP OK"]
["UL15_4_VFD1","UL15_4_VFD1_I0","I0",null,"UL15_4_DISC","DISCONNECT AUX"]
["UL15_4_VFD1","UL15_4_VFD1_I1","I1",null,"UL15_4_ENC1","ENCODER"]
["UL15_4_VFD1","UL15_4_VFD1_I2","I2",null,"UL15_4_TPE1","TRACKING PHOTOEYE"]
["UL15_4_VFD1","UL15_4_VFD1_I3","I3",null,"SPARE"]
["UL15_4_VFD1","UL15_4_VFD1_IO0","IO0",null,"UL15_4_S1_PB","START PUSHBUTTON"]
["UL15_4_VFD1","UL15_4_VFD1_IO1","IO1",null,"UL15_4_S1_PB_LT","START PUSHBUTTON LIGHT"]
["UL15_4_VFD1","UL15_4_VFD1_SI0","SI0",null,"UL15_4_EPC1","E-STOP PULLCORD"]
["UL15_4_VFD1","UL15_4_VFD1_SI1","SI1",null,"UL15_4_EPC1_2","E-STOP PULLCORD"]
["UL15_4_VFD1","UL15_4_VFD1_SI2","SI2",null,"UL15_4_EPC2","E-STOP PULLCORD"]
["UL15_4_VFD1","UL15_4_VFD1_SI3","SI3",null,"UL15_4_EPC2_2","E-STOP PULLCORD"]
["UL15_4_VFD1","UL15_4_VFD1_SO0","SO0",null,"UL15_4_BCN1_R","RED BEACON LIGHT"]
["UL15_5_VFD1","UL15_5_VFD1_I0","I0",null,"UL15_5_DISC","DISCONNECT AUX"]
["UL15_5_VFD1","UL15_5_VFD1_I1","I1",null,"UL15_5_ENC1","ENCODER"]
["UL15_5_VFD1","UL15_5_VFD1_I2","I2",null,"SPARE"]
["UL15_5_VFD1","UL15_5_VFD1_I3","I3",null,"SPARE"]
["UL15_5_VFD1","UL15_5_VFD1_IO0","IO0",null,"UL15_4_S2_PB","START PUSHBUTTON"]
["UL15_5_VFD1","UL15_5_VFD1_IO1","IO1",null,"UL15_4_S2_PB_LT","START PUSHBUTTON LIGHT"]
["UL15_5_VFD1","UL15_5_VFD1_SI0","SI0",null,"SPARE"]
["UL15_5_VFD1","UL15_5_VFD1_SI1","SI1",null,"SPARE"]
["UL15_5_VFD1","UL15_5_VFD1_SI2","SI2",null,"SPARE"]
["UL15_5_VFD1","UL15_5_VFD1_SI3","SI3",null,"SPARE"]
["UL15_5_VFD1","UL15_5_VFD1_SO0","SO0",null,"UL15_4_BCN2_R","RED BEACON LIGHT"]
["UL15_6_VFD1","UL15_6_VFD1_I0","I0",null,"UL15_6_DISC","DISCONNECT AUX"]
["UL15_6_VFD1","UL15_6_VFD1_I1","I1",null,"UL15_6_ENC1","ENCODER"]
["UL15_6_VFD1","UL15_6_VFD1_I2","I2",null,"UL15_6_TPE1","TRACKING PHOTOEYE"]
["UL15_6_VFD1","UL15_6_VFD1_I3","I3",null,"UL15_6_TPE2","TRACKING PHOTOEYE"]
["UL15_6_VFD1","UL15_6_VFD1_IO0","IO0",null,"SPARE"]
["UL15_6_VFD1","UL15_6_VFD1_IO1","IO1",null,"SPARE"]
["UL15_6_VFD1","UL15_6_VFD1_SI0","SI0",null,"SPARE"]
["UL15_6_VFD1","UL15_6_VFD1_SI1","SI1",null,"SPARE"]
["UL15_6_VFD1","UL15_6_VFD1_SI2","SI2",null,"SPARE"]
["UL15_6_VFD1","UL15_6_VFD1_SI3","SI3",null,"SPARE"]
["UL15_6_VFD1","UL15_6_VFD1_SO0","SO0",null,"SPARE"]
["UL15_7_VFD1","UL15_7_VFD1_I0","I0",null,"UL15_7_DISC","DISCONNECT AUX"]
["UL15_7_VFD1","UL15_7_VFD1_I1","I1",null,"UL15_7_ENC1","ENCODER"]
["UL15_7_VFD1","UL15_7_VFD1_I2","I2",null,"UL15_7_TPE1","TRACKING PHOTOEYE"]
["UL15_7_VFD1","UL15_7_VFD1_I3","I3",null,"SPARE"]
["UL15_7_VFD1","UL15_7_VFD1_IO0","IO0",null,"SPARE"]
["UL15_7_VFD1","UL15_7_VFD1_IO1","IO1",null,"SPARE"]
["UL15_7_VFD1","UL15_7_VFD1_SI0","SI0",null,"SPARE"]
["UL15_7_VFD1","UL15_7_VFD1_SI1","SI1",null,"SPARE"]
["UL15_7_VFD1","UL15_7_VFD1_SI2","SI2",null,"SPARE"]
["UL15_7_VFD1","UL15_7_VFD1_SI3","SI3",null,"SPARE"]
["UL15_7_VFD1","UL15_7_VFD1_SO0","SO0",null,"SPARE"]
["UL15_8_VFD1","UL15_8_VFD1_I0","I0",null,"UL15_8_DISC","DISCONNECT AUX"]
["UL15_8_VFD1","UL15_8_VFD1_I1","I1",null,"UL15_8_ENC1","ENCODER"]
["UL15_8_VFD1","UL15_8_VFD1_I2","I2",null,"UL15_8_TPE1","TRACKING PHOTOEYE"]
["UL15_8_VFD1","UL15_8_VFD1_I3","I3",null,"SPARE"]
["UL15_8_VFD1","UL15_8_VFD1_IO0","IO0",null,"SPARE"]
["UL15_8_VFD1","UL15_8_VFD1_IO1","IO1",null,"SPARE"]
["UL15_8_VFD1","UL15_8_VFD1_SI0","SI0",null,"SPARE"]
["UL15_8_VFD1","UL15_8_VFD1_SI1","SI1",null,"SPARE"]
["UL15_8_VFD1","UL15_8_VFD1_SI2","SI2",null,"SPARE"]
["UL15_8_VFD1","UL15_8_VFD1_SI3","SI3",null,"SPARE"]
["UL15_8_VFD1","UL15_8_VFD1_SO0","SO0",null,"SPARE"]
["UL15_9_VFD1","UL15_9_VFD1_I0","I0",null,"UL15_9_DISC","DISCONNECT AUX"]
["UL15_9_VFD1","UL15_9_VFD1_I1","I1",null,"UL15_9_ENC1","ENCODER"]
["UL15_9_VFD1","UL15_9_VFD1_I2","I2",null,"UL15_9_TPE1","TRACKING PHOTOEYE"]
["UL15_9_VFD1","UL15_9_VFD1_I3","I3",null,"SPARE"]
["UL15_9_VFD1","UL15_9_VFD1_IO0","IO0",null,"SPARE"]
["UL15_9_VFD1","UL15_9_VFD1_IO1","IO1",null,"SPARE"]
["UL15_9_VFD1","UL15_9_VFD1_SI0","SI0",null,"SPARE"]
["UL15_9_VFD1","UL15_9_VFD1_SI1","SI1",null,"SPARE"]
["UL15_9_VFD1","UL15_9_VFD1_SI2","SI2",null,"SPARE"]
["UL15_9_VFD1","UL15_9_VFD1_SI3","SI3",null,"SPARE"]
["UL15_9_VFD1","UL15_9_VFD1_SO0","SO0",null,"SPARE"]
["UL16_1_VFD1","UL16_1_VFD1_I0","I0",null,"UL16_1_DISC","DISCONNECT AUX"]
["UL16_1_VFD1","UL16_1_VFD1_I1","I1",null,"SPARE"]
["UL16_1_VFD1","UL16_1_VFD1_I2","I2",null,"UL16_1_TPE1","TRACKING PHOTOEYE"]
["UL16_1_VFD1","UL16_1_VFD1_I3","I3",null,"UL16_1_SS1_STPB","SS STATION STOP PUSHBUTTON","2025-07-01"]
["UL16_1_VFD1","UL16_1_VFD1_IO0","IO0",null,"UL16_1_SS1_SPB","SS STATION START PUSHBUTTON","2025-07-01"]
["UL16_1_VFD1","UL16_1_VFD1_IO1","IO1",null,"UL16_1_SS1_SPB_LT","SS STATION START PUSHBUTTON LIGHT","2025-07-01"]
["UL16_1_VFD1","UL16_1_VFD1_SI0","SI0",null,"UL16_1_EPC1","E-STOP PULLCORD"]
["UL16_1_VFD1","UL16_1_VFD1_SI1","SI1",null,"UL16_1_EPC1_2","E-STOP PULLCORD"]
["UL16_1_VFD1","UL16_1_VFD1_SI2","SI2",null,"UL16_1_EPC2","E-STOP PULLCORD"]
["UL16_1_VFD1","UL16_1_VFD1_SI3","SI3",null,"UL16_1_EPC2_2","E-STOP PULLCORD"]
["UL16_1_VFD1","UL16_1_VFD1_SO0","SO0",null,"SPARE"]
["UL16_2_VFD1","UL16_2_VFD1_I0","I0",null,"UL16_2_DISC","DISCONNECT AUX"]
["UL16_2_VFD1","UL16_2_VFD1_I1","I1",null,"UL16_2_ENC1","ENCODER"]
["UL16_2_VFD1","UL16_2_VFD1_I2","I2",null,"UL16_2_TPE1","TRACKING PHOTOEYE"]
["UL16_2_VFD1","UL16_2_VFD1_I3","I3",null,"UL16_2_TPE2","TRACKING PHOTOEYE"]
["UL16_2_VFD1","UL16_2_VFD1_IO0","IO0",null,"UL16_2_BCN3_R","RED BEACON LIGHT"]
["UL16_2_VFD1","UL16_2_VFD1_IO1","IO1",null,"UL16_2_BCN3_H","ALARM HORN"]
["UL16_2_VFD1","UL16_2_VFD1_SI0","SI0",null,"UL16_2_EPC1","E-STOP PULLCORD"]
["UL16_2_VFD1","UL16_2_VFD1_SI1","SI1",null,"UL16_2_EPC1_2","E-STOP PULLCORD"]
["UL16_2_VFD1","UL16_2_VFD1_SI2","SI2",null,"UL16_2_EPC2","E-STOP PULLCORD"]
["UL16_2_VFD1","UL16_2_VFD1_SI3","SI3",null,"UL16_2_EPC2_2","E-STOP PULLCORD"]
["UL16_2_VFD1","UL16_2_VFD1_SO0","SO0",null,"SPARE"]
["UL16_3_VFD1","UL16_3_VFD1_I0","I0",null,"UL16_3_DISC","DISCONNECT AUX"]
["UL16_3_VFD1","UL16_3_VFD1_I1","I1",null,"SPARE"]
["UL16_3_VFD1","UL16_3_VFD1_I2","I2",null,"UL16_3_TPE1","TRACKING PHOTOEYE"]
["UL16_3_VFD1","UL16_3_VFD1_I3","I3",null,"UL16_3_TPE2","TRACKING PHOTOEYE"]
["UL16_3_VFD1","UL16_3_VFD1_IO0","IO0",null,"SPARE"]
["UL16_3_VFD1","UL16_3_VFD1_IO1","IO1",null,"SPARE"]
["UL16_3_VFD1","UL16_3_VFD1_SI0","SI0",null,"SPARE"]
["UL16_3_VFD1","UL16_3_VFD1_SI1","SI1",null,"SPARE"]
["UL16_3_VFD1","UL16_3_VFD1_SI2","SI2",null,"SPARE"]
["UL16_3_VFD1","UL16_3_VFD1_SI3","SI3",null,"SPARE"]
["UL16_3_VFD1","UL16_3_VFD1_SO0","SO0",null,"SPARE"]
["UL16_4_VFD1","UL16_4_VFD1_I0","I0",null,"UL16_4_DISC","DISCONNECT AUX"]
["UL16_4_VFD1","UL16_4_VFD1_I1","I1",null,"UL16_4_ENC1","ENCODER"]
["UL16_4_VFD1","UL16_4_VFD1_I2","I2",null,"UL16_4_TPE1","TRACKING PHOTOEYE"]
["UL16_4_VFD1","UL16_4_VFD1_I3","I3",null,"SPARE"]
["UL16_4_VFD1","UL16_4_VFD1_IO0","IO0",null,"SPARE"]
["UL16_4_VFD1","UL16_4_VFD1_IO1","IO1",null,"SPARE"]
["UL16_4_VFD1","UL16_4_VFD1_SI0","SI0",null,"SPARE"]
["UL16_4_VFD1","UL16_4_VFD1_SI1","SI1",null,"SPARE"]
["UL16_4_VFD1","UL16_4_VFD1_SI2","SI2",null,"SPARE"]
["UL16_4_VFD1","UL16_4_VFD1_SI3","SI3",null,"SPARE"]
["UL16_4_VFD1","UL16_4_VFD1_SO0","SO0",null,"UL16_2_BCN4_R","RED BEACON LIGHT"]
["UL16_5_VFD1","UL16_5_VFD1_I0","I0",null,"UL16_5_DISC","DISCONNECT AUX"]
["UL16_5_VFD1","UL16_5_VFD1_I1","I1",null,"UL16_5_ENC1","ENCODER"]
["UL16_5_VFD1","UL16_5_VFD1_I2","I2",null,"SPARE"]
["UL16_5_VFD1","UL16_5_VFD1_I3","I3",null,"SPARE"]
["UL16_5_VFD1","UL16_5_VFD1_IO0","IO0",null,"SPARE"]
["UL16_5_VFD1","UL16_5_VFD1_IO1","IO1",null,"SPARE"]
["UL16_5_VFD1","UL16_5_VFD1_SI0","SI0",null,"SPARE"]
["UL16_5_VFD1","UL16_5_VFD1_SI1","SI1",null,"SPARE"]
["UL16_5_VFD1","UL16_5_VFD1_SI2","SI2",null,"SPARE"]
["UL16_5_VFD1","UL16_5_VFD1_SI3","SI3",null,"SPARE"]
["UL16_5_VFD1","UL16_5_VFD1_SO0","SO0",null,"SPARE"]
["UL16_6_VFD1","UL16_6_VFD1_I0","I0",null,"UL16_6_DISC","DISCONNECT AUX"]
["UL16_6_VFD1","UL16_6_VFD1_I1","I1",null,"UL16_6_ENC1","ENCODER"]
["UL16_6_VFD1","UL16_6_VFD1_I2","I2",null,"UL16_6_TPE1","TRACKING PHOTOEYE"]
["UL16_6_VFD1","UL16_6_VFD1_I3","I3",null,"UL16_6_TPE2","TRACKING PHOTOEYE"]
["UL16_6_VFD1","UL16_6_VFD1_IO0","IO0",null,"SPARE"]
["UL16_6_VFD1","UL16_6_VFD1_IO1","IO1",null,"SPARE"]
["UL16_6_VFD1","UL16_6_VFD1_SI0","SI0",null,"SPARE"]
["UL16_6_VFD1","UL16_6_VFD1_SI1","SI1",null,"SPARE"]
["UL16_6_VFD1","UL16_6_VFD1_SI2","SI2",null,"SPARE"]
["UL16_6_VFD1","UL16_6_VFD1_SI3","SI3",null,"SPARE"]
["UL16_6_VFD1","UL16_6_VFD1_SO0","SO0",null,"SPARE"]
["UL16_7_VFD1","UL16_7_VFD1_I0","I0",null,"UL16_7_DISC","DISCONNECT AUX"]
["UL16_7_VFD1","UL16_7_VFD1_I1","I1",null,"UL16_7_ENC1","ENCODER"]
["UL16_7_VFD1","UL16_7_VFD1_I2","I2",null,"UL16_7_TPE1","TRACKING PHOTOEYE"]
["UL16_7_VFD1","UL16_7_VFD1_I3","I3",null,"SPARE"]
["UL16_7_VFD1","UL16_7_VFD1_IO0","IO0",null,"SPARE"]
["UL16_7_VFD1","UL16_7_VFD1_IO1","IO1",null,"SPARE"]
["UL16_7_VFD1","UL16_7_VFD1_SI0","SI0",null,"SPARE"]
["UL16_7_VFD1","UL16_7_VFD1_SI1","SI1",null,"SPARE"]
["UL16_7_VFD1","UL16_7_VFD1_SI2","SI2",null,"SPARE"]
["UL16_7_VFD1","UL16_7_VFD1_SI3","SI3",null,"SPARE"]
["UL16_7_VFD1","UL16_7_VFD1_SO0","SO0",null,"SPARE"]
["UL16_8_VFD1","UL16_8_VFD1_I0","I0",null,"UL16_8_DISC","DISCONNECT AUX"]
["UL16_8_VFD1","UL16_8_VFD1_I1","I1",null,"UL16_8_ENC1","ENCODER"]
["UL16_8_VFD1","UL16_8_VFD1_I2","I2",null,"UL16_8_TPE1","TRACKING PHOTOEYE"]
["UL16_8_VFD1","UL16_8_VFD1_I3","I3",null,"SPARE"]
["UL16_8_VFD1","UL16_8_VFD1_IO0","IO0",null,"SPARE"]
["UL16_8_VFD1","UL16_8_VFD1_IO1","IO1",null,"SPARE"]
["UL16_8_VFD1","UL16_8_VFD1_SI0","SI0",null,"SPARE"]
["UL16_8_VFD1","UL16_8_VFD1_SI1","SI1",null,"SPARE"]
["UL16_8_VFD1","UL16_8_VFD1_SI2","SI2",null,"SPARE"]
["UL16_8_VFD1","UL16_8_VFD1_SI3","SI3",null,"SPARE"]
["UL16_8_VFD1","UL16_8_VFD1_SO0","SO0",null,"SPARE"]
["UL16_9_VFD1","UL16_9_VFD1_I0","I0",null,"UL16_9_DISC","DISCONNECT AUX"]
["UL16_9_VFD1","UL16_9_VFD1_I1","I1",null,"SPARE"]
["UL16_9_VFD1","UL16_9_VFD1_I2","I2",null,"SPARE"]
["UL16_9_VFD1","UL16_9_VFD1_I3","I3",null,"SPARE"]
["UL16_9_VFD1","UL16_9_VFD1_IO0","IO0",null,"SPARE"]
["UL16_9_VFD1","UL16_9_VFD1_IO1","IO1",null,"SPARE"]
["UL16_9_VFD1","UL16_9_VFD1_SI0","SI0",null,"SPARE"]
["UL16_9_VFD1","UL16_9_VFD1_SI1","SI1",null,"SPARE"]
["UL16_9_VFD1","UL16_9_VFD1_SI2","SI2",null,"SPARE"]
["UL16_9_VFD1","UL16_9_VFD1_SI3","SI3",null,"SPARE"]
["UL16_9_VFD1","UL16_9_VFD1_SO0","SO0",null,"SPARE"]
["UL17_10_VFD1","UL17_10_VFD1_I0","I0",null,"UL17_10_DISC","DISCONNECT AUX"]
["UL17_10_VFD1","UL17_10_VFD1_I1","I1",null,"SPARE"]
["UL17_10_VFD1","UL17_10_VFD1_I2","I2",null,"SPARE"]
["UL17_10_VFD1","UL17_10_VFD1_I3","I3",null,"SPARE"]
["UL17_10_VFD1","UL17_10_VFD1_IO0","IO0",null,"SPARE"]
["UL17_10_VFD1","UL17_10_VFD1_IO1","IO1",null,"SPARE"]
["UL17_10_VFD1","UL17_10_VFD1_SI0","SI0",null,"SPARE"]
["UL17_10_VFD1","UL17_10_VFD1_SI1","SI1",null,"SPARE"]
["UL17_10_VFD1","UL17_10_VFD1_SI2","SI2",null,"SPARE"]
["UL17_10_VFD1","UL17_10_VFD1_SI3","SI3",null,"SPARE"]
["UL17_10_VFD1","UL17_10_VFD1_SO0","SO0",null,"SPARE"]
["UL17_3_VFD1","UL17_3_VFD1_I0","I0",null,"UL17_3_DISC","DISCONNECT AUX"]
["UL17_3_VFD1","UL17_3_VFD1_I1","I1",null,"UL17_3_ENC1","ENCODER"]
["UL17_3_VFD1","UL17_3_VFD1_I2","I2",null,"UL17_3_TPE1","TRACKING PHOTOEYE"]
["UL17_3_VFD1","UL17_3_VFD1_I3","I3",null,"SPARE"]
["UL17_3_VFD1","UL17_3_VFD1_IO0","IO0",null,"SPARE"]
["UL17_3_VFD1","UL17_3_VFD1_IO1","IO1",null,"SPARE"]
["UL17_3_VFD1","UL17_3_VFD1_SI0","SI0",null,"UL17_3_EPC1","E-STOP PULLCORD"]
["UL17_3_VFD1","UL17_3_VFD1_SI1","SI1",null,"UL17_3_EPC1_2","E-STOP PULLCORD"]
["UL17_3_VFD1","UL17_3_VFD1_SI2","SI2",null,"UL17_3_EPC2","E-STOP PULLCORD"]
["UL17_3_VFD1","UL17_3_VFD1_SI3","SI3",null,"UL17_3_EPC2_2","E-STOP PULLCORD"]
["UL17_3_VFD1","UL17_3_VFD1_SO0","SO0",null,"UL17_1_STO1","E-STOP OK"]
["UL17_4_VFD1","UL17_4_VFD1_I0","I0",null,"UL17_4_DISC","DISCONNECT AUX"]
["UL17_4_VFD1","UL17_4_VFD1_I1","I1",null,"UL17_4_ENC1","ENCODER"]
["UL17_4_VFD1","UL17_4_VFD1_I2","I2",null,"UL17_4_TPE1","TRACKING PHOTOEYE"]
["UL17_4_VFD1","UL17_4_VFD1_I3","I3",null,"SPARE"]
["UL17_4_VFD1","UL17_4_VFD1_IO0","IO0",null,"UL17_4_S1_PB","START PUSHBUTTON"]
["UL17_4_VFD1","UL17_4_VFD1_IO1","IO1",null,"UL17_4_S1_PB_LT","START PUSHBUTTON LIGHT"]
["UL17_4_VFD1","UL17_4_VFD1_SI0","SI0",null,"UL17_4_EPC1","E-STOP PULLCORD"]
["UL17_4_VFD1","UL17_4_VFD1_SI1","SI1",null,"UL17_4_EPC1_2","E-STOP PULLCORD"]
["UL17_4_VFD1","UL17_4_VFD1_SI2","SI2",null,"UL17_4_EPC2","E-STOP PULLCORD"]
["UL17_4_VFD1","UL17_4_VFD1_SI3","SI3",null,"UL17_4_EPC2_2","E-STOP PULLCORD"]
["UL17_4_VFD1","UL17_4_VFD1_SO0","SO0",null,"UL17_4_BCN1_R","RED BEACON LIGHT"]
["UL17_5_VFD1","UL17_5_VFD1_I0","I0",null,"UL17_5_DISC","DISCONNECT AUX"]
["UL17_5_VFD1","UL17_5_VFD1_I1","I1",null,"UL17_5_ENC1","ENCODER"]
["UL17_5_VFD1","UL17_5_VFD1_I2","I2",null,"UL17_5_TPE1","TRACKING PHOTOEYE"]
["UL17_5_VFD1","UL17_5_VFD1_I3","I3",null,"SPARE"]
["UL17_5_VFD1","UL17_5_VFD1_IO0","IO0",null,"UL17_4_S2_PB","START PUSHBUTTON"]
["UL17_5_VFD1","UL17_5_VFD1_IO1","IO1",null,"UL17_4_S2_PB_LT","START PUSHBUTTON LIGHT"]
["UL17_5_VFD1","UL17_5_VFD1_SI0","SI0",null,"SPARE"]
["UL17_5_VFD1","UL17_5_VFD1_SI1","SI1",null,"SPARE"]
["UL17_5_VFD1","UL17_5_VFD1_SI2","SI2",null,"SPARE"]
["UL17_5_VFD1","UL17_5_VFD1_SI3","SI3",null,"SPARE"]
["UL17_5_VFD1","UL17_5_VFD1_SO0","SO0",null,"UL17_4_BCN2_R","RED BEACON LIGHT"]
["UL17_6_VFD1","UL17_6_VFD1_I0","I0",null,"UL17_6_DISC","DISCONNECT AUX"]
["UL17_6_VFD1","UL17_6_VFD1_I1","I1",null,"UL17_6_ENC1","ENCODER"]
["UL17_6_VFD1","UL17_6_VFD1_I2","I2",null,"SPARE"]
["UL17_6_VFD1","UL17_6_VFD1_I3","I3",null,"SPARE"]
["UL17_6_VFD1","UL17_6_VFD1_IO0","IO0",null,"SPARE"]
["UL17_6_VFD1","UL17_6_VFD1_IO1","IO1",null,"SPARE"]
["UL17_6_VFD1","UL17_6_VFD1_SI0","SI0",null,"SPARE"]
["UL17_6_VFD1","UL17_6_VFD1_SI1","SI1",null,"SPARE"]
["UL17_6_VFD1","UL17_6_VFD1_SI2","SI2",null,"SPARE"]
["UL17_6_VFD1","UL17_6_VFD1_SI3","SI3",null,"SPARE"]
["UL17_6_VFD1","UL17_6_VFD1_SO0","SO0",null,"SPARE"]
["UL17_7_VFD1","UL17_7_VFD1_I0","I0",null,"UL17_7_DISC","DISCONNECT AUX"]
["UL17_7_VFD1","UL17_7_VFD1_I1","I1",null,"UL17_7_ENC1","ENCODER"]
["UL17_7_VFD1","UL17_7_VFD1_I2","I2",null,"UL17_7_TPE1","TRACKING PHOTOEYE"]
["UL17_7_VFD1","UL17_7_VFD1_I3","I3",null,"UL17_7_TPE2","TRACKING PHOTOEYE"]
["UL17_7_VFD1","UL17_7_VFD1_IO0","IO0",null,"SPARE"]
["UL17_7_VFD1","UL17_7_VFD1_IO1","IO1",null,"SPARE"]
["UL17_7_VFD1","UL17_7_VFD1_SI0","SI0",null,"SPARE"]
["UL17_7_VFD1","UL17_7_VFD1_SI1","SI1",null,"SPARE"]
["UL17_7_VFD1","UL17_7_VFD1_SI2","SI2",null,"SPARE"]
["UL17_7_VFD1","UL17_7_VFD1_SI3","SI3",null,"SPARE"]
["UL17_7_VFD1","UL17_7_VFD1_SO0","SO0",null,"SPARE"]
["UL17_8_VFD1","UL17_8_VFD1_I0","I0",null,"UL17_8_DISC","DISCONNECT AUX"]
["UL17_8_VFD1","UL17_8_VFD1_I1","I1",null,"UL17_8_ENC1","ENCODER"]
["UL17_8_VFD1","UL17_8_VFD1_I2","I2",null,"UL17_8_TPE1","TRACKING PHOTOEYE"]
["UL17_8_VFD1","UL17_8_VFD1_I3","I3",null,"SPARE"]
["UL17_8_VFD1","UL17_8_VFD1_IO0","IO0",null,"SPARE"]
["UL17_8_VFD1","UL17_8_VFD1_IO1","IO1",null,"SPARE"]
["UL17_8_VFD1","UL17_8_VFD1_SI0","SI0",null,"SPARE"]
["UL17_8_VFD1","UL17_8_VFD1_SI1","SI1",null,"SPARE"]
["UL17_8_VFD1","UL17_8_VFD1_SI2","SI2",null,"SPARE"]
["UL17_8_VFD1","UL17_8_VFD1_SI3","SI3",null,"SPARE"]
["UL17_8_VFD1","UL17_8_VFD1_SO0","SO0",null,"SPARE"]
["UL17_9_VFD1","UL17_9_VFD1_I0","I0",null,"UL17_9_DISC","DISCONNECT AUX"]
["UL17_9_VFD1","UL17_9_VFD1_I1","I1",null,"UL17_9_ENC1","ENCODER"]
["UL17_9_VFD1","UL17_9_VFD1_I2","I2",null,"UL17_9_TPE1","TRACKING PHOTOEYE"]
["UL17_9_VFD1","UL17_9_VFD1_I3","I3",null,"SPARE"]
["UL17_9_VFD1","UL17_9_VFD1_IO0","IO0",null,"SPARE"]
["UL17_9_VFD1","UL17_9_VFD1_IO1","IO1",null,"SPARE"]
["UL17_9_VFD1","UL17_9_VFD1_SI0","SI0",null,"SPARE"]
["UL17_9_VFD1","UL17_9_VFD1_SI1","SI1",null,"SPARE"]
["UL17_9_VFD1","UL17_9_VFD1_SI2","SI2",null,"SPARE"]
["UL17_9_VFD1","UL17_9_VFD1_SI3","SI3",null,"SPARE"]
["UL17_9_VFD1","UL17_9_VFD1_SO0","SO0",null,"SPARE"]
["UL18_10_VFD1","UL18_10_VFD1_I0","I0",null,"UL18_10_DISC","DISCONNECT AUX"]
["UL18_10_VFD1","UL18_10_VFD1_I1","I1",null,"UL18_10_ENC1","ENCODER"]
["UL18_10_VFD1","UL18_10_VFD1_I2","I2",null,"UL18_10_TPE3","TRACKING PHOTOEYE"]
["UL18_10_VFD1","UL18_10_VFD1_I3","I3",null,"UL18_10_TPE4","TRACKING PHOTOEYE"]
["UL18_10_VFD1","UL18_10_VFD1_IO0","IO0",null,"UL18_10_JR1_PB","JAM RESET PUSHBUTTON"]
["UL18_10_VFD1","UL18_10_VFD1_IO1","IO1",null,"UL18_10_JR1_PB_LT","JAM RESET PUSHBUTTON LIGHT"]
["UL18_10_VFD1","UL18_10_VFD1_SI0","SI0",null,"UL18_10_EPC1","E-STOP PULLCORD"]
["UL18_10_VFD1","UL18_10_VFD1_SI1","SI1",null,"UL18_10_EPC1_2","E-STOP PULLCORD"]
["UL18_10_VFD1","UL18_10_VFD1_SI2","SI2",null,"UL18_10_EPC2","E-STOP PULLCORD"]
["UL18_10_VFD1","UL18_10_VFD1_SI3","SI3",null,"UL18_10_EPC2_2","E-STOP PULLCORD"]
["UL18_10_VFD1","UL18_10_VFD1_SO0","SO0",null,"UL18_10_BCN2_R","RED BEACON LIGHT"]
["UL18_11_VFD1","UL18_11_VFD1_I0","I0",null,"UL18_11_DISC","DISCONNECT AUX"]
["UL18_11_VFD1","UL18_11_VFD1_I1","I1",null,"UL18_11_ENC1","ENCODER"]
["UL18_11_VFD1","UL18_11_VFD1_I2","I2",null,"UL18_10_TPE5","TRACKING PHOTOEYE"]
["UL18_11_VFD1","UL18_11_VFD1_I3","I3",null,"SPARE"]
["UL18_11_VFD1","UL18_11_VFD1_IO0","IO0",null,"UL18_10_JR2_PB","JAM RESET PUSHBUTTON"]
["UL18_11_VFD1","UL18_11_VFD1_IO1","IO1",null,"UL18_10_JR2_PB_LT","JAM RESET PUSHBUTTON LIGHT"]
["UL18_11_VFD1","UL18_11_VFD1_SI0","SI0",null,"SPARE"]
["UL18_11_VFD1","UL18_11_VFD1_SI1","SI1",null,"SPARE"]
["UL18_11_VFD1","UL18_11_VFD1_SI2","SI2",null,"SPARE"]
["UL18_11_VFD1","UL18_11_VFD1_SI3","SI3",null,"SPARE"]
["UL18_11_VFD1","UL18_11_VFD1_SO0","SO0",null,"SPARE"]
["UL18_12_VFD1","UL18_12_VFD1_I0","I0",null,"UL18_12_DISC","DISCONNECT AUX"]
["UL18_12_VFD1","UL18_12_VFD1_I1","I1",null,"UL18_12_ENC1","ENCODER"]
["UL18_12_VFD1","UL18_12_VFD1_I2","I2",null,"UL18_12_TPE1","TRACKING PHOTOEYE"]
["UL18_12_VFD1","UL18_12_VFD1_I3","I3",null,"UL18_12_TPE2","TRACKING PHOTOEYE"]
["UL18_12_VFD1","UL18_12_VFD1_IO0","IO0",null,"UL18_10_BCN1_A","AMBER BEACON LIGHT"]
["UL18_12_VFD1","UL18_12_VFD1_IO1","IO1",null,"UL18_10_BCN1_R","RED BEACON LIGHT"]
["UL18_12_VFD1","UL18_12_VFD1_SI0","SI0",null,"SPARE"]
["UL18_12_VFD1","UL18_12_VFD1_SI1","SI1",null,"SPARE"]
["UL18_12_VFD1","UL18_12_VFD1_SI2","SI2",null,"SPARE"]
["UL18_12_VFD1","UL18_12_VFD1_SI3","SI3",null,"SPARE"]
["UL18_12_VFD1","UL18_12_VFD1_SO0","SO0",null,"SPARE"]
["UL18_13A_VFD1","UL18_13A_VFD1_I0","I0",null,"UL18_13A_DISC","DISCONNECT AUX"]
["UL18_13A_VFD1","UL18_13A_VFD1_I1","I1",null,"SPARE"]
["UL18_13A_VFD1","UL18_13A_VFD1_I2","I2",null,"SPARE"]
["UL18_13A_VFD1","UL18_13A_VFD1_I3","I3",null,"SPARE"]
["UL18_13A_VFD1","UL18_13A_VFD1_IO0","IO0",null,"SPARE"]
["UL18_13A_VFD1","UL18_13A_VFD1_IO1","IO1",null,"SPARE"]
["UL18_13A_VFD1","UL18_13A_VFD1_SI0","SI0",null,"SPARE"]
["UL18_13A_VFD1","UL18_13A_VFD1_SI1","SI1",null,"SPARE"]
["UL18_13A_VFD1","UL18_13A_VFD1_SI2","SI2",null,"SPARE"]
["UL18_13A_VFD1","UL18_13A_VFD1_SI3","SI3",null,"SPARE"]
["UL18_13A_VFD1","UL18_13A_VFD1_SO0","SO0",null,"SPARE"]
["UL18_13B_VFD1","UL18_13B_VFD1_I0","I0",null,"UL18_13B_DISC","DISCONNECT AUX"]
["UL18_13B_VFD1","UL18_13B_VFD1_I1","I1",null,"SPARE"]
["UL18_13B_VFD1","UL18_13B_VFD1_I2","I2",null,"SPARE"]
["UL18_13B_VFD1","UL18_13B_VFD1_I3","I3",null,"SPARE"]
["UL18_13B_VFD1","UL18_13B_VFD1_IO0","IO0",null,"SPARE"]
["UL18_13B_VFD1","UL18_13B_VFD1_IO1","IO1",null,"SPARE"]
["UL18_13B_VFD1","UL18_13B_VFD1_SI0","SI0",null,"SPARE"]
["UL18_13B_VFD1","UL18_13B_VFD1_SI1","SI1",null,"SPARE"]
["UL18_13B_VFD1","UL18_13B_VFD1_SI2","SI2",null,"SPARE"]
["UL18_13B_VFD1","UL18_13B_VFD1_SI3","SI3",null,"SPARE"]
["UL18_13B_VFD1","UL18_13B_VFD1_SO0","SO0",null,"SPARE"]
["UL18_14_VFD1","UL18_14_VFD1_I0","I0",null,"UL18_14_DISC","DISCONNECT AUX"]
["UL18_14_VFD1","UL18_14_VFD1_I1","I1",null,"UL18_14_ENC1","ENCODER"]
["UL18_14_VFD1","UL18_14_VFD1_I2","I2",null,"UL18_14_TPE1","TRACKING PHOTOEYE"]
["UL18_14_VFD1","UL18_14_VFD1_I3","I3",null,"UL18_14_TPE2","TRACKING PHOTOEYE"]
["UL18_14_VFD1","UL18_14_VFD1_IO0","IO0",null,"SPARE"]
["UL18_14_VFD1","UL18_14_VFD1_IO1","IO1",null,"SPARE"]
["UL18_14_VFD1","UL18_14_VFD1_SI0","SI0",null,"SPARE"]
["UL18_14_VFD1","UL18_14_VFD1_SI1","SI1",null,"SPARE"]
["UL18_14_VFD1","UL18_14_VFD1_SI2","SI2",null,"SPARE"]
["UL18_14_VFD1","UL18_14_VFD1_SI3","SI3",null,"SPARE"]
["UL18_14_VFD1","UL18_14_VFD1_SO0","SO0",null,"SPARE"]
["UL18_15_VFD1","UL18_15_VFD1_I0","I0",null,"UL18_15_DISC","DISCONNECT AUX"]
["UL18_15_VFD1","UL18_15_VFD1_I1","I1",null,"UL18_15_ENC1","ENCODER"]
["UL18_15_VFD1","UL18_15_VFD1_I2","I2",null,"UL18_15_TPE1","TRACKING PHOTOEYE"]
["UL18_15_VFD1","UL18_15_VFD1_I3","I3",null,"SPARE"]
["UL18_15_VFD1","UL18_15_VFD1_IO0","IO0",null,"SPARE"]
["UL18_15_VFD1","UL18_15_VFD1_IO1","IO1",null,"SPARE"]
["UL18_15_VFD1","UL18_15_VFD1_SI0","SI0",null,"SPARE"]
["UL18_15_VFD1","UL18_15_VFD1_SI1","SI1",null,"SPARE"]
["UL18_15_VFD1","UL18_15_VFD1_SI2","SI2",null,"SPARE"]
["UL18_15_VFD1","UL18_15_VFD1_SI3","SI3",null,"SPARE"]
["UL18_15_VFD1","UL18_15_VFD1_SO0","SO0",null,"SPARE"]
["UL18_16_VFD1","UL18_16_VFD1_I0","I0",null,"UL18_16_DISC","DISCONNECT AUX"]
["UL18_16_VFD1","UL18_16_VFD1_I1","I1",null,"SPARE"]
["UL18_16_VFD1","UL18_16_VFD1_I2","I2",null,"SPARE"]
["UL18_16_VFD1","UL18_16_VFD1_I3","I3",null,"SPARE"]
["UL18_16_VFD1","UL18_16_VFD1_IO0","IO0",null,"SPARE"]
["UL18_16_VFD1","UL18_16_VFD1_IO1","IO1",null,"SPARE"]
["UL18_16_VFD1","UL18_16_VFD1_SI0","SI0",null,"SPARE"]
["UL18_16_VFD1","UL18_16_VFD1_SI1","SI1",null,"SPARE"]
["UL18_16_VFD1","UL18_16_VFD1_SI2","SI2",null,"SPARE"]
["UL18_16_VFD1","UL18_16_VFD1_SI3","SI3",null,"SPARE"]
["UL18_16_VFD1","UL18_16_VFD1_SO0","SO0",null,"SPARE"]
["UL18_16_VFD1","UL18_16_VFD1_ENC1","ENC1",null,"UL18_16_ENC1"]
["UL18_3_VFD1","UL18_3_VFD1_I0","I0",null,"UL18_3_DISC","DISCONNECT AUX"]
["UL18_3_VFD1","UL18_3_VFD1_I1","I1",null,"UL18_3_ENC1","ENCODER"]
["UL18_3_VFD1","UL18_3_VFD1_I2","I2",null,"UL18_3_TPE1","TRACKING PHOTOEYE"]
["UL18_3_VFD1","UL18_3_VFD1_I3","I3",null,"UL18_3_TPE2","TRACKING PHOTOEYE"]
["UL18_3_VFD1","UL18_3_VFD1_IO0","IO0",null,"SPARE"]
["UL18_3_VFD1","UL18_3_VFD1_IO1","IO1",null,"SPARE"]
["UL18_3_VFD1","UL18_3_VFD1_SI0","SI0",null,"UL18_3_EPC1","E-STOP PULLCORD"]
["UL18_3_VFD1","UL18_3_VFD1_SI1","SI1",null,"UL18_3_EPC1_2","E-STOP PULLCORD"]
["UL18_3_VFD1","UL18_3_VFD1_SI2","SI2",null,"UL18_3_EPC2","E-STOP PULLCORD"]
["UL18_3_VFD1","UL18_3_VFD1_SI3","SI3",null,"UL18_3_EPC2_2","E-STOP PULLCORD"]
["UL18_3_VFD1","UL18_3_VFD1_SO0","SO0",null,"UL18_1_STO1","E-STOP OK"]
["UL18_4_VFD1","UL18_4_VFD1_I0","I0",null,"UL18_4_DISC","DISCONNECT AUX"]
["UL18_4_VFD1","UL18_4_VFD1_I1","I1",null,"UL18_4_ENC1","ENCODER"]
["UL18_4_VFD1","UL18_4_VFD1_I2","I2",null,"UL18_4_TPE1","TRACKING PHOTOEYE"]
["UL18_4_VFD1","UL18_4_VFD1_I3","I3",null,"SPARE"]
["UL18_4_VFD1","UL18_4_VFD1_IO0","IO0",null,"UL18_4_S1_PB","START PUSHBUTTON"]
["UL18_4_VFD1","UL18_4_VFD1_IO1","IO1",null,"UL18_4_S1_PB_LT","START PUSHBUTTON LIGHT"]
["UL18_4_VFD1","UL18_4_VFD1_SI0","SI0",null,"UL18_4_EPC1","E-STOP PULLCORD"]
["UL18_4_VFD1","UL18_4_VFD1_SI1","SI1",null,"UL18_4_EPC1_2","E-STOP PULLCORD"]
["UL18_4_VFD1","UL18_4_VFD1_SI2","SI2",null,"UL18_4_EPC2","E-STOP PULLCORD"]
["UL18_4_VFD1","UL18_4_VFD1_SI3","SI3",null,"UL18_4_EPC2_2","E-STOP PULLCORD"]
["UL18_4_VFD1","UL18_4_VFD1_SO0","SO0",null,"UL18_4_BCN1_R","RED BEACON LIGHT"]
["UL18_5_VFD1","UL18_5_VFD1_I0","I0",null,"UL18_5_DISC","DISCONNECT AUX"]
["UL18_5_VFD1","UL18_5_VFD1_I1","I1",null,"UL18_5_ENC1","ENCODER"]
["UL18_5_VFD1","UL18_5_VFD1_I2","I2",null,"UL18_5_TPE1","TRACKING PHOTOEYE"]
["UL18_5_VFD1","UL18_5_VFD1_I3","I3",null,"SPARE"]
["UL18_5_VFD1","UL18_5_VFD1_IO0","IO0",null,"UL18_4_S2_PB","START PUSHBUTTON"]
["UL18_5_VFD1","UL18_5_VFD1_IO1","IO1",null,"UL18_4_S2_PB_LT","START PUSHBUTTON LIGHT"]
["UL18_5_VFD1","UL18_5_VFD1_SI0","SI0",null,"SPARE"]
["UL18_5_VFD1","UL18_5_VFD1_SI1","SI1",null,"SPARE"]
["UL18_5_VFD1","UL18_5_VFD1_SI2","SI2",null,"SPARE"]
["UL18_5_VFD1","UL18_5_VFD1_SI3","SI3",null,"SPARE"]
["UL18_5_VFD1","UL18_5_VFD1_SO0","SO0",null,"UL18_4_BCN2_R","RED BEACON LIGHT"]
["UL18_6_VFD1","UL18_6_VFD1_I0","I0",null,"UL18_6_DISC","DISCONNECT AUX"]
["UL18_6_VFD1","UL18_6_VFD1_I1","I1",null,"UL18_6_ENC1","ENCODER"]
["UL18_6_VFD1","UL18_6_VFD1_I2","I2",null,"SPARE"]
["UL18_6_VFD1","UL18_6_VFD1_I3","I3",null,"SPARE"]
["UL18_6_VFD1","UL18_6_VFD1_IO0","IO0",null,"UL18_10_S2_PB","START PUSHBUTTON"]
["UL18_6_VFD1","UL18_6_VFD1_IO1","IO1",null,"UL18_10_S2_PB_LT","START PUSHBUTTON LIGHT"]
["UL18_6_VFD1","UL18_6_VFD1_SI0","SI0",null,"SPARE"]
["UL18_6_VFD1","UL18_6_VFD1_SI1","SI1",null,"SPARE"]
["UL18_6_VFD1","UL18_6_VFD1_SI2","SI2",null,"SPARE"]
["UL18_6_VFD1","UL18_6_VFD1_SI3","SI3",null,"SPARE"]
["UL18_6_VFD1","UL18_6_VFD1_SO0","SO0",null,"SPARE"]
["UL18_7_VFD1","UL18_7_VFD1_I0","I0",null,"UL18_7_DISC","DISCONNECT AUX"]
["UL18_7_VFD1","UL18_7_VFD1_I1","I1",null,"UL18_7_ENC1","ENCODER"]
["UL18_7_VFD1","UL18_7_VFD1_I2","I2",null,"UL18_7_TPE1","TRACKING PHOTOEYE"]
["UL18_7_VFD1","UL18_7_VFD1_I3","I3",null,"UL18_7_TPE2","TRACKING PHOTOEYE"]
["UL18_7_VFD1","UL18_7_VFD1_IO0","IO0",null,"UL18_10_JR3_PB","JAM RESET PUSHBUTTON"]
["UL18_7_VFD1","UL18_7_VFD1_IO1","IO1",null,"UL18_10_JR3_PB_LT","JAM RESET PUSHBUTTON LIGHT"]
["UL18_7_VFD1","UL18_7_VFD1_SI0","SI0",null,"SPARE"]
["UL18_7_VFD1","UL18_7_VFD1_SI1","SI1",null,"SPARE"]
["UL18_7_VFD1","UL18_7_VFD1_SI2","SI2",null,"SPARE"]
["UL18_7_VFD1","UL18_7_VFD1_SI3","SI3",null,"SPARE"]
["UL18_7_VFD1","UL18_7_VFD1_SO0","SO0",null,"SPARE"]
["UL18_8_VFD1","UL18_8_VFD1_I0","I0",null,"UL18_8_DISC","DISCONNECT AUX"]
["UL18_8_VFD1","UL18_8_VFD1_I1","I1",null,"UL18_8_ENC1","ENCODER"]
["UL18_8_VFD1","UL18_8_VFD1_I2","I2",null,"UL18_8_TPE1","TRACKING PHOTOEYE"]
["UL18_8_VFD1","UL18_8_VFD1_I3","I3",null,"SPARE"]
["UL18_8_VFD1","UL18_8_VFD1_IO0","IO0",null,"UL18_10_TPE1","TRACKING PHOTOEYE"]
["UL18_8_VFD1","UL18_8_VFD1_IO1","IO1",null,"UL18_10_TPE2","TRACKING PHOTOEYE"]
["UL18_8_VFD1","UL18_8_VFD1_SI0","SI0",null,"SPARE"]
["UL18_8_VFD1","UL18_8_VFD1_SI1","SI1",null,"SPARE"]
["UL18_8_VFD1","UL18_8_VFD1_SI2","SI2",null,"SPARE"]
["UL18_8_VFD1","UL18_8_VFD1_SI3","SI3",null,"SPARE"]
["UL18_8_VFD1","UL18_8_VFD1_SO0","SO0",null,"SPARE"]
["UL18_9_VFD1","UL18_9_VFD1_I0","I0",null,"UL18_9_DISC","DISCONNECT AUX"]
["UL18_9_VFD1","UL18_9_VFD1_I1","I1",null,"UL18_9_ENC1","ENCODER"]
["UL18_9_VFD1","UL18_9_VFD1_I2","I2",null,"UL18_9_TPE1","TRACKING PHOTOEYE"]
["UL18_9_VFD1","UL18_9_VFD1_I3","I3",null,"UL18_10_S1_PB","START PUSHBUTTON"]
["UL18_9_VFD1","UL18_9_VFD1_IO0","IO0",null,"UL18_10_S1_PB_LT","START PUSHBUTTON LIGHT"]
["UL18_9_VFD1","UL18_9_VFD1_IO1","IO1",null,"SPARE"]
["UL18_9_VFD1","UL18_9_VFD1_SI0","SI0",null,"SPARE"]
["UL18_9_VFD1","UL18_9_VFD1_SI1","SI1",null,"SPARE"]
["UL18_9_VFD1","UL18_9_VFD1_SI2","SI2",null,"SPARE"]
["UL18_9_VFD1","UL18_9_VFD1_SI3","SI3",null,"SPARE"]
["UL18_9_VFD1","UL18_9_VFD1_SO0","SO0",null,"SPARE"]
["UL19_1_VFD1","UL19_1_VFD1_I0","I0",null,"UL19_1_DISC","DISCONNECT AUX"]
["UL19_1_VFD1","UL19_1_VFD1_I1","I1",null,"SPARE"]
["UL19_1_VFD1","UL19_1_VFD1_I2","I2",null,"UL19_1_TPE1","TRACKING PHOTOEYE"]
["UL19_1_VFD1","UL19_1_VFD1_I3","I3",null,"UL19_1_SS1_STPB","SS STATION STOP PUSHBUTTON"]
["UL19_1_VFD1","UL19_1_VFD1_IO0","IO0",null,"UL19_1_SS1_SPB","SS STATION START PUSHBUTTON"]
["UL19_1_VFD1","UL19_1_VFD1_IO1","IO1",null,"UL19_1_SS1_SPB_LT","SS STATION START PUSHBUTTON LIGHT"]
["UL19_1_VFD1","UL19_1_VFD1_SI0","SI0",null,"UL19_1_EPC1","E-STOP PULLCORD"]
["UL19_1_VFD1","UL19_1_VFD1_SI1","SI1",null,"UL19_1_EPC1_2","E-STOP PULLCORD"]
["UL19_1_VFD1","UL19_1_VFD1_SI2","SI2",null,"UL19_1_EPC2","E-STOP PULLCORD"]
["UL19_1_VFD1","UL19_1_VFD1_SI3","SI3",null,"UL19_1_EPC2_2","E-STOP PULLCORD"]
["UL19_1_VFD1","UL19_1_VFD1_SO0","SO0",null,"UL19_1_BCN1_R","RED BEACON LIGHT"]
["UL19_2_VFD1","UL19_2_VFD1_I0","I0",null,"UL19_2_DISC","DISCONNECT AUX"]
["UL19_2_VFD1","UL19_2_VFD1_I1","I1",null,"UL19_2_ENC1","ENCODER"]
["UL19_2_VFD1","UL19_2_VFD1_I2","I2",null,"UL19_2_TPE1","TRACKING PHOTOEYE"]
["UL19_2_VFD1","UL19_2_VFD1_I3","I3",null,"UL19_2_TPE2","TRACKING PHOTOEYE"]
["UL19_2_VFD1","UL19_2_VFD1_IO0","IO0",null,"SPARE"]
["UL19_2_VFD1","UL19_2_VFD1_IO1","IO1",null,"SPARE"]
["UL19_2_VFD1","UL19_2_VFD1_SI0","SI0",null,"UL19_2_EPC1","E-STOP PULLCORD"]
["UL19_2_VFD1","UL19_2_VFD1_SI1","SI1",null,"UL19_2_EPC1_2","E-STOP PULLCORD"]
["UL19_2_VFD1","UL19_2_VFD1_SI2","SI2",null,"UL19_2_EPC2","E-STOP PULLCORD"]
["UL19_2_VFD1","UL19_2_VFD1_SI3","SI3",null,"UL19_2_EPC2_2","E-STOP PULLCORD"]
["UL19_2_VFD1","UL19_2_VFD1_SO0","SO0",null,"UL19_1_BCN2_R","RED BEACON LIGHT"]
["UL19_3_VFD1","UL19_3_VFD1_I0","I0",null,"UL19_3_DISC","DISCONNECT AUX"]
["UL19_3_VFD1","UL19_3_VFD1_I1","I1",null,"UL19_3_ENC1","ENCODER"]
["UL19_3_VFD1","UL19_3_VFD1_I2","I2",null,"SPARE"]
["UL19_3_VFD1","UL19_3_VFD1_I3","I3",null,"SPARE"]
["UL19_3_VFD1","UL19_3_VFD1_IO0","IO0",null,"SPARE"]
["UL19_3_VFD1","UL19_3_VFD1_IO1","IO1",null,"SPARE"]
["UL19_3_VFD1","UL19_3_VFD1_SI0","SI0",null,"SPARE"]
["UL19_3_VFD1","UL19_3_VFD1_SI1","SI1",null,"SPARE"]
["UL19_3_VFD1","UL19_3_VFD1_SI2","SI2",null,"SPARE"]
["UL19_3_VFD1","UL19_3_VFD1_SI3","SI3",null,"SPARE"]
["UL19_3_VFD1","UL19_3_VFD1_SO0","SO0",null,"SPARE"]
["UL19_4_VFD1","UL19_4_VFD1_I0","I0",null,"UL19_4_DISC","DISCONNECT AUX"]
["UL19_4_VFD1","UL19_4_VFD1_I1","I1",null,"UL19_4_ENC1","ENCODER"]
["UL19_4_VFD1","UL19_4_VFD1_I2","I2",null,"UL19_4_TPE1","TRACKING PHOTOEYE"]
["UL19_4_VFD1","UL19_4_VFD1_I3","I3",null,"UL19_4_TPE2","TRACKING PHOTOEYE"]
["UL19_4_VFD1","UL19_4_VFD1_IO0","IO0",null,"SPARE"]
["UL19_4_VFD1","UL19_4_VFD1_IO1","IO1",null,"SPARE"]
["UL19_4_VFD1","UL19_4_VFD1_SI0","SI0",null,"SPARE"]
["UL19_4_VFD1","UL19_4_VFD1_SI1","SI1",null,"SPARE"]
["UL19_4_VFD1","UL19_4_VFD1_SI2","SI2",null,"SPARE"]
["UL19_4_VFD1","UL19_4_VFD1_SI3","SI3",null,"SPARE"]
["UL19_4_VFD1","UL19_4_VFD1_SO0","SO0",null,"SPARE"]
["UL19_5_VFD1","UL19_5_VFD1_I0","I0",null,"UL19_5_DISC","DISCONNECT AUX"]
["UL19_5_VFD1","UL19_5_VFD1_I1","I1",null,"UL19_5_ENC1","ENCODER"]
["UL19_5_VFD1","UL19_5_VFD1_I2","I2",null,"UL19_5_TPE1","TRACKING PHOTOEYE"]
["UL19_5_VFD1","UL19_5_VFD1_I3","I3",null,"SPARE"]
["UL19_5_VFD1","UL19_5_VFD1_IO0","IO0",null,"SPARE"]
["UL19_5_VFD1","UL19_5_VFD1_IO1","IO1",null,"SPARE"]
["UL19_5_VFD1","UL19_5_VFD1_SI0","SI0",null,"SPARE"]
["UL19_5_VFD1","UL19_5_VFD1_SI1","SI1",null,"SPARE"]
["UL19_5_VFD1","UL19_5_VFD1_SI2","SI2",null,"SPARE"]
["UL19_5_VFD1","UL19_5_VFD1_SI3","SI3",null,"SPARE"]
["UL19_5_VFD1","UL19_5_VFD1_SO0","SO0",null,"SPARE"]
["UL19_6_VFD1","UL19_6_VFD1_I0","I0",null,"UL19_6_DISC","DISCONNECT AUX"]
["UL19_6_VFD1","UL19_6_VFD1_I1","I1",null,"UL19_6_ENC1","ENCODER"]
["UL19_6_VFD1","UL19_6_VFD1_I2","I2",null,"UL19_6_TPE1","TRACKING PHOTOEYE"]
["UL19_6_VFD1","UL19_6_VFD1_I3","I3",null,"SPARE"]
["UL19_6_VFD1","UL19_6_VFD1_IO0","IO0",null,"SPARE"]
["UL19_6_VFD1","UL19_6_VFD1_IO1","IO1",null,"SPARE"]
["UL19_6_VFD1","UL19_6_VFD1_SI0","SI0",null,"SPARE"]
["UL19_6_VFD1","UL19_6_VFD1_SI1","SI1",null,"SPARE"]
["UL19_6_VFD1","UL19_6_VFD1_SI2","SI2",null,"SPARE"]
["UL19_6_VFD1","UL19_6_VFD1_SI3","SI3",null,"SPARE"]
["UL19_6_VFD1","UL19_6_VFD1_SO0","SO0",null,"SPARE"]
["UL19_7_VFD1","UL19_7_VFD1_I0","I0",null,"UL19_7_DISC","DISCONNECT AUX"]
["UL19_7_VFD1","UL19_7_VFD1_I1","I1",null,"UL19_7_ENC1","ENCODER"]
["UL19_7_VFD1","UL19_7_VFD1_I2","I2",null,"UL19_7_TPE1","TRACKING PHOTOEYE"]
["UL19_7_VFD1","UL19_7_VFD1_I3","I3",null,"SPARE"]
["UL19_7_VFD1","UL19_7_VFD1_IO0","IO0",null,"SPARE"]
["UL19_7_VFD1","UL19_7_VFD1_IO1","IO1",null,"SPARE"]
["UL19_7_VFD1","UL19_7_VFD1_SI0","SI0",null,"SPARE"]
["UL19_7_VFD1","UL19_7_VFD1_SI1","SI1",null,"SPARE"]
["UL19_7_VFD1","UL19_7_VFD1_SI2","SI2",null,"SPARE"]
["UL19_7_VFD1","UL19_7_VFD1_SI3","SI3",null,"SPARE"]
["UL19_7_VFD1","UL19_7_VFD1_SO0","SO0",null,"SPARE"]
["UL19_8_VFD1","UL19_8_VFD1_I0","I0",null,"UL19_8_DISC","DISCONNECT AUX"]
["UL19_8_VFD1","UL19_8_VFD1_I1","I1",null,"UL19_8_ENC1","ENCODER"]
["UL19_8_VFD1","UL19_8_VFD1_I2","I2",null,"UL19_8_TPE1","TRACKING PHOTOEYE"]
["UL19_8_VFD1","UL19_8_VFD1_I3","I3",null,"SPARE"]
["UL19_8_VFD1","UL19_8_VFD1_IO0","IO0",null,"SPARE"]
["UL19_8_VFD1","UL19_8_VFD1_IO1","IO1",null,"SPARE"]
["UL19_8_VFD1","UL19_8_VFD1_SI0","SI0",null,"SPARE"]
["UL19_8_VFD1","UL19_8_VFD1_SI1","SI1",null,"SPARE"]
["UL19_8_VFD1","UL19_8_VFD1_SI2","SI2",null,"SPARE"]
["UL19_8_VFD1","UL19_8_VFD1_SI3","SI3",null,"SPARE"]
["UL19_8_VFD1","UL19_8_VFD1_SO0","SO0",null,"SPARE"]
["UL19_9_VFD1","UL19_9_VFD1_I0","I0",null,"UL19_9_DISC","DISCONNECT AUX"]
["UL19_9_VFD1","UL19_9_VFD1_I1","I1",null,"SPARE"]
["UL19_9_VFD1","UL19_9_VFD1_I2","I2",null,"SPARE"]
["UL19_9_VFD1","UL19_9_VFD1_I3","I3",null,"SPARE"]
["UL19_9_VFD1","UL19_9_VFD1_IO0","IO0",null,"SPARE"]
["UL19_9_VFD1","UL19_9_VFD1_IO1","IO1",null,"SPARE"]
["UL19_9_VFD1","UL19_9_VFD1_SI0","SI0",null,"SPARE"]
["UL19_9_VFD1","UL19_9_VFD1_SI1","SI1",null,"SPARE"]
["UL19_9_VFD1","UL19_9_VFD1_SI2","SI2",null,"SPARE"]
["UL19_9_VFD1","UL19_9_VFD1_SI3","SI3",null,"SPARE"]
["UL19_9_VFD1","UL19_9_VFD1_SO0","SO0",null,"SPARE"]
["UL20_10_VFD1","UL20_10_VFD1_I0","I0",null,"UL20_10_DISC","DISCONNECT AUX"]
["UL20_10_VFD1","UL20_10_VFD1_I1","I1",null,"UL20_10_ENC1","ENCODER"]
["UL20_10_VFD1","UL20_10_VFD1_I2","I2",null,"UL20_10_TPE1","TRACKING PHOTOEYE"]
["UL20_10_VFD1","UL20_10_VFD1_I3","I3",null,"SPARE"]
["UL20_10_VFD1","UL20_10_VFD1_IO0","IO0",null,"SPARE"]
["UL20_10_VFD1","UL20_10_VFD1_IO1","IO1",null,"SPARE"]
["UL20_10_VFD1","UL20_10_VFD1_SI0","SI0",null,"SPARE"]
["UL20_10_VFD1","UL20_10_VFD1_SI1","SI1",null,"SPARE"]
["UL20_10_VFD1","UL20_10_VFD1_SI2","SI2",null,"SPARE"]
["UL20_10_VFD1","UL20_10_VFD1_SI3","SI3",null,"SPARE"]
["UL20_10_VFD1","UL20_10_VFD1_SO0","SO0",null,"SPARE"]
["UL20_11_VFD1","UL20_11_VFD1_I0","I0",null,"UL20_11_DISC","DISCONNECT AUX"]
["UL20_11_VFD1","UL20_11_VFD1_I1","I1",null,"SPARE"]
["UL20_11_VFD1","UL20_11_VFD1_I2","I2",null,"SPARE"]
["UL20_11_VFD1","UL20_11_VFD1_I3","I3",null,"SPARE"]
["UL20_11_VFD1","UL20_11_VFD1_IO0","IO0",null,"SPARE"]
["UL20_11_VFD1","UL20_11_VFD1_IO1","IO1",null,"SPARE"]
["UL20_11_VFD1","UL20_11_VFD1_SI0","SI0",null,"SPARE"]
["UL20_11_VFD1","UL20_11_VFD1_SI1","SI1",null,"SPARE"]
["UL20_11_VFD1","UL20_11_VFD1_SI2","SI2",null,"SPARE"]
["UL20_11_VFD1","UL20_11_VFD1_SI3","SI3",null,"SPARE"]
["UL20_11_VFD1","UL20_11_VFD1_SO0","SO0",null,"SPARE"]
["UL20_3_VFD1","UL20_3_VFD1_I0","I0",null,"UL20_3_DISC","DISCONNECT AUX"]
["UL20_3_VFD1","UL20_3_VFD1_I1","I1",null,"UL20_3_ENC1","ENCODER"]
["UL20_3_VFD1","UL20_3_VFD1_I2","I2",null,"UL20_3_TPE1","TRACKING PHOTOEYE"]
["UL20_3_VFD1","UL20_3_VFD1_I3","I3",null,"UL20_3_TPE2","TRACKING PHOTOEYE"]
["UL20_3_VFD1","UL20_3_VFD1_IO0","IO0",null,"SPARE"]
["UL20_3_VFD1","UL20_3_VFD1_IO1","IO1",null,"SPARE"]
["UL20_3_VFD1","UL20_3_VFD1_SI0","SI0",null,"UL20_3_EPC1","E-STOP PULLCORD"]
["UL20_3_VFD1","UL20_3_VFD1_SI1","SI1",null,"UL20_3_EPC1_2","E-STOP PULLCORD"]
["UL20_3_VFD1","UL20_3_VFD1_SI2","SI2",null,"UL20_3_EPC2","E-STOP PULLCORD"]
["UL20_3_VFD1","UL20_3_VFD1_SI3","SI3",null,"UL20_3_EPC2_2","E-STOP PULLCORD"]
["UL20_3_VFD1","UL20_3_VFD1_SO0","SO0",null,"UL20_1_STO1","E-STOP OK"]
["UL20_4_VFD1","UL20_4_VFD1_I0","I0",null,"UL20_4_DISC","DISCONNECT AUX"]
["UL20_4_VFD1","UL20_4_VFD1_I1","I1",null,"UL20_4_ENC1","ENCODER"]
["UL20_4_VFD1","UL20_4_VFD1_I2","I2",null,"UL20_4_TPE1","TRACKING PHOTOEYE"]
["UL20_4_VFD1","UL20_4_VFD1_I3","I3",null,"SPARE"]
["UL20_4_VFD1","UL20_4_VFD1_IO0","IO0",null,"UL20_4_S1_PB","START PUSHBUTTON"]
["UL20_4_VFD1","UL20_4_VFD1_IO1","IO1",null,"UL20_4_S1_PB_LT","START PUSHBUTTON LIGHT"]
["UL20_4_VFD1","UL20_4_VFD1_SI0","SI0",null,"UL20_4_EPC1","E-STOP PULLCORD"]
["UL20_4_VFD1","UL20_4_VFD1_SI1","SI1",null,"UL20_4_EPC1_2","E-STOP PULLCORD"]
["UL20_4_VFD1","UL20_4_VFD1_SI2","SI2",null,"UL20_4_EPC2","E-STOP PULLCORD"]
["UL20_4_VFD1","UL20_4_VFD1_SI3","SI3",null,"UL20_4_EPC2_2","E-STOP PULLCORD"]
["UL20_4_VFD1","UL20_4_VFD1_SO0","SO0",null,"UL20_4_BCN1_R","RED BEACON LIGHT"]
["UL20_5_VFD1","UL20_5_VFD1_I0","I0",null,"UL20_5_DISC","DISCONNECT AUX"]
["UL20_5_VFD1","UL20_5_VFD1_I1","I1",null,"UL20_5_ENC1","ENCODER"]
["UL20_5_VFD1","UL20_5_VFD1_I2","I2",null,"SPARE"]
["UL20_5_VFD1","UL20_5_VFD1_I3","I3",null,"SPARE"]
["UL20_5_VFD1","UL20_5_VFD1_IO0","IO0",null,"UL20_4_S2_PB","START PUSHBUTTON"]
["UL20_5_VFD1","UL20_5_VFD1_IO1","IO1",null,"UL20_4_S2_PB_LT","START PUSHBUTTON LIGHT"]
["UL20_5_VFD1","UL20_5_VFD1_SI0","SI0",null,"SPARE"]
["UL20_5_VFD1","UL20_5_VFD1_SI1","SI1",null,"SPARE"]
["UL20_5_VFD1","UL20_5_VFD1_SI2","SI2",null,"SPARE"]
["UL20_5_VFD1","UL20_5_VFD1_SI3","SI3",null,"SPARE"]
["UL20_5_VFD1","UL20_5_VFD1_SO0","SO0",null,"SPARE"]
["UL20_6_VFD1","UL20_6_VFD1_I0","I0",null,"UL20_6_DISC","DISCONNECT AUX"]
["UL20_6_VFD1","UL20_6_VFD1_I1","I1",null,"UL20_6_ENC1","ENCODER"]
["UL20_6_VFD1","UL20_6_VFD1_I2","I2",null,"UL20_6_TPE1","TRACKING PHOTOEYE"]
["UL20_6_VFD1","UL20_6_VFD1_I3","I3",null,"UL20_6_TPE2","TRACKING PHOTOEYE"]
["UL20_6_VFD1","UL20_6_VFD1_IO0","IO0",null,"UL20_4_BCN2_R","RED BEACON LIGHT"]
["UL20_6_VFD1","UL20_6_VFD1_IO1","IO1",null,"UL20_4_BCN2_H","ALARM HORN"]
["UL20_6_VFD1","UL20_6_VFD1_SI0","SI0",null,"SPARE"]
["UL20_6_VFD1","UL20_6_VFD1_SI1","SI1",null,"SPARE"]
["UL20_6_VFD1","UL20_6_VFD1_SI2","SI2",null,"SPARE"]
["UL20_6_VFD1","UL20_6_VFD1_SI3","SI3",null,"SPARE"]
["UL20_6_VFD1","UL20_6_VFD1_SO0","SO0",null,"SPARE"]
["UL20_7_VFD1","UL20_7_VFD1_I0","I0",null,"UL20_7_DISC","DISCONNECT AUX"]
["UL20_7_VFD1","UL20_7_VFD1_I1","I1",null,"UL20_7_ENC1","ENCODER"]
["UL20_7_VFD1","UL20_7_VFD1_I2","I2",null,"UL20_7_TPE1","TRACKING PHOTOEYE"]
["UL20_7_VFD1","UL20_7_VFD1_I3","I3",null,"SPARE"]
["UL20_7_VFD1","UL20_7_VFD1_IO0","IO0",null,"SPARE"]
["UL20_7_VFD1","UL20_7_VFD1_IO1","IO1",null,"SPARE"]
["UL20_7_VFD1","UL20_7_VFD1_SI0","SI0",null,"SPARE"]
["UL20_7_VFD1","UL20_7_VFD1_SI1","SI1",null,"SPARE"]
["UL20_7_VFD1","UL20_7_VFD1_SI2","SI2",null,"SPARE"]
["UL20_7_VFD1","UL20_7_VFD1_SI3","SI3",null,"SPARE"]
["UL20_7_VFD1","UL20_7_VFD1_SO0","SO0",null,"SPARE"]
["UL20_8_VFD1","UL20_8_VFD1_I0","I0",null,"UL20_8_DISC","DISCONNECT AUX"]
["UL20_8_VFD1","UL20_8_VFD1_I1","I1",null,"UL20_8_ENC1","ENCODER"]
["UL20_8_VFD1","UL20_8_VFD1_I2","I2",null,"UL20_8_TPE1","TRACKING PHOTOEYE"]
["UL20_8_VFD1","UL20_8_VFD1_I3","I3",null,"SPARE"]
["UL20_8_VFD1","UL20_8_VFD1_IO0","IO0",null,"SPARE"]
["UL20_8_VFD1","UL20_8_VFD1_IO1","IO1",null,"SPARE"]
["UL20_8_VFD1","UL20_8_VFD1_SI0","SI0",null,"SPARE"]
["UL20_8_VFD1","UL20_8_VFD1_SI1","SI1",null,"SPARE"]
["UL20_8_VFD1","UL20_8_VFD1_SI2","SI2",null,"SPARE"]
["UL20_8_VFD1","UL20_8_VFD1_SI3","SI3",null,"SPARE"]
["UL20_8_VFD1","UL20_8_VFD1_SO0","SO0",null,"SPARE"]
["UL20_9_VFD1","UL20_9_VFD1_I0","I0",null,"UL20_9_DISC","DISCONNECT AUX"]
["UL20_9_VFD1","UL20_9_VFD1_I1","I1",null,"UL20_9_ENC1","ENCODER"]
["UL20_9_VFD1","UL20_9_VFD1_I2","I2",null,"UL20_9_TPE1","TRACKING PHOTOEYE"]
["UL20_9_VFD1","UL20_9_VFD1_I3","I3",null,"SPARE"]
["UL20_9_VFD1","UL20_9_VFD1_IO0","IO0",null,"UL21_11_TPE1","TRACKING PHOTOEYE"]
["UL20_9_VFD1","UL20_9_VFD1_IO1","IO1",null,"UL21_11_TPE2","TRACKING PHOTOEYE"]
["UL20_9_VFD1","UL20_9_VFD1_SI0","SI0",null,"SPARE"]
["UL20_9_VFD1","UL20_9_VFD1_SI1","SI1",null,"SPARE"]
["UL20_9_VFD1","UL20_9_VFD1_SI2","SI2",null,"SPARE"]
["UL20_9_VFD1","UL20_9_VFD1_SI3","SI3",null,"SPARE"]
["UL20_9_VFD1","UL20_9_VFD1_SO0","SO0",null,"SPARE"]
["UL21_10_VFD1","UL21_10_VFD1_I0","I0",null,"UL21_10_DISC","DISCONNECT AUX"]
["UL21_10_VFD1","UL21_10_VFD1_I1","I1",null,"UL21_10_ENC1","ENCODER"]
["UL21_10_VFD1","UL21_10_VFD1_I2","I2",null,"UL21_10_TPE1","TRACKING PHOTOEYE"]
["UL21_10_VFD1","UL21_10_VFD1_I3","I3",null,"SPARE"]
["UL21_10_VFD1","UL21_10_VFD1_IO0","IO0",null,"UL21_11_BCN1_A","AMBER BEACON LIGHT"]
["UL21_10_VFD1","UL21_10_VFD1_IO1","IO1",null,"UL21_11_BCN1_R","RED BEACON LIGHT"]
["UL21_10_VFD1","UL21_10_VFD1_SI0","SI0",null,"SPARE"]
["UL21_10_VFD1","UL21_10_VFD1_SI1","SI1",null,"SPARE"]
["UL21_10_VFD1","UL21_10_VFD1_SI2","SI2",null,"SPARE"]
["UL21_10_VFD1","UL21_10_VFD1_SI3","SI3",null,"SPARE"]
["UL21_10_VFD1","UL21_10_VFD1_SO0","SO0",null,"UL21_11_BCN2_R","RED BEACON LIGHT"]
["UL21_11_VFD1","UL21_11_VFD1_I0","I0",null,"UL21_11_DISC","DISCONNECT AUX"]
["UL21_11_VFD1","UL21_11_VFD1_I1","I1",null,"UL21_11_ENC1","ENCODER"]
["UL21_11_VFD1","UL21_11_VFD1_I2","I2",null,"UL21_11_TPE3","TRACKING PHOTOEYE"]
["UL21_11_VFD1","UL21_11_VFD1_I3","I3",null,"SPARE"]
["UL21_11_VFD1","UL21_11_VFD1_IO0","IO0",null,"UL21_11_JR1_PB","JAM RESET PUSHBUTTON"]
["UL21_11_VFD1","UL21_11_VFD1_IO1","IO1",null,"UL21_11_JR1_PB_LT","JAM RESET PUSHBUTTON LIGHT"]
["UL21_11_VFD1","UL21_11_VFD1_SI0","SI0",null,"UL21_11_EPC1","E-STOP PULLCORD"]
["UL21_11_VFD1","UL21_11_VFD1_SI1","SI1",null,"UL21_11_EPC1_2","E-STOP PULLCORD"]
["UL21_11_VFD1","UL21_11_VFD1_SI2","SI2",null,"UL21_11_EPC2","E-STOP PULLCORD"]
["UL21_11_VFD1","UL21_11_VFD1_SI3","SI3",null,"UL21_11_EPC2_2","E-STOP PULLCORD"]
["UL21_11_VFD1","UL21_11_VFD1_SO0","SO0",null,"SPARE"]
["UL21_12_VFD1","UL21_12_VFD1_I0","I0",null,"UL21_12_DISC","DISCONNECT AUX"]
["UL21_12_VFD1","UL21_12_VFD1_I1","I1",null,"UL21_12_ENC1","ENCODER"]
["UL21_12_VFD1","UL21_12_VFD1_I2","I2",null,"UL21_11_TPE4","TRACKING PHOTOEYE"]
["UL21_12_VFD1","UL21_12_VFD1_I3","I3",null,"UL21_11_TPE5","TRACKING PHOTOEYE"]
["UL21_12_VFD1","UL21_12_VFD1_IO0","IO0",null,"UL21_11_JR2_PB","JAM RESET PUSHBUTTON"]
["UL21_12_VFD1","UL21_12_VFD1_IO1","IO1",null,"UL21_11_JR2_PB_LT","JAM RESET PUSHBUTTON LIGHT"]
["UL21_12_VFD1","UL21_12_VFD1_SI0","SI0",null,"SPARE"]
["UL21_12_VFD1","UL21_12_VFD1_SI1","SI1",null,"SPARE"]
["UL21_12_VFD1","UL21_12_VFD1_SI2","SI2",null,"SPARE"]
["UL21_12_VFD1","UL21_12_VFD1_SI3","SI3",null,"SPARE"]
["UL21_12_VFD1","UL21_12_VFD1_SO0","SO0",null,"SPARE"]
["UL21_13_VFD1","UL21_13_VFD1_I0","I0",null,"UL21_13_DISC","DISCONNECT AUX"]
["UL21_13_VFD1","UL21_13_VFD1_I1","I1",null,"UL21_13_ENC1","ENCODER"]
["UL21_13_VFD1","UL21_13_VFD1_I2","I2",null,"UL21_13_TPE1","TRACKING PHOTOEYE"]
["UL21_13_VFD1","UL21_13_VFD1_I3","I3",null,"UL21_13_TPE2","TRACKING PHOTOEYE"]
["UL21_13_VFD1","UL21_13_VFD1_IO0","IO0",null,"UL21_11_S1_PB","START PUSHBUTTON"]
["UL21_13_VFD1","UL21_13_VFD1_IO1","IO1",null,"UL21_11_S1_PB_LT","START PUSHBUTTON LIGHT"]
["UL21_13_VFD1","UL21_13_VFD1_SI0","SI0",null,"UL21_13_EPC1","E-STOP PULLCORD"]
["UL21_13_VFD1","UL21_13_VFD1_SI1","SI1",null,"UL21_13_EPC1_2","E-STOP PULLCORD"]
["UL21_13_VFD1","UL21_13_VFD1_SI2","SI2",null,"UL21_13_EPC2","E-STOP PULLCORD"]
["UL21_13_VFD1","UL21_13_VFD1_SI3","SI3",null,"UL21_13_EPC2_2","E-STOP PULLCORD"]
["UL21_13_VFD1","UL21_13_VFD1_SO0","SO0",null,"SPARE"]
["UL21_14A_VFD1","UL21_14A_VFD1_I0","I0",null,"UL21_14A_DISC","DISCONNECT AUX"]
["UL21_14A_VFD1","UL21_14A_VFD1_I1","I1",null,"SPARE"]
["UL21_14A_VFD1","UL21_14A_VFD1_I2","I2",null,"SPARE"]
["UL21_14A_VFD1","UL21_14A_VFD1_I3","I3",null,"SPARE"]
["UL21_14A_VFD1","UL21_14A_VFD1_IO0","IO0",null,"UL21_11_S2_PB","START PUSHBUTTON"]
["UL21_14A_VFD1","UL21_14A_VFD1_IO1","IO1",null,"UL21_11_S2_PB_LT","START PUSHBUTTON LIGHT"]
["UL21_14A_VFD1","UL21_14A_VFD1_SI0","SI0",null,"SPARE"]
["UL21_14A_VFD1","UL21_14A_VFD1_SI1","SI1",null,"SPARE"]
["UL21_14A_VFD1","UL21_14A_VFD1_SI2","SI2",null,"SPARE"]
["UL21_14A_VFD1","UL21_14A_VFD1_SI3","SI3",null,"SPARE"]
["UL21_14A_VFD1","UL21_14A_VFD1_SO0","SO0",null,"SPARE"]
["UL21_14B_VFD1","UL21_14B_VFD1_I0","I0",null,"UL21_14B_DISC","DISCONNECT AUX"]
["UL21_14B_VFD1","UL21_14B_VFD1_I1","I1",null,"SPARE"]
["UL21_14B_VFD1","UL21_14B_VFD1_I2","I2",null,"SPARE"]
["UL21_14B_VFD1","UL21_14B_VFD1_I3","I3",null,"SPARE"]
["UL21_14B_VFD1","UL21_14B_VFD1_IO0","IO0",null,"UL21_13_BCN1_R","RED BEACON LIGHT"]
["UL21_14B_VFD1","UL21_14B_VFD1_IO1","IO1",null,"UL21_13_BCN2_R","RED BEACON LIGHT"]
["UL21_14B_VFD1","UL21_14B_VFD1_SI0","SI0",null,"SPARE"]
["UL21_14B_VFD1","UL21_14B_VFD1_SI1","SI1",null,"SPARE"]
["UL21_14B_VFD1","UL21_14B_VFD1_SI2","SI2",null,"SPARE"]
["UL21_14B_VFD1","UL21_14B_VFD1_SI3","SI3",null,"SPARE"]
["UL21_14B_VFD1","UL21_14B_VFD1_SO0","SO0",null,"SPARE"]
["UL21_15_VFD1","UL21_15_VFD1_I0","I0",null,"UL21_15_DISC","DISCONNECT AUX"]
["UL21_15_VFD1","UL21_15_VFD1_I1","I1",null,"UL21_15_ENC1","ENCODER"]
["UL21_15_VFD1","UL21_15_VFD1_I2","I2",null,"UL21_15_TPE1","TRACKING PHOTOEYE"]
["UL21_15_VFD1","UL21_15_VFD1_I3","I3",null,"UL21_15_TPE2","TRACKING PHOTOEYE"]
["UL21_15_VFD1","UL21_15_VFD1_IO0","IO0",null,"UL21_13_S1_PB","START PUSHBUTTON"]
["UL21_15_VFD1","UL21_15_VFD1_IO1","IO1",null,"UL21_13_S1_PB_LT","START PUSHBUTTON LIGHT"]
["UL21_15_VFD1","UL21_15_VFD1_SI0","SI0",null,"SPARE"]
["UL21_15_VFD1","UL21_15_VFD1_SI1","SI1",null,"SPARE"]
["UL21_15_VFD1","UL21_15_VFD1_SI2","SI2",null,"SPARE"]
["UL21_15_VFD1","UL21_15_VFD1_SI3","SI3",null,"SPARE"]
["UL21_15_VFD1","UL21_15_VFD1_SO0","SO0",null,"SPARE"]
["UL21_16_VFD1","UL21_16_VFD1_I0","I0",null,"UL21_16_DISC","DISCONNECT AUX"]
["UL21_16_VFD1","UL21_16_VFD1_I1","I1",null,"UL21_16_ENC1","ENCODER"]
["UL21_16_VFD1","UL21_16_VFD1_I2","I2",null,"UL21_16_TPE1","TRACKING PHOTOEYE"]
["UL21_16_VFD1","UL21_16_VFD1_I3","I3",null,"SPARE"]
["UL21_16_VFD1","UL21_16_VFD1_IO0","IO0",null,"UL21_13_S2_PB","START PUSHBUTTON"]
["UL21_16_VFD1","UL21_16_VFD1_IO1","IO1",null,"UL21_13_S2_PB_LT","START PUSHBUTTON LIGHT"]
["UL21_16_VFD1","UL21_16_VFD1_SI0","SI0",null,"SPARE"]
["UL21_16_VFD1","UL21_16_VFD1_SI1","SI1",null,"SPARE"]
["UL21_16_VFD1","UL21_16_VFD1_SI2","SI2",null,"SPARE"]
["UL21_16_VFD1","UL21_16_VFD1_SI3","SI3",null,"SPARE"]
["UL21_16_VFD1","UL21_16_VFD1_SO0","SO0",null,"SPARE"]
["UL21_17_VFD1","UL21_17_VFD1_I0","I0",null,"UL21_17_DISC","DISCONNECT AUX"]
["UL21_17_VFD1","UL21_17_VFD1_I1","I1",null,"SPARE"]
["UL21_17_VFD1","UL21_17_VFD1_I2","I2",null,"SPARE"]
["UL21_17_VFD1","UL21_17_VFD1_I3","I3",null,"SPARE"]
["UL21_17_VFD1","UL21_17_VFD1_IO0","IO0",null,"SPARE"]
["UL21_17_VFD1","UL21_17_VFD1_IO1","IO1",null,"SPARE"]
["UL21_17_VFD1","UL21_17_VFD1_SI0","SI0",null,"SPARE"]
["UL21_17_VFD1","UL21_17_VFD1_SI1","SI1",null,"SPARE"]
["UL21_17_VFD1","UL21_17_VFD1_SI2","SI2",null,"SPARE"]
["UL21_17_VFD1","UL21_17_VFD1_SI3","SI3",null,"SPARE"]
["UL21_17_VFD1","UL21_17_VFD1_SO0","SO0",null,"SPARE"]
["UL21_17_VFD1","UL21_17_VFD1_ENC1","ENC1",null,"UL21_17_ENC1",null,"2025-06-06"]
["UL21_3_VFD1","UL21_3_VFD1_I0","I0",null,"UL21_3_DISC","DISCONNECT AUX"]
["UL21_3_VFD1","UL21_3_VFD1_I1","I1",null,"UL21_3_ENC1","ENCODER"]
["UL21_3_VFD1","UL21_3_VFD1_I2","I2",null,"UL21_3_TPE1","TRACKING PHOTOEYE"]
["UL21_3_VFD1","UL21_3_VFD1_I3","I3",null,"UL21_3_TPE2","TRACKING PHOTOEYE"]
["UL21_3_VFD1","UL21_3_VFD1_IO0","IO0",null,"SPARE"]
["UL21_3_VFD1","UL21_3_VFD1_IO1","IO1",null,"SPARE"]
["UL21_3_VFD1","UL21_3_VFD1_SI0","SI0",null,"UL21_3_EPC1","E-STOP PULLCORD"]
["UL21_3_VFD1","UL21_3_VFD1_SI1","SI1",null,"UL21_3_EPC1_2","E-STOP PULLCORD"]
["UL21_3_VFD1","UL21_3_VFD1_SI2","SI2",null,"UL21_3_EPC2","E-STOP PULLCORD"]
["UL21_3_VFD1","UL21_3_VFD1_SI3","SI3",null,"UL21_3_EPC2_2","E-STOP PULLCORD"]
["UL21_3_VFD1","UL21_3_VFD1_SO0","SO0",null,"UL21_4_BCN2_R","RED BEACON LIGHT"]
["UL21_4_VFD1","UL21_4_VFD1_I0","I0",null,"UL21_4_DISC","DISCONNECT AUX"]
["UL21_4_VFD1","UL21_4_VFD1_I1","I1",null,"UL21_4_ENC1","ENCODER"]
["UL21_4_VFD1","UL21_4_VFD1_I2","I2",null,"UL21_4_TPE1","TRACKING PHOTOEYE"]
["UL21_4_VFD1","UL21_4_VFD1_I3","I3",null,"SPARE"]
["UL21_4_VFD1","UL21_4_VFD1_IO0","IO0",null,"UL21_4_S1_PB","START PUSHBUTTON"]
["UL21_4_VFD1","UL21_4_VFD1_IO1","IO1",null,"UL21_4_S1_PB_LT","START PUSHBUTTON LIGHT"]
["UL21_4_VFD1","UL21_4_VFD1_SI0","SI0",null,"UL21_4_EPC1","E-STOP PULLCORD"]
["UL21_4_VFD1","UL21_4_VFD1_SI1","SI1",null,"UL21_4_EPC1_2","E-STOP PULLCORD"]
["UL21_4_VFD1","UL21_4_VFD1_SI2","SI2",null,"UL21_4_EPC2","E-STOP PULLCORD"]
["UL21_4_VFD1","UL21_4_VFD1_SI3","SI3",null,"UL21_4_EPC2_2","E-STOP PULLCORD"]
["UL21_4_VFD1","UL21_4_VFD1_SO0","SO0",null,"UL21_4_BCN1_R","RED BEACON LIGHT"]
["UL21_5_VFD1","UL21_5_VFD1_I0","I0",null,"UL21_5_DISC","DISCONNECT AUX"]
["UL21_5_VFD1","UL21_5_VFD1_I1","I1",null,"UL21_5_ENC1","ENCODER"]
["UL21_5_VFD1","UL21_5_VFD1_I2","I2",null,"SPARE"]
["UL21_5_VFD1","UL21_5_VFD1_I3","I3",null,"SPARE"]
["UL21_5_VFD1","UL21_5_VFD1_IO0","IO0",null,"UL21_5_JR1_PB","JAM RESET PUSHBUTTON"]
["UL21_5_VFD1","UL21_5_VFD1_IO1","IO1",null,"UL21_5_JR1_PB_LT","JAM RESET PUSHBUTTON LIGHT"]
["UL21_5_VFD1","UL21_5_VFD1_SI0","SI0",null,"SPARE"]
["UL21_5_VFD1","UL21_5_VFD1_SI1","SI1",null,"SPARE"]
["UL21_5_VFD1","UL21_5_VFD1_SI2","SI2",null,"SPARE"]
["UL21_5_VFD1","UL21_5_VFD1_SI3","SI3",null,"SPARE"]
["UL21_5_VFD1","UL21_5_VFD1_SO0","SO0",null,"UL21_5_BCN1_A","AMBER BEACON LIGHT"]
["UL21_6_VFD1","UL21_6_VFD1_I0","I0",null,"UL21_6_DISC","DISCONNECT AUX"]
["UL21_6_VFD1","UL21_6_VFD1_I1","I1",null,"UL21_6_ENC1","ENCODER"]
["UL21_6_VFD1","UL21_6_VFD1_I2","I2",null,"UL21_6_TPE1","TRACKING PHOTOEYE"]
["UL21_6_VFD1","UL21_6_VFD1_I3","I3",null,"UL21_6_TPE2","TRACKING PHOTOEYE"]
["UL21_6_VFD1","UL21_6_VFD1_IO0","IO0",null,"UL21_4_S2_PB","START PUSHBUTTON"]
["UL21_6_VFD1","UL21_6_VFD1_IO1","IO1",null,"UL21_4_S2_PB_LT","START PUSHBUTTON LIGHT"]
["UL21_6_VFD1","UL21_6_VFD1_SI0","SI0",null,"SPARE"]
["UL21_6_VFD1","UL21_6_VFD1_SI1","SI1",null,"SPARE"]
["UL21_6_VFD1","UL21_6_VFD1_SI2","SI2",null,"SPARE"]
["UL21_6_VFD1","UL21_6_VFD1_SI3","SI3",null,"SPARE"]
["UL21_6_VFD1","UL21_6_VFD1_SO0","SO0",null,"SPARE"]
["UL21_7_VFD1","UL21_7_VFD1_I0","I0",null,"UL21_7_DISC","DISCONNECT AUX"]
["UL21_7_VFD1","UL21_7_VFD1_I1","I1",null,"UL21_7_ENC1","ENCODER"]
["UL21_7_VFD1","UL21_7_VFD1_I2","I2",null,"UL21_7_TPE1","TRACKING PHOTOEYE"]
["UL21_7_VFD1","UL21_7_VFD1_I3","I3",null,"SPARE"]
["UL21_7_VFD1","UL21_7_VFD1_IO0","IO0",null,"SPARE"]
["UL21_7_VFD1","UL21_7_VFD1_IO1","IO1",null,"SPARE"]
["UL21_7_VFD1","UL21_7_VFD1_SI0","SI0",null,"SPARE"]
["UL21_7_VFD1","UL21_7_VFD1_SI1","SI1",null,"SPARE"]
["UL21_7_VFD1","UL21_7_VFD1_SI2","SI2",null,"SPARE"]
["UL21_7_VFD1","UL21_7_VFD1_SI3","SI3",null,"SPARE"]
["UL21_7_VFD1","UL21_7_VFD1_SO0","SO0",null,"SPARE"]
["UL21_8_VFD1","UL21_8_VFD1_I0","I0",null,"UL21_8_DISC","DISCONNECT AUX"]
["UL21_8_VFD1","UL21_8_VFD1_I1","I1",null,"UL21_8_ENC1","ENCODER"]
["UL21_8_VFD1","UL21_8_VFD1_I2","I2",null,"UL21_8_TPE1","TRACKING PHOTOEYE"]
["UL21_8_VFD1","UL21_8_VFD1_I3","I3",null,"SPARE"]
["UL21_8_VFD1","UL21_8_VFD1_IO0","IO0",null,"SPARE"]
["UL21_8_VFD1","UL21_8_VFD1_IO1","IO1",null,"SPARE"]
["UL21_8_VFD1","UL21_8_VFD1_SI0","SI0",null,"SPARE"]
["UL21_8_VFD1","UL21_8_VFD1_SI1","SI1",null,"SPARE"]
["UL21_8_VFD1","UL21_8_VFD1_SI2","SI2",null,"SPARE"]
["UL21_8_VFD1","UL21_8_VFD1_SI3","SI3",null,"SPARE"]
["UL21_8_VFD1","UL21_8_VFD1_SO0","SO0",null,"SPARE"]
["UL21_9_VFD1","UL21_9_VFD1_I0","I0",null,"UL21_9_DISC","DISCONNECT AUX"]
["UL21_9_VFD1","UL21_9_VFD1_I1","I1",null,"UL21_9_ENC1","ENCODER"]
["UL21_9_VFD1","UL21_9_VFD1_I2","I2",null,"UL21_9_TPE1","TRACKING PHOTOEYE"]
["UL21_9_VFD1","UL21_9_VFD1_I3","I3",null,"SPARE"]
["UL21_9_VFD1","UL21_9_VFD1_IO0","IO0",null,"SPARE"]
["UL21_9_VFD1","UL21_9_VFD1_IO1","IO1",null,"SPARE"]
["UL21_9_VFD1","UL21_9_VFD1_SI0","SI0",null,"SPARE"]
["UL21_9_VFD1","UL21_9_VFD1_SI1","SI1",null,"SPARE"]
["UL21_9_VFD1","UL21_9_VFD1_SI2","SI2",null,"SPARE"]
["UL21_9_VFD1","UL21_9_VFD1_SI3","SI3",null,"SPARE"]
["UL21_9_VFD1","UL21_9_VFD1_SO0","SO0",null,"SPARE"]
["UL13_2_FIO1","UL13_2_FIO1_IO00","IO00",null,"SPARE"]
["UL13_2_FIO1","UL13_2_FIO1_IO01","IO01",null,"UL13_1_BCN1_R","RED BEACON LIGHT"]
["UL13_2_FIO1","UL13_2_FIO1_IO02","IO02",null,"SPARE"]
["UL13_2_FIO1","UL13_2_FIO1_IO03","IO03",null,"UL13_1_BCN2_R","RED BEACON LIGHT"]
["UL13_2_FIO1","UL13_2_FIO1_IO04","IO04",null,"SPARE"]
["UL13_2_FIO1","UL13_2_FIO1_IO05","IO05",null,"UL13_2_LPE1","LASEREYE"]
["UL13_2_FIO1","UL13_2_FIO1_IO06","IO06",null,"SPARE"]
["UL13_2_FIO1","UL13_2_FIO1_IO07","IO07",null,"UL13_2_LPE2","LASEREYE"]
["UL13_2_FIO1","UL13_2_FIO1_IO08","IO08",null,"SPARE"]
["UL13_2_FIO1","UL13_2_FIO1_IO09","IO09",null,"SPARE"]
["UL13_2_FIO1","UL13_2_FIO1_IO10","IO10",null,"SPARE"]
["UL13_2_FIO1","UL13_2_FIO1_IO11","IO11",null,"SPARE"]
["UL13_2_FIO1","UL13_2_FIO1_IO12","IO12",null,"SPARE"]
["UL13_2_FIO1","UL13_2_FIO1_IO13","IO13",null,"SPARE"]
["UL13_2_FIO1","UL13_2_FIO1_IO14","IO14",null,"SPARE"]
["UL13_2_FIO1","UL13_2_FIO1_IO15","IO15",null,"SPARE"]
["UL14_3_FIO1","UL14_3_FIO1_IO00","IO00",null,"UL14_3_BCN1_R","RED BEACON LIGHT"]
["UL14_3_FIO1","UL14_3_FIO1_IO01","IO01",null,"SPARE"]
["UL14_3_FIO1","UL14_3_FIO1_IO02","IO02",null,"UL14_3_BCN2_R","RED BEACON LIGHT"]
["UL14_3_FIO1","UL14_3_FIO1_IO03","IO03",null,"SPARE"]
["UL14_3_FIO1","UL14_3_FIO1_IO04","IO04",null,"UL14_3_LPE1","LASEREYE"]
["UL14_3_FIO1","UL14_3_FIO1_IO05","IO05",null,"SPARE"]
["UL14_3_FIO1","UL14_3_FIO1_IO06","IO06",null,"UL14_3_LPE2","LASEREYE"]
["UL14_3_FIO1","UL14_3_FIO1_IO07","IO07",null,"SPARE"]
["UL14_3_FIO1","UL14_3_FIO1_IO08","IO08",null,"UL14_3_S1_PB","START PUSHBUTTON"]
["UL14_3_FIO1","UL14_3_FIO1_IO09","IO09",null,"UL14_3_S1_PB_LT","START PUSHBUTTON LIGHT"]
["UL14_3_FIO1","UL14_3_FIO1_IO10","IO10",null,"UL14_3_S2_PB","START PUSHBUTTON"]
["UL14_3_FIO1","UL14_3_FIO1_IO11","IO11",null,"UL14_3_S2_PB_LT","START PUSHBUTTON LIGHT"]
["UL14_3_FIO1","UL14_3_FIO1_IO12","IO12",null,"SPARE"]
["UL14_3_FIO1","UL14_3_FIO1_IO13","IO13",null,"SPARE"]
["UL14_3_FIO1","UL14_3_FIO1_IO14","IO14",null,"SPARE"]
["UL14_3_FIO1","UL14_3_FIO1_IO15","IO15",null,"SPARE"]
["UL15_3_FIO1","UL15_3_FIO1_IO00","IO00",null,"UL15_3_BCN1_R","RED BEACON LIGHT"]
["UL15_3_FIO1","UL15_3_FIO1_IO01","IO01",null,"SPARE"]
["UL15_3_FIO1","UL15_3_FIO1_IO02","IO02",null,"UL15_3_BCN2_R","RED BEACON LIGHT"]
["UL15_3_FIO1","UL15_3_FIO1_IO03","IO03",null,"SPARE"]
["UL15_3_FIO1","UL15_3_FIO1_IO04","IO04",null,"UL15_3_LPE1","LASEREYE"]
["UL15_3_FIO1","UL15_3_FIO1_IO05","IO05",null,"SPARE"]
["UL15_3_FIO1","UL15_3_FIO1_IO06","IO06",null,"UL15_3_LPE2","LASEREYE"]
["UL15_3_FIO1","UL15_3_FIO1_IO07","IO07",null,"SPARE"]
["UL15_3_FIO1","UL15_3_FIO1_IO08","IO08",null,"UL15_3_S1_PB","START PUSHBUTTON"]
["UL15_3_FIO1","UL15_3_FIO1_IO09","IO09",null,"UL15_3_S1_PB_LT","START PUSHBUTTON LIGHT"]
["UL15_3_FIO1","UL15_3_FIO1_IO10","IO10",null,"UL15_3_S2_PB","START PUSHBUTTON"]
["UL15_3_FIO1","UL15_3_FIO1_IO11","IO11",null,"UL15_3_S2_PB_LT","START PUSHBUTTON LIGHT"]
["UL15_3_FIO1","UL15_3_FIO1_IO12","IO12",null,"SPARE"]
["UL15_3_FIO1","UL15_3_FIO1_IO13","IO13",null,"SPARE"]
["UL15_3_FIO1","UL15_3_FIO1_IO14","IO14",null,"SPARE"]
["UL15_3_FIO1","UL15_3_FIO1_IO15","IO15",null,"SPARE"]
["UL16_2_FIO1","UL16_2_FIO1_IO00","IO00",null,"UL16_2_BCN1_R","RED BEACON LIGHT"]
["UL16_2_FIO1","UL16_2_FIO1_IO01","IO01",null,"SPARE"]
["UL16_2_FIO1","UL16_2_FIO1_IO02","IO02",null,"UL16_2_BCN2_R","RED BEACON LIGHT"]
["UL16_2_FIO1","UL16_2_FIO1_IO03","IO03",null,"SPARE"]
["UL16_2_FIO1","UL16_2_FIO1_IO04","IO04",null,"UL16_2_LPE1","LASEREYE"]
["UL16_2_FIO1","UL16_2_FIO1_IO05","IO05",null,"SPARE"]
["UL16_2_FIO1","UL16_2_FIO1_IO06","IO06",null,"UL16_2_LPE2","LASEREYE"]
["UL16_2_FIO1","UL16_2_FIO1_IO07","IO07",null,"SPARE"]
["UL16_2_FIO1","UL16_2_FIO1_IO08","IO08",null,"UL16_2_S1_PB","START PUSHBUTTON"]
["UL16_2_FIO1","UL16_2_FIO1_IO09","IO09",null,"UL16_2_S1_PB_LT","START PUSHBUTTON LIGHT"]
["UL16_2_FIO1","UL16_2_FIO1_IO10","IO10",null,"UL16_2_S2_PB","START PUSHBUTTON"]
["UL16_2_FIO1","UL16_2_FIO1_IO11","IO11",null,"UL16_2_S2_PB_LT","START PUSHBUTTON LIGHT"]
["UL16_2_FIO1","UL16_2_FIO1_IO12","IO12",null,"SPARE"]
["UL16_2_FIO1","UL16_2_FIO1_IO13","IO13",null,"SPARE"]
["UL16_2_FIO1","UL16_2_FIO1_IO14","IO14",null,"SPARE"]
["UL16_2_FIO1","UL16_2_FIO1_IO15","IO15",null,"SPARE"]
["UL17_3_FIO1","UL17_3_FIO1_IO00","IO00",null,"UL17_3_BCN1_R","RED BEACON LIGHT"]
["UL17_3_FIO1","UL17_3_FIO1_IO01","IO01",null,"SPARE"]
["UL17_3_FIO1","UL17_3_FIO1_IO02","IO02",null,"UL17_3_BCN2_R","RED BEACON LIGHT"]
["UL17_3_FIO1","UL17_3_FIO1_IO03","IO03",null,"SPARE"]
["UL17_3_FIO1","UL17_3_FIO1_IO04","IO04",null,"UL17_3_LPE1","LASEREYE"]
["UL17_3_FIO1","UL17_3_FIO1_IO05","IO05",null,"SPARE"]
["UL17_3_FIO1","UL17_3_FIO1_IO06","IO06",null,"UL17_3_LPE2","LASEREYE"]
["UL17_3_FIO1","UL17_3_FIO1_IO07","IO07",null,"SPARE"]
["UL17_3_FIO1","UL17_3_FIO1_IO08","IO08",null,"UL17_3_S1_PB","START PUSHBUTTON"]
["UL17_3_FIO1","UL17_3_FIO1_IO09","IO09",null,"UL17_3_S1_PB_LT","START PUSHBUTTON LIGHT"]
["UL17_3_FIO1","UL17_3_FIO1_IO10","IO10",null,"UL17_3_S2_PB","START PUSHBUTTON"]
["UL17_3_FIO1","UL17_3_FIO1_IO11","IO11",null,"UL17_3_S2_PB_LT","START PUSHBUTTON LIGHT"]
["UL17_3_FIO1","UL17_3_FIO1_IO12","IO12",null,"SPARE"]
["UL17_3_FIO1","UL17_3_FIO1_IO13","IO13",null,"SPARE"]
["UL17_3_FIO1","UL17_3_FIO1_IO14","IO14",null,"SPARE"]
["UL17_3_FIO1","UL17_3_FIO1_IO15","IO15",null,"SPARE"]
["UL18_3_FIO1","UL18_3_FIO1_IO00","IO00",null,"UL18_3_BCN1_R","RED BEACON LIGHT"]
["UL18_3_FIO1","UL18_3_FIO1_IO01","IO01",null,"SPARE"]
["UL18_3_FIO1","UL18_3_FIO1_IO02","IO02",null,"UL18_3_BCN2_R","RED BEACON LIGHT"]
["UL18_3_FIO1","UL18_3_FIO1_IO03","IO03",null,"SPARE"]
["UL18_3_FIO1","UL18_3_FIO1_IO04","IO04",null,"UL18_3_LPE1","LASEREYE"]
["UL18_3_FIO1","UL18_3_FIO1_IO05","IO05",null,"SPARE"]
["UL18_3_FIO1","UL18_3_FIO1_IO06","IO06",null,"UL18_3_LPE2","LASEREYE"]
["UL18_3_FIO1","UL18_3_FIO1_IO07","IO07",null,"SPARE"]
["UL18_3_FIO1","UL18_3_FIO1_IO08","IO08",null,"UL18_3_S1_PB","START PUSHBUTTON"]
["UL18_3_FIO1","UL18_3_FIO1_IO09","IO09",null,"UL18_3_S1_PB_LT","START PUSHBUTTON LIGHT"]
["UL18_3_FIO1","UL18_3_FIO1_IO10","IO10",null,"UL18_3_S2_PB","START PUSHBUTTON"]
["UL18_3_FIO1","UL18_3_FIO1_IO11","IO11",null,"UL18_3_S2_PB_LT","START PUSHBUTTON LIGHT"]
["UL18_3_FIO1","UL18_3_FIO1_IO12","IO12",null,"SPARE"]
["UL18_3_FIO1","UL18_3_FIO1_IO13","IO13",null,"SPARE"]
["UL18_3_FIO1","UL18_3_FIO1_IO14","IO14",null,"SPARE"]
["UL18_3_FIO1","UL18_3_FIO1_IO15","IO15",null,"SPARE"]
["UL19_2_FIO1","UL19_2_FIO1_IO00","IO00",null,"UL19_2_BCN1_R","RED BEACON LIGHT"]
["UL19_2_FIO1","UL19_2_FIO1_IO01","IO01",null,"SPARE"]
["UL19_2_FIO1","UL19_2_FIO1_IO02","IO02",null,"UL19_2_BCN2_R","RED BEACON LIGHT"]
["UL19_2_FIO1","UL19_2_FIO1_IO03","IO03",null,"SPARE"]
["UL19_2_FIO1","UL19_2_FIO1_IO04","IO04",null,"UL19_2_LPE1","LASEREYE"]
["UL19_2_FIO1","UL19_2_FIO1_IO05","IO05",null,"SPARE"]
["UL19_2_FIO1","UL19_2_FIO1_IO06","IO06",null,"UL19_2_LPE2","LASEREYE"]
["UL19_2_FIO1","UL19_2_FIO1_IO07","IO07",null,"SPARE"]
["UL19_2_FIO1","UL19_2_FIO1_IO08","IO08",null,"UL19_2_S1_PB","START PUSHBUTTON"]
["UL19_2_FIO1","UL19_2_FIO1_IO09","IO09",null,"UL19_2_S1_PB_LT","START PUSHBUTTON LIGHT"]
["UL19_2_FIO1","UL19_2_FIO1_IO10","IO10",null,"UL19_2_S2_PB","START PUSHBUTTON"]
["UL19_2_FIO1","UL19_2_FIO1_IO11","IO11",null,"UL19_2_S2_PB_LT","START PUSHBUTTON LIGHT"]
["UL19_2_FIO1","UL19_2_FIO1_IO12","IO12",null,"SPARE"]
["UL19_2_FIO1","UL19_2_FIO1_IO13","IO13",null,"SPARE"]
["UL19_2_FIO1","UL19_2_FIO1_IO14","IO14",null,"SPARE"]
["UL19_2_FIO1","UL19_2_FIO1_IO15","IO15",null,"SPARE"]
["UL20_3_FIO1","UL20_3_FIO1_IO00","IO00",null,"UL20_3_BCN1_R","RED BEACON LIGHT"]
["UL20_3_FIO1","UL20_3_FIO1_IO01","IO01",null,"SPARE"]
["UL20_3_FIO1","UL20_3_FIO1_IO02","IO02",null,"UL20_3_BCN2_R","RED BEACON LIGHT"]
["UL20_3_FIO1","UL20_3_FIO1_IO03","IO03",null,"SPARE"]
["UL20_3_FIO1","UL20_3_FIO1_IO04","IO04",null,"UL20_3_LPE1","LASEREYE"]
["UL20_3_FIO1","UL20_3_FIO1_IO05","IO05",null,"SPARE"]
["UL20_3_FIO1","UL20_3_FIO1_IO06","IO06",null,"UL20_3_LPE2","LASEREYE"]
["UL20_3_FIO1","UL20_3_FIO1_IO07","IO07",null,"SPARE"]
["UL20_3_FIO1","UL20_3_FIO1_IO08","IO08",null,"UL20_3_S1_PB","START PUSHBUTTON"]
["UL20_3_FIO1","UL20_3_FIO1_IO09","IO09",null,"UL20_3_S1_PB_LT","START PUSHBUTTON LIGHT"]
["UL20_3_FIO1","UL20_3_FIO1_IO10","IO10",null,"UL20_3_S2_PB","START PUSHBUTTON"]
["UL20_3_FIO1","UL20_3_FIO1_IO11","IO11",null,"UL20_3_S2_PB_LT","START PUSHBUTTON LIGHT"]
["UL20_3_FIO1","UL20_3_FIO1_IO12","IO12",null,"SPARE"]
["UL20_3_FIO1","UL20_3_FIO1_IO13","IO13",null,"SPARE"]
["UL20_3_FIO1","UL20_3_FIO1_IO14","IO14",null,"SPARE"]
["UL20_3_FIO1","UL20_3_FIO1_IO15","IO15",null,"SPARE"]
["UL21_3_FIO1","UL21_3_FIO1_IO00","IO00",null,"UL21_3_BCN1_R","RED BEACON LIGHT"]
["UL21_3_FIO1","UL21_3_FIO1_IO01","IO01",null,"SPARE"]
["UL21_3_FIO1","UL21_3_FIO1_IO02","IO02",null,"UL21_3_BCN2_R","RED BEACON LIGHT"]
["UL21_3_FIO1","UL21_3_FIO1_IO03","IO03",null,"SPARE"]
["UL21_3_FIO1","UL21_3_FIO1_IO04","IO04",null,"UL21_3_LPE1","LASEREYE"]
["UL21_3_FIO1","UL21_3_FIO1_IO05","IO05",null,"SPARE"]
["UL21_3_FIO1","UL21_3_FIO1_IO06","IO06",null,"UL21_3_LPE2","LASEREYE"]
["UL21_3_FIO1","UL21_3_FIO1_IO07","IO07",null,"SPARE"]
["UL21_3_FIO1","UL21_3_FIO1_IO08","IO08",null,"UL21_3_S1_PB","START PUSHBUTTON"]
["UL21_3_FIO1","UL21_3_FIO1_IO09","IO09",null,"UL21_3_S1_PB_LT","START PUSHBUTTON LIGHT"]
["UL21_3_FIO1","UL21_3_FIO1_IO10","IO10",null,"UL21_3_S2_PB","START PUSHBUTTON"]
["UL21_3_FIO1","UL21_3_FIO1_IO11","IO11",null,"UL21_3_S2_PB_LT","START PUSHBUTTON LIGHT"]
["UL21_3_FIO1","UL21_3_FIO1_IO12","IO12",null,"SPARE"]
["UL21_3_FIO1","UL21_3_FIO1_IO13","IO13",null,"SPARE"]
["UL21_3_FIO1","UL21_3_FIO1_IO14","IO14",null,"SPARE"]
["UL21_3_FIO1","UL21_3_FIO1_IO15","IO15",null,"SPARE"]
["UL13_12_FIO1","IO00","UL13_12_FIO1_IO00","UL13_12_PE1","DEBRIS SENSOR","2025-07-15"]
["UL13_12_FIO1","IO01","UL13_12_FIO1_IO01"]
["UL13_12_FIO1","IO02","UL13_12_FIO1_IO02","UL13_12_PE2","BELT ENGAGEMENT SENSOR"]
["UL13_12_FIO1","IO03","UL13_12_FIO1_IO03"]
["UL13_12_FIO1","IO04","UL13_12_FIO1_IO04","UL13_12_SOL1","DIVERT MODULE"]
["UL13_12_FIO1","O05","UL13_12_FIO1_IO05"]
["UL13_12_FIO1","IO06","UL13_12_FIO1_IO06","UL13_12_SOL2","DIVERT MODULE"]
["UL13_12_FIO1","O07","UL13_12_FIO1_IO07"]
["UL13_12_FIO1","IO08","UL13_12_FIO1_IO08","UL13_12_PE3","ENTRANCE PE"]
["UL13_12_FIO1","IO09","UL13_12_FIO1_IO09"]
["UL13_12_FIO1","IO10","UL13_12_FIO1_IO10","UL13_12_PE4","EXIT PE"]
["UL13_12_FIO1","IO11","UL13_12_FIO1_IO11"]
["UL13_12_FIO1","IO12","UL13_12_FIO1_IO12","UL13_12_SOL3","DIVERT MODULE"]
["UL13_12_FIO1","O13","UL13_12_FIO1_IO13"]
["UL13_12_FIO1","IO14","UL13_12_FIO1_IO14","UL13_12_PE5","DEBRIS SENSOR"]
["UL13_12_FIO1","O15","UL13_12_FIO1_IO15"]
["UL18_16_FIO1","IO00","UL18_16_FIO1_IO00","UL18_16_PE1","DEBRIS SENSOR"]
["UL18_16_FIO1","IO01","UL18_16_FIO1_IO01"]
["UL18_16_FIO1","IO02","UL18_16_FIO1_IO02","UL18_16_PE2","BELT ENGAGEMENT SENSOR"]
["UL18_16_FIO1","IO03","UL18_16_FIO1_IO03"]
["UL18_16_FIO1","IO04","UL18_16_FIO1_IO04","UL18_16_SOL1","DIVERT MODULE"]
["UL18_16_FIO1","O05","UL18_16_FIO1_IO05"]
["UL18_16_FIO1","IO06","UL18_16_FIO1_IO06","UL18_16_SOL2","DIVERT MODULE"]
["UL18_16_FIO1","O07","UL18_16_FIO1_IO07"]
["UL18_16_FIO1","IO08","UL18_16_FIO1_IO08","UL18_16_PE3","ENTRANCE PE"]
["UL18_16_FIO1","IO09","UL18_16_FIO1_IO09"]
["UL18_16_FIO1","IO10","UL18_16_FIO1_IO10","UL18_16_PE4","EXIT PE"]
["UL18_16_FIO1","IO11","UL18_16_FIO1_IO11"]
["UL18_16_FIO1","IO12","UL18_16_FIO1_IO12","UL18_16_SOL3","DIVERT MODULE"]
["UL18_16_FIO1","O13","UL18_16_FIO1_IO13"]
["UL18_16_FIO1","IO14","UL18_16_FIO1_IO14","UL18_16_PE5","DEBRIS SENSOR"]
["UL18_16_FIO1","O15","UL18_16_FIO1_IO15"]
["UL21_17_FIO1","IO00","UL21_17_FIO1_IO00","UL21_17_PE1","DEBRIS SENSOR"]
["UL21_17_FIO1","IO01","UL21_17_FIO1_IO01"]
["UL21_17_FIO1","IO02","UL21_17_FIO1_IO02","UL21_17_PE2","BELT ENGAGEMENT SENSOR"]
["UL21_17_FIO1","IO03","UL21_17_FIO1_IO03"]
["UL21_17_FIO1","IO04","UL21_17_FIO1_IO04","UL21_17_SOL1","DIVERT MODULE"]
["UL21_17_FIO1","O05","UL21_17_FIO1_IO05"]
["UL21_17_FIO1","IO06","UL21_17_FIO1_IO06","UL21_17_SOL2","DIVERT MODULE"]
["UL21_17_FIO1","O07","UL21_17_FIO1_IO07"]
["UL21_17_FIO1","IO08","UL21_17_FIO1_IO08","UL21_17_PE3","ENTRANCE PE"]
["UL21_17_FIO1","IO09","UL21_17_FIO1_IO09"]
["UL21_17_FIO1","IO10","UL21_17_FIO1_IO10","UL21_17_PE4","EXIT PE"]
["UL21_17_FIO1","IO11","UL21_17_FIO1_IO11"]
["UL21_17_FIO1","IO12","UL21_17_FIO1_IO12","UL21_17_SOL3","DIVERT MODULE"]
["UL21_17_FIO1","O13","UL21_17_FIO1_IO13"]
["UL21_17_FIO1","IO14","UL21_17_FIO1_IO14","UL21_17_PE5","DEBRIS SENSOR"]
["UL21_17_FIO1","O15","UL21_17_FIO1_IO15"]
["PDP3_FIO1","IO00","PDP3_FIO1_IO00","PDP3_CB1",null,45814]
["PDP3_FIO1","IO01","PDP3_FIO1_IO01","PDP3_CB2"]
["PDP3_FIO1","IO02","PDP3_FIO1_IO02","PDP3_CB3"]
["PDP3_FIO1","IO03","PDP3_FIO1_IO03","PDP3_CB4"]
["PDP3_FIO1","IO04","PDP3_FIO1_IO04","PDP3_CB5"]
["PDP3_FIO1","O05","PDP3_FIO1_O05"]
["PDP3_FIO1","IO06","PDP3_FIO1_IO06","PDP3_CB6"]
["PDP3_FIO1","O07","PDP3_FIO1_O07"]
["PDP3_FIO1","IO08","PDP3_FIO1_IO08","PDP3_CB7"]
["PDP3_FIO1","IO09","PDP3_FIO1_IO09","PDP3_CB8"]
["PDP3_FIO1","IO10","PDP3_FIO1_IO10","PDP3_CB9"]
["PDP3_FIO1","IO11","PDP3_FIO1_IO11","PDP3_CB10"]
["PDP3_FIO1","IO12","PDP3_FIO1_IO12","PDP3_PWM1"]
["PDP3_FIO1","O13","PDP3_FIO1_O13"]
["PDP3_FIO1","IO14","PDP3_FIO1_IO14","PDP3_FIO1H"]
["PDP3_FIO1","O15","PDP3_FIO1_O15"]
["PDP3_FIOH1","IO00","PDP3_FIOH1_IO00","PDP3_CB11"]
["PDP3_FIOH1","IO01","PDP3_FIOH1_IO01","PDP3_CB12"]
["PDP3_FIOH1","IO02","PDP3_FIOH1_IO02","PDP3_CB13"]
["PDP3_FIOH1","IO03","PDP3_FIOH1_IO03","PDP3_CB14"]
["PDP3_FIOH1","IO04","PDP3_FIOH1_IO04","PDP3_CB15"]
["PDP3_FIOH1","IO05","PDP3_FIOH1_IO05","PDP3_CB16"]
["PDP3_FIOH1","IO06","PDP3_FIOH1_IO06","PDP3_CB17"]
["PDP3_FIOH1","IO07","PDP3_FIOH1_IO07","PDP3_CB18"]
["PDP3_FIOH1","IO08","PDP3_FIOH1_IO08","PDP3_CB19"]
["PDP3_FIOH1","IO09","PDP3_FIOH1_IO09","PDP3_CB20"]
["PDP3_FIOH1","IO10","PDP3_FIOH1_IO10","PDP3_CB21"]
["PDP3_FIOH1","IO11","PDP3_FIOH1_IO11","PDP3_CB22"]
["PDP3_FIOH1","IO12","PDP3_FIOH1_IO12","PDP3_CB23"]
["PDP3_FIOH1","IO13","PDP3_FIOH1_IO13","PDP3_CB24"]
["PDP3_FIOH1","IO14","PDP3_FIOH1_IO14","PDP3_CB25"]
["PDP3_FIOH1","IO15","PDP3_FIOH1_IO15","PDP3_CB26"]
["PDP4_FIO1","IO00","PDP4_FIO1_IO00","PDP4_CB1"]
["PDP4_FIO1","IO01","PDP4_FIO1_IO01","PDP4_CB2"]
["PDP4_FIO1","IO02","PDP4_FIO1_IO02","PDP4_CB3"]
["PDP4_FIO1","IO03","PDP4_FIO1_IO03","PDP4_CB4"]
["PDP4_FIO1","IO04","PDP4_FIO1_IO04","PDP4_CB5"]
["PDP4_FIO1","O05","PDP4_FIO1_O05"]
["PDP4_FIO1","IO06","PDP4_FIO1_IO06","PDP4_CB6"]
["PDP4_FIO1","O07","PDP4_FIO1_O07"]
["PDP4_FIO1","IO08","PDP4_FIO1_IO08","PDP4_CB7"]
["PDP4_FIO1","IO09","PDP4_FIO1_IO09","PDP4_CB8"]
["PDP4_FIO1","IO10","PDP4_FIO1_IO10","PDP4_CB9"]
["PDP4_FIO1","IO11","PDP4_FIO1_IO11","PDP4_CB10"]
["PDP4_FIO1","IO12","PDP4_FIO1_IO12","PDP4_PWM1"]
["PDP4_FIO1","O13","PDP4_FIO1_O13"]
["PDP4_FIO1","IO14","PDP4_FIO1_IO14","PDP4_FIO1H"]
["PDP4_FIO1","O15","PDP4_FIO1_O15"]
["PDP4_FIOH1","IO00","PDP4_FIOH1_IO00","PDP4_CB11"]
["PDP4_FIOH1","IO01","PDP4_FIOH1_IO01","PDP4_CB12"]
["PDP4_FIOH1","IO02","PDP4_FIOH1_IO02","PDP4_CB13"]
["PDP4_FIOH1","IO03","PDP4_FIOH1_IO03","PDP4_CB14"]
["PDP4_FIOH1","IO04","PDP4_FIOH1_IO04","PDP4_CB15"]
["PDP4_FIOH1","IO05","PDP4_FIOH1_IO05","PDP4_CB16"]
["PDP4_FIOH1","IO06","PDP4_FIOH1_IO06","PDP4_CB17"]
["PDP4_FIOH1","IO07","PDP4_FIOH1_IO07","PDP4_CB18"]
["PDP4_FIOH1","IO08","PDP4_FIOH1_IO08","PDP4_CB19"]
["PDP4_FIOH1","IO09","PDP4_FIOH1_IO09","PDP4_CB20"]
["PDP4_FIOH1","IO10","PDP4_FIOH1_IO10","PDP4_CB21"]
["PDP4_FIOH1","IO11","PDP4_FIOH1_IO11","PDP4_CB22"]
["PDP4_FIOH1","IO12","PDP4_FIOH1_IO12","PDP4_CB23"]
["PDP4_FIOH1","IO13","PDP4_FIOH1_IO13","PDP4_CB24"]
["PDP4_FIOH1","IO14","PDP4_FIOH1_IO14","PDP4_CB25"]
["PDP4_FIOH1","IO15","PDP4_FIOH1_IO15","PDP4_CB26"]
["PDP7_FIO1","IO00","PDP7_FIO1_IO00","PDP7_CB1"]
["PDP7_FIO1","IO01","PDP7_FIO1_IO01","PDP7_CB2"]
["PDP7_FIO1","IO02","PDP7_FIO1_IO02","PDP7_CB3"]
["PDP7_FIO1","IO03","PDP7_FIO1_IO03","PDP7_CB4"]
["PDP7_FIO1","IO04","PDP7_FIO1_IO04","PDP7_CB5"]
["PDP7_FIO1","O05","PDP7_FIO1_O05"]
["PDP7_FIO1","IO06","PDP7_FIO1_IO06","PDP7_CB6"]
["PDP7_FIO1","O07","PDP7_FIO1_O07"]
["PDP7_FIO1","IO08","PDP7_FIO1_IO08","PDP7_CB7"]
["PDP7_FIO1","IO09","PDP7_FIO1_IO09","PDP7_CB8"]
["PDP7_FIO1","IO10","PDP7_FIO1_IO10","PDP7_CB9"]
["PDP7_FIO1","IO11","PDP7_FIO1_IO11","PDP7_CB10"]
["PDP7_FIO1","IO12","PDP7_FIO1_IO12","PDP7_PWM1"]
["PDP7_FIO1","O13","PDP7_FIO1_O13"]
["PDP7_FIO1","IO14","PDP7_FIO1_IO14","PDP7_FIO1H"]
["PDP7_FIO1","O15","PDP7_FIO1_O15"]
["PDP7_FIOH1","IO00","PDP7_FIOH1_IO00","PDP7_CB11"]
["PDP7_FIOH1","IO01","PDP7_FIOH1_IO01","PDP7_CB12"]
["PDP7_FIOH1","IO02","PDP7_FIOH1_IO02","PDP7_CB13"]
["PDP7_FIOH1","IO03","PDP7_FIOH1_IO03","PDP7_CB14"]
["PDP7_FIOH1","IO04","PDP7_FIOH1_IO04","PDP7_CB15"]
["PDP7_FIOH1","IO05","PDP7_FIOH1_IO05","PDP7_CB16"]
["PDP7_FIOH1","IO06","PDP7_FIOH1_IO06","PDP7_CB17"]
["PDP7_FIOH1","IO07","PDP7_FIOH1_IO07","PDP7_CB18"]
["PDP7_FIOH1","IO08","PDP7_FIOH1_IO08","PDP7_CB19"]
["PDP7_FIOH1","IO09","PDP7_FIOH1_IO09","PDP7_CB20"]
["PDP7_FIOH1","IO10","PDP7_FIOH1_IO10","PDP7_CB21"]
["PDP7_FIOH1","IO11","PDP7_FIOH1_IO11","PDP7_CB22"]
["PDP7_FIOH1","IO12","PDP7_FIOH1_IO12","PDP7_CB23"]
["PDP7_FIOH1","IO13","PDP7_FIOH1_IO13","PDP7_CB24"]
["PDP7_FIOH1","IO14","PDP7_FIOH1_IO14","PDP7_CB25"]
["PDP7_FIOH1","IO15","PDP7_FIOH1_IO15","PDP7_CB26"]

{"sheet":"DESC_PLC","index":7,"n_rows":1837,"n_cols":4,"rows_kept":1837,"cut":false,"hidden":false,"merged":[]}
["TAGNAME","TERM","DESCA","DESCB"]
["PS5_1_VFD1","I0","PS5_1_DISC","DISCONNECT AUX"]
["PS5_1_VFD1","I1","SPARE"]
["PS5_1_VFD1","I2","SPARE"]
["PS5_1_VFD1","I3","SPARE"]
["PS5_1_VFD1","IO0","PS5_1_S1_PB","START PUSHBUTTON"]
["PS5_1_VFD1","IO1","PS5_1_S1_PB_LT","START PUSHBUTTON LIGHT"]
["PS5_1_VFD1","SI0","PS5_1_EPC1","E-STOP PULLCORD"]
["PS5_1_VFD1","SI1","PS5_1_EPC1_2","E-STOP PULLCORD"]
["PS5_1_VFD1","SI2","PS5_1_EPC2","E-STOP PULLCORD"]
["PS5_1_VFD1","SI3","PS5_1_EPC2_2","E-STOP PULLCORD"]
["PS5_1_VFD1","SO0","PS5_1_BCN1_R","RED BEACON LIGHT"]
["PS5_10_VFD1","I0","PS5_10_DISC","DISCONNECT AUX"]
["PS5_10_VFD1","I1","SPARE"]
["PS5_10_VFD1","I2","PS5_10_TPE1","TRACKING PHOTOEYE"]
["PS5_10_VFD1","I3","PS5_10_TPE2","TRACKING PHOTOEYE"]
["PS5_10_VFD1","IO0","PS5_10_JR1_PB","JAM RESET PUSHBUTTON"]
["PS5_10_VFD1","IO1","PS5_10_JR1_PB_LT","JAM RESET PUSHBUTTON LIGHT"]
["PS5_10_VFD1","SI0","SPARE"]
["PS5_10_VFD1","SI1","SPARE"]
["PS5_10_VFD1","SI2","SPARE"]
["PS5_10_VFD1","SI3","SPARE"]
["PS5_10_VFD1","SO0","SPARE"]
["PS5_11_VFD1","I0","PS5_11_DISC","DISCONNECT AUX"]
["PS5_11_VFD1","I1","SPARE"]
["PS5_11_VFD1","I2","SPARE"]
["PS5_11_VFD1","I3","SPARE"]
["PS5_11_VFD1","IO0","PS5_11_JR1_PB","JAM RESET PUSHBUTTON"]
["PS5_11_VFD1","IO1","PS5_11_JR1_PB_LT","JAM RESET PUSHBUTTON LIGHT"]
["PS5_11_VFD1","SI0","SPARE"]
["PS5_11_VFD1","SI1","SPARE"]
["PS5_11_VFD1","SI2","SPARE"]
["PS5_11_VFD1","SI3","SPARE"]
["PS5_11_VFD1","SO0","PS5_11_BCN1_A","AMBER BEACON LIGHT"]
["PS5_12_VFD1","I0","PS5_12_DISC","DISCONNECT AUX"]
["PS5_12_VFD1","I1","SPARE"]
["PS5_12_VFD1","I2","PS5_12_TPE1","TRACKING PHOTOEYE"]
["PS5_12_VFD1","I3","PS5_12_TPE2","TRACKING PHOTOEYE"]
["PS5_12_VFD1","IO0","SPARE"]
["PS5_12_VFD1","IO1","SPARE"]
["PS5_12_VFD1","SI0","SPARE"]
["PS5_12_VFD1","SI1","SPARE"]
["PS5_12_VFD1","SI2","SPARE"]
["PS5_12_VFD1","SI3","SPARE"]
["PS5_12_VFD1","SO0","SPARE"]
["PS5_13_VFD1","I0","PS5_13_DISC","DISCONNECT AUX"]
["PS5_13_VFD1","I1","SPARE"]
["PS5_13_VFD1","I2","PS5_13_TPE1","TRACKING PHOTOEYE"]
["PS5_13_VFD1","I3","SPARE"]
["PS5_13_VFD1","IO0","SPARE"]
["PS5_13_VFD1","IO1","SPARE"]
["PS5_13_VFD1","SI0","SPARE"]
["PS5_13_VFD1","SI1","SPARE"]
["PS5_13_VFD1","SI2","SPARE"]
["PS5_13_VFD1","SI3","SPARE"]
["PS5_13_VFD1","SO0","SPARE"]
["PS5_2_VFD1","I0","PS5_2_DISC","DISCONNECT AUX"]
["PS5_2_VFD1","I1","SPARE"]
["PS5_2_VFD1","I2","PS5_2_TPE1","TRACKING PHOTOEYE"]
["PS5_2_VFD1","I3","PS5_2_TPE2","TRACKING PHOTOEYE"]
["PS5_2_VFD1","IO0","PS5_1_S2_PB","START PUSHBUTTON"]
["PS5_2_VFD1","IO1","PS5_1_S2_PB_LT","START PUSHBUTTON LIGHT"]
["PS5_2_VFD1","SI0","SPARE"]
["PS5_2_VFD1","SI1","SPARE"]
["PS5_2_VFD1","SI2","SPARE"]
["PS5_2_VFD1","SI3","SPARE"]
["PS5_2_VFD1","SO0","SPARE"]
["PS5_3_VFD1","I0","PS5_3_DISC","DISCONNECT AUX"]
["PS5_3_VFD1","I1","SPARE"]
["PS5_3_VFD1","I2","SPARE"]
["PS5_3_VFD1","I3","SPARE"]
["PS5_3_VFD1","IO0","PS5_2_BCN1_A","AMBER BEACON LIGHT"]
["PS5_3_VFD1","IO1","PS5_2_BCN1_R","RED BEACON LIGHT"]
["PS5_3_VFD1","SI0","SPARE"]
["PS5_3_VFD1","SI1","SPARE"]
["PS5_3_VFD1","SI2","SPARE"]
["PS5_3_VFD1","SI3","SPARE"]
["PS5_3_VFD1","SO0","SPARE"]
["PS5_4_VFD1","I0","PS5_4_DISC","DISCONNECT AUX"]
["PS5_4_VFD1","I1","SPARE"]
["PS5_4_VFD1","I2","PS5_4_TPE1","TRACKING PHOTOEYE"]
["PS5_4_VFD1","I3","PS5_4_TPE2","TRACKING PHOTOEYE"]
["PS5_4_VFD1","IO0","SPARE"]
["PS5_4_VFD1","IO1","SPARE"]
["PS5_4_VFD1","SI0","SPARE"]
["PS5_4_VFD1","SI1","SPARE"]
["PS5_4_VFD1","SI2","SPARE"]
["PS5_4_VFD1","SI3","SPARE"]
["PS5_4_VFD1","SO0","SPARE"]
["PS5_5_VFD1","I0","PS5_5_DISC","DISCONNECT AUX"]
["PS5_5_VFD1","I1","SPARE"]
["PS5_5_VFD1","I2","PS5_5_TPE1","TRACKING PHOTOEYE"]
["PS5_5_VFD1","I3","SPARE"]
["PS5_5_VFD1","IO0","SPARE"]
["PS5_5_VFD1","IO1","SPARE"]
["PS5_5_VFD1","SI0","SPARE"]
["PS5_5_VFD1","SI1","SPARE"]
["PS5_5_VFD1","SI2","SPARE"]
["PS5_5_VFD1","SI3","SPARE"]
["PS5_5_VFD1","SO0","SPARE"]
["PS5_6_VFD1","I0","PS5_6_DISC","DISCONNECT AUX"]
["PS5_6_VFD1","I1","SPARE"]
["PS5_6_VFD1","I2","SPARE"]
["PS5_6_VFD1","I3","SPARE"]
["PS5_6_VFD1","IO0","PS5_6_JR1_PB","JAM RESET PUSHBUTTON"]
["PS5_6_VFD1","IO1","PS5_6_JR1_PB_LT","JAM RESET PUSHBUTTON LIGHT"]
["PS5_6_VFD1","SI0","SPARE"]
["PS5_6_VFD1","SI1","SPARE"]
["PS5_6_VFD1","SI2","SPARE"]
["PS5_6_VFD1","SI3","SPARE"]
["PS5_6_VFD1","SO0","PS5_6_BCN1_A","AMBER BEACON LIGHT"]
["PS5_7_VFD1","I0","PS5_7_DISC","DISCONNECT AUX"]
["PS5_7_VFD1","I1","SPARE"]
["PS5_7_VFD1","I2","PS5_7_TPE1","TRACKING PHOTOEYE"]
["PS5_7_VFD1","I3","SPARE"]
["PS5_7_VFD1","IO0","SPARE"]
["PS5_7_VFD1","IO1","SPARE"]
["PS5_7_VFD1","SI0","SPARE"]
["PS5_7_VFD1","SI1","SPARE"]
["PS5_7_VFD1","SI2","SPARE"]
["PS5_7_VFD1","SI3","SPARE"]
["PS5_7_VFD1","SO0","SPARE"]
["PS5_8_VFD1","I0","PS5_8_DISC","DISCONNECT AUX"]
["PS5_8_VFD1","I1","SPARE"]
["PS5_8_VFD1","I2","PS5_8_TPE1","TRACKING PHOTOEYE"]
["PS5_8_VFD1","I3","PS5_8_TPE2","TRACKING PHOTOEYE"]
["PS5_8_VFD1","IO0","PS5_9_JR2_PB","JAM RESET PUSHBUTTON"]
["PS5_8_VFD1","IO1","PS5_9_JR2_PB_LT","JAM RESET PUSHBUTTON LIGHT"]
["PS5_8_VFD1","SI0","SPARE"]
["PS5_8_VFD1","SI1","SPARE"]
["PS5_8_VFD1","SI2","SPARE"]
["PS5_8_VFD1","SI3","SPARE"]
["PS5_8_VFD1","SO0","SPARE"]
["PS5_9_VFD1","I0","PS5_9_DISC","DISCONNECT AUX"]
["PS5_9_VFD1","I1","SPARE"]
["PS5_9_VFD1","I2","SPARE"]
["PS5_9_VFD1","I3","SPARE"]
["PS5_9_VFD1","IO0","PS5_9_JR1_PB","JAM RESET PUSHBUTTON"]
["PS5_9_VFD1","IO1","PS5_9_JR1_PB_LT","JAM RESET PUSHBUTTON LIGHT"]
["PS5_9_VFD1","SI0","SPARE"]
["PS5_9_VFD1","SI1","SPARE"]
["PS5_9_VFD1","SI2","SPARE"]
["PS5_9_VFD1","SI3","SPARE"]
["PS5_9_VFD1","SO0","PS5_9_BCN1_A","AMBER BEACON LIGHT"]
["PS6_1_VFD1","I0","PS6_1_DISC","DISCONNECT AUX"]
["PS6_1_VFD1","I1","SPARE"]
["PS6_1_VFD1","I2","SPARE"]
["PS6_1_VFD1","I3","SPARE"]
["PS6_1_VFD1","IO0","PS6_1_S1_PB","START PUSHBUTTON"]
["PS6_1_VFD1","IO1","PS6_1_S1_PB_LT","START PUSHBUTTON LIGHT"]
["PS6_1_VFD1","SI0","PS6_1_EPC1","E-STOP PULLCORD"]
["PS6_1_VFD1","SI1","PS6_1_EPC1_2","E-STOP PULLCORD"]
["PS6_1_VFD1","SI2","PS6_1_EPC2","E-STOP PULLCORD"]
["PS6_1_VFD1","SI3","PS6_1_EPC2_2","E-STOP PULLCORD"]
["PS6_1_VFD1","SO0","PS6_1_BCN1_R","RED BEACON LIGHT"]
["PS6_10_VFD1","I0","PS6_10_DISC","DISCONNECT AUX"]
["PS6_10_VFD1","I1","SPARE"]
["PS6_10_VFD1","I2","PS6_10_TPE1","TRACKING PHOTOEYE"]
["PS6_10_VFD1","I3","PS6_10_TPE2","TRACKING PHOTOEYE"]
["PS6_10_VFD1","IO0","SPARE"]
["PS6_10_VFD1","IO1","SPARE"]
["PS6_10_VFD1","SI0","SPARE"]
["PS6_10_VFD1","SI1","SPARE"]
["PS6_10_VFD1","SI2","SPARE"]
["PS6_10_VFD1","SI3","SPARE"]
["PS6_10_VFD1","SO0","SPARE"]
["PS6_11_VFD1","I0","PS6_11_DISC","DISCONNECT AUX"]
["PS6_11_VFD1","I1","SPARE"]
["PS6_11_VFD1","I2","SPARE"]
["PS6_11_VFD1","I3","SPARE"]
["PS6_11_VFD1","IO0","PS6_11_JR1_PB","JAM RESET PUSHBUTTON"]
["PS6_11_VFD1","IO1","PS6_11_JR1_PB_LT","JAM RESET PUSHBUTTON LIGHT"]
["PS6_11_VFD1","SI0","SPARE"]
["PS6_11_VFD1","SI1","SPARE"]
["PS6_11_VFD1","SI2","SPARE"]
["PS6_11_VFD1","SI3","SPARE"]
["PS6_11_VFD1","SO0","PS6_11_BCN1_A","AMBER BEACON LIGHT"]
["PS6_12_VFD1","I0","PS6_12_DISC","DISCONNECT AUX"]
["PS6_12_VFD1","I1","SPARE"]
["PS6_12_VFD1","I2","PS6_12_TPE1","TRACKING PHOTOEYE"]
["PS6_12_VFD1","I3","PS6_12_TPE2","TRACKING PHOTOEYE"]
["PS6_12_VFD1","IO0","SPARE"]
["PS6_12_VFD1","IO1","SPARE"]
["PS6_12_VFD1","SI0","SPARE"]
["PS6_12_VFD1","SI1","SPARE"]
["PS6_12_VFD1","SI2","SPARE"]
["PS6_12_VFD1","SI3","SPARE"]
["PS6_12_VFD1","SO0","SPARE"]
["PS6_13_VFD1","I0","PS6_13_DISC","DISCONNECT AUX"]
["PS6_13_VFD1","I1","SPARE"]
["PS6_13_VFD1","I2","SPARE"]
["PS6_13_VFD1","I3","SPARE"]
["PS6_13_VFD1","IO0","SPARE"]
["PS6_13_VFD1","IO1","SPARE"]
["PS6_13_VFD1","SI0","SPARE"]
["PS6_13_VFD1","SI1","SPARE"]
["PS6_13_VFD1","SI2","SPARE"]
["PS6_13_VFD1","SI3","SPARE"]
["PS6_13_VFD1","SO0","SPARE"]
["PS6_2_VFD1","I0","PS6_2_DISC","DISCONNECT AUX"]
["PS6_2_VFD1","I1","SPARE"]
["PS6_2_VFD1","I2","PS6_2_TPE1","TRACKING PHOTOEYE"]
["PS6_2_VFD1","I3","PS6_2_TPE2","TRACKING PHOTOEYE"]
["PS6_2_VFD1","IO0","PS6_1_S2_PB","START PUSHBUTTON"]
["PS6_2_VFD1","IO1","PS6_1_S2_PB_LT","START PUSHBUTTON LIGHT"]
["PS6_2_VFD1","SI0","SPARE"]
["PS6_2_VFD1","SI1","SPARE"]
["PS6_2_VFD1","SI2","SPARE"]
["PS6_2_VFD1","SI3","SPARE"]
["PS6_2_VFD1","SO0","SPARE"]
["PS6_3_VFD1","I0","PS6_3_DISC","DISCONNECT AUX"]
["PS6_3_VFD1","I1","SPARE"]
["PS6_3_VFD1","I2","SPARE"]
["PS6_3_VFD1","I3","SPARE"]
["PS6_3_VFD1","IO0","PS6_2_BCN2_A","AMBER BEACON LIGHT"]
["PS6_3_VFD1","IO1","PS6_2_BCN2_R","RED BEACON LIGHT"]
["PS6_3_VFD1","SI0","SPARE"]
["PS6_3_VFD1","SI1","SPARE"]
["PS6_3_VFD1","SI2","SPARE"]
["PS6_3_VFD1","SI3","SPARE"]
["PS6_3_VFD1","SO0","SPARE"]
["PS6_4_VFD1","I0","PS6_4_DISC","DISCONNECT AUX"]
["PS6_4_VFD1","I1","SPARE"]
["PS6_4_VFD1","I2","PS6_4_TPE1","TRACKING PHOTOEYE"]
["PS6_4_VFD1","I3","PS6_4_TPE2","TRACKING PHOTOEYE"]
["PS6_4_VFD1","IO0","SPARE"]
["PS6_4_VFD1","IO1","SPARE"]
["PS6_4_VFD1","SI0","SPARE"]
["PS6_4_VFD1","SI1","SPARE"]
["PS6_4_VFD1","SI2","SPARE"]
["PS6_4_VFD1","SI3","SPARE"]
["PS6_4_VFD1","SO0","SPARE"]
["PS6_5_VFD1","I0","PS6_5_DISC","DISCONNECT AUX"]
["PS6_5_VFD1","I1","SPARE"]
["PS6_5_VFD1","I2","PS6_5_TPE1","TRACKING PHOTOEYE"]
["PS6_5_VFD1","I3","SPARE"]
["PS6_5_VFD1","IO0","PS6_6_BCN1_A","AMBER BEACON LIGHT"]
["PS6_5_VFD1","IO1","PS6_6_BCN1_H","ALARM HORN"]
["PS6_5_VFD1","SI0","SPARE"]
["PS6_5_VFD1","SI1","SPARE"]
["PS6_5_VFD1","SI2","SPARE"]
["PS6_5_VFD1","SI3","SPARE"]
["PS6_5_VFD1","SO0","SPARE"]
["PS6_6_VFD1","I0","PS6_6_DISC","DISCONNECT AUX"]
["PS6_6_VFD1","I1","SPARE"]
["PS6_6_VFD1","I2","SPARE"]
["PS6_6_VFD1","I3","SPARE"]
["PS6_6_VFD1","IO0","PS6_6_JR1_PB","JAM RESET PUSHBUTTON"]
["PS6_6_VFD1","IO1","PS6_6_JR1_PB_LT","JAM RESET PUSHBUTTON LIGHT"]
["PS6_6_VFD1","SI0","SPARE"]
["PS6_6_VFD1","SI1","SPARE"]
["PS6_6_VFD1","SI2","SPARE"]
["PS6_6_VFD1","SI3","SPARE"]
["PS6_6_VFD1","SO0","SPARE"]
["PS6_7_VFD1","I0","PS6_7_DISC","DISCONNECT AUX"]
["PS6_7_VFD1","I1","SPARE"]
["PS6_7_VFD1","I2","PS6_7_TPE1","TRACKING PHOTOEYE"]
["PS6_7_VFD1","I3","SPARE"]
["PS6_7_VFD1","IO0","SPARE"]
["PS6_7_VFD1","IO1","SPARE"]
["PS6_7_VFD1","SI0","SPARE"]
["PS6_7_VFD1","SI1","SPARE"]
["PS6_7_VFD1","SI2","SPARE"]
["PS6_7_VFD1","SI3","SPARE"]
["PS6_7_VFD1","SO0","SPARE"]
["PS6_8_VFD1","I0","PS6_8_DISC","DISCONNECT AUX"]
["PS6_8_VFD1","I1","SPARE"]
["PS6_8_VFD1","I2","PS6_8_TPE1","TRACKING PHOTOEYE"]
["PS6_8_VFD1","I3","PS6_8_TPE2","TRACKING PHOTOEYE"]
["PS6_8_VFD1","IO0","PS6_8_JR1_PB","JAM RESET PUSHBUTTON"]
["PS6_8_VFD1","IO1","PS6_8_JR1_PB_LT","JAM RESET PUSHBUTTON LIGHT"]
["PS6_8_VFD1","SI0","SPARE"]
["PS6_8_VFD1","SI1","SPARE"]
["PS6_8_VFD1","SI2","SPARE"]
["PS6_8_VFD1","SI3","SPARE"]
["PS6_8_VFD1","SO0","PS6_8_BCN1_A","AMBER BEACON LIGHT"]
["PS6_9_VFD1","I0","PS6_9_DISC","DISCONNECT AUX"]
["PS6_9_VFD1","I1","SPARE"]
["PS6_9_VFD1","I2","SPARE"]
["PS6_9_VFD1","I3","SPARE"]
["PS6_9_VFD1","IO0","PS6_9_JR1_PB","JAM RESET PUSHBUTTON"]
["PS6_9_VFD1","IO1","PS6_9_JR1_PB_LT","JAM RESET PUSHBUTTON LIGHT"]
["PS6_9_VFD1","SI0","SPARE"]
["PS6_9_VFD1","SI1","SPARE"]
["PS6_9_VFD1","SI2","SPARE"]
["PS6_9_VFD1","SI3","SPARE"]
["PS6_9_VFD1","SO0","SPARE"]
["PS7_1_VFD1","I0","PS7_1_DISC","DISCONNECT AUX"]
["PS7_1_VFD1","I1","SPARE"]
["PS7_1_VFD1","I2","SPARE"]
["PS7_1_VFD1","I3","SPARE"]
["PS7_1_VFD1","IO0","PS7_1_S1_PB","START PUSHBUTTON"]
["PS7_1_VFD1","IO1","PS7_1_S1_PB_LT","START PUSHBUTTON LIGHT"]
["PS7_1_VFD1","SI0","PS7_1_EPC1","E-STOP PULLCORD"]
["PS7_1_VFD1","SI1","PS7_1_EPC1_2","E-STOP PULLCORD"]
["PS7_1_VFD1","SI2","PS7_1_EPC2","E-STOP PULLCORD"]
["PS7_1_VFD1","SI3","PS7_1_EPC2_2","E-STOP PULLCORD"]
["PS7_1_VFD1","SO0","PS7_1_BCN1_R","RED BEACON LIGHT"]
["PS7_10_VFD1","I0","PS7_10_DISC","DISCONNECT AUX"]
["PS7_10_VFD1","I1","SPARE"]
["PS7_10_VFD1","I2","PS7_10_TPE1","TRACKING PHOTOEYE"]
["PS7_10_VFD1","I3","SPARE"]
["PS7_10_VFD1","IO0","PS7_9_S2_PB","START PUSHBUTTON"]
["PS7_10_VFD1","IO1","PS7_9_S2_PB_LT","START PUSHBUTTON LIGHT"]
["PS7_10_VFD1","SI0","SPARE"]
["PS7_10_VFD1","SI1","SPARE"]
["PS7_10_VFD1","SI2","SPARE"]
["PS7_10_VFD1","SI3","SPARE"]
["PS7_10_VFD1","SO0","PS7_9_BCN2_R","RED BEACON LIGHT"]
["PS7_11_VFD1","I0","PS7_11_DISC","DISCONNECT AUX"]
["PS7_11_VFD1","I1","SPARE"]
["PS7_11_VFD1","I2","SPARE"]
["PS7_11_VFD1","I3","SPARE"]
["PS7_11_VFD1","IO0","PS7_11_JR1_PB","JAM RESET PUSHBUTTON"]
["PS7_11_VFD1","IO1","PS7_11_JR1_PB_LT","JAM RESET PUSHBUTTON LIGHT"]
["PS7_11_VFD1","SI0","SPARE"]
["PS7_11_VFD1","SI1","SPARE"]
["PS7_11_VFD1","SI2","SPARE"]
["PS7_11_VFD1","SI3","SPARE"]
["PS7_11_VFD1","SO0","PS7_11_BCN1_A","AMBER BEACON LIGHT"]
["PS7_12_VFD1","I0","PS7_12_DISC","DISCONNECT AUX"]
["PS7_12_VFD1","I1","SPARE"]
["PS7_12_VFD1","I2","PS7_12_TPE1","TRACKING PHOTOEYE"]
["PS7_12_VFD1","I3","PS7_12_TPE2","TRACKING PHOTOEYE"]
["PS7_12_VFD1","IO0","PS7_13_BCN1_A","AMBER BEACON LIGHT"]
["PS7_12_VFD1","IO1","PS7_13_BCN1_H","ALARM HORN"]
["PS7_12_VFD1","SI0","SPARE"]
["PS7_12_VFD1","SI1","SPARE"]
["PS7_12_VFD1","SI2","SPARE"]
["PS7_12_VFD1","SI3","SPARE"]
["PS7_12_VFD1","SO0","SPARE"]
["PS7_13_VFD1","I0","PS7_13_DISC","DISCONNECT AUX"]
["PS7_13_VFD1","I1","SPARE"]
["PS7_13_VFD1","I2","SPARE"]
["PS7_13_VFD1","I3","SPARE"]
["PS7_13_VFD1","IO0","PS7_13_JR1_PB","JAM RESET PUSHBUTTON"]
["PS7_13_VFD1","IO1","PS7_13_JR1_PB_LT","JAM RESET PUSHBUTTON LIGHT"]
["PS7_13_VFD1","SI0","SPARE"]
["PS7_13_VFD1","SI1","SPARE"]
["PS7_13_VFD1","SI2","SPARE"]
["PS7_13_VFD1","SI3","SPARE"]
["PS7_13_VFD1","SO0","SPARE"]
["PS7_14_VFD1","I0","PS7_14_DISC","DISCONNECT AUX"]
["PS7_14_VFD1","I1","SPARE"]
["PS7_14_VFD1","I2","PS7_14_TPE1","TRACKING PHOTOEYE"]
["PS7_14_VFD1","I3","PS7_14_TPE2","TRACKING PHOTOEYE"]
["PS7_14_VFD1","IO0","SPARE"]
["PS7_14_VFD1","IO1","SPARE"]
["PS7_14_VFD1","SI0","SPARE"]
["PS7_14_VFD1","SI1","SPARE"]
["PS7_14_VFD1","SI2","SPARE"]
["PS7_14_VFD1","SI3","SPARE"]
["PS7_14_VFD1","SO0","SPARE"]
["PS7_2_VFD1","I0","PS7_2_DISC","DISCONNECT AUX"]
["PS7_2_VFD1","I1","SPARE"]
["PS7_2_VFD1","I2","PS7_2_TPE1","TRACKING PHOTOEYE"]
["PS7_2_VFD1","I3","PS7_2_TPE2","TRACKING PHOTOEYE"]
["PS7_2_VFD1","IO0","PS7_1_S2_PB","START PUSHBUTTON"]
["PS7_2_VFD1","IO1","PS7_1_S2_PB_LT","START PUSHBUTTON LIGHT"]
["PS7_2_VFD1","SI0","SPARE"]
["PS7_2_VFD1","SI1","SPARE"]
["PS7_2_VFD1","SI2","SPARE"]
["PS7_2_VFD1","SI3","SPARE"]
["PS7_2_VFD1","SO0","SPARE"]
["PS7_3_VFD1","I0","PS7_3_DISC","DISCONNECT AUX"]
["PS7_3_VFD1","I1","SPARE"]
["PS7_3_VFD1","I2","SPARE"]
["PS7_3_VFD1","I3","SPARE"]
["PS7_3_VFD1","IO0","PS7_2_BCN1_A","AMBER BEACON LIGHT"]
["PS7_3_VFD1","IO1","PS7_2_BCN1_R","RED BEACON LIGHT"]
["PS7_3_VFD1","SI0","SPARE"]
["PS7_3_VFD1","SI1","SPARE"]
["PS7_3_VFD1","SI2","SPARE"]
["PS7_3_VFD1","SI3","SPARE"]
["PS7_3_VFD1","SO0","SPARE"]
["PS7_4_VFD1","I0","PS7_4_DISC","DISCONNECT AUX"]
["PS7_4_VFD1","I1","SPARE"]
["PS7_4_VFD1","I2","PS7_4_TPE1","TRACKING PHOTOEYE"]
["PS7_4_VFD1","I3","PS7_4_TPE2","TRACKING PHOTOEYE"]
["PS7_4_VFD1","IO0","SPARE"]
["PS7_4_VFD1","IO1","SPARE"]
["PS7_4_VFD1","SI0","SPARE"]
["PS7_4_VFD1","SI1","SPARE"]
["PS7_4_VFD1","SI2","SPARE"]
["PS7_4_VFD1","SI3","SPARE"]
["PS7_4_VFD1","SO0","SPARE"]
["PS7_5_VFD1","I0","PS7_5_DISC","DISCONNECT AUX"]
["PS7_5_VFD1","I1","SPARE"]
["PS7_5_VFD1","I2","PS7_5_TPE1","TRACKING PHOTOEYE"]
["PS7_5_VFD1","I3","SPARE"]
["PS7_5_VFD1","IO0","SPARE"]
["PS7_5_VFD1","IO1","SPARE"]
["PS7_5_VFD1","SI0","SPARE"]
["PS7_5_VFD1","SI1","SPARE"]
["PS7_5_VFD1","SI2","SPARE"]
["PS7_5_VFD1","SI3","SPARE"]
["PS7_5_VFD1","SO0","SPARE"]
["PS7_6_VFD1","I0","PS7_6_DISC","DISCONNECT AUX"]
["PS7_6_VFD1","I1","SPARE"]
["PS7_6_VFD1","I2","PS7_6_TPE1","TRACKING PHOTOEYE"]
["PS7_6_VFD1","I3","SPARE"]
["PS7_6_VFD1","IO0","SPARE"]
["PS7_6_VFD1","IO1","SPARE"]
["PS7_6_VFD1","SI0","SPARE"]
["PS7_6_VFD1","SI1","SPARE"]
["PS7_6_VFD1","SI2","SPARE"]
["PS7_6_VFD1","SI3","SPARE"]
["PS7_6_VFD1","SO0","SPARE"]
["PS7_7_VFD1","I0","PS7_7_DISC","DISCONNECT AUX"]
["PS7_7_VFD1","I1","SPARE"]
["PS7_7_VFD1","I2","PS7_7_TPE1","TRACKING PHOTOEYE"]
["PS7_7_VFD1","I3","SPARE"]
["PS7_7_VFD1","IO0","SPARE"]
["PS7_7_VFD1","IO1","SPARE"]
["PS7_7_VFD1","SI0","SPARE"]
["PS7_7_VFD1","SI1","SPARE"]
["PS7_7_VFD1","SI2","SPARE"]
["PS7_7_VFD1","SI3","SPARE"]
["PS7_7_VFD1","SO0","SPARE"]
["PS7_8_VFD1","I0","PS7_8_DISC","DISCONNECT AUX"]
["PS7_8_VFD1","I1","SPARE"]
["PS7_8_VFD1","I2","PS7_8_TPE1","TRACKING PHOTOEYE"]
["PS7_8_VFD1","I3","SPARE"]
["PS7_8_VFD1","IO0","SPARE"]
["PS7_8_VFD1","IO1","SPARE"]
["PS7_8_VFD1","SI0","SPARE"]
["PS7_8_VFD1","SI1","SPARE"]
["PS7_8_VFD1","SI2","SPARE"]
["PS7_8_VFD1","SI3","SPARE"]
["PS7_8_VFD1","SO0","SPARE"]
["PS7_9_VFD1","I0","PS7_9_DISC","DISCONNECT AUX"]
["PS7_9_VFD1","I1","SPARE"]
["PS7_9_VFD1","I2","PS7_9_TPE1","TRACKING PHOTOEYE"]
["PS7_9_VFD1","I3","SPARE"]
["PS7_9_VFD1","IO0","PS7_9_S1_PB","START PUSHBUTTON"]
["PS7_9_VFD1","IO1","PS7_9_S1_PB_LT","START PUSHBUTTON LIGHT"]
["PS7_9_VFD1","SI0","PS7_9_EPC1","E-STOP PULLCORD"]
["PS7_9_VFD1","SI1","PS7_9_EPC1_2","E-STOP PULLCORD"]
["PS7_9_VFD1","SI2","PS7_9_EPC2","E-STOP PULLCORD"]
["PS7_9_VFD1","SI3","PS7_9_EPC2_2","E-STOP PULLCORD"]
["PS7_9_VFD1","SO0","PS7_9_BCN1_R","RED BEACON LIGHT"]
["UL13_1_VFD1","I0","UL13_1_DISC","DISCONNECT AUX"]
["UL13_1_VFD1","I1","SPARE"]
["UL13_1_VFD1","I2","UL13_1_TPE1","TRACKING PHOTOEYE"]
["UL13_1_VFD1","I3","UL13_1_SS1_STPB","SS STATION STOP PUSHBUTTON"]
["UL13_1_VFD1","IO0","UL13_1_SS1_SPB","SS STATION START PUSHBUTTON"]
["UL13_1_VFD1","IO1","UL13_1_SS1_SPB_LT","SS STATION START PUSHBUTTON LIGHT"]
["UL13_1_VFD1","SI0","UL13_1_EPC1","E-STOP PULLCORD"]
["UL13_1_VFD1","SI1","UL13_1_EPC1_2","E-STOP PULLCORD"]
["UL13_1_VFD1","SI2","UL13_1_EPC2","E-STOP PULLCORD"]
["UL13_1_VFD1","SI3","UL13_1_EPC2_2","E-STOP PULLCORD"]
["UL13_1_VFD1","SO0","SPARE"]
["UL13_10_VFD1","I0","UL13_10_DISC","DISCONNECT AUX"]
["UL13_10_VFD1","I1","UL13_10_ENC1","ENCODER"]
["UL13_10_VFD1","I2","UL13_10_TPE1","TRACKING PHOTOEYE"]
["UL13_10_VFD1","I3","UL13_10_TPE2","TRACKING PHOTOEYE"]
["UL13_10_VFD1","IO0","SPARE"]
["UL13_10_VFD1","IO1","SPARE"]
["UL13_10_VFD1","SI0","SPARE"]
["UL13_10_VFD1","SI1","SPARE"]
["UL13_10_VFD1","SI2","SPARE"]
["UL13_10_VFD1","SI3","SPARE"]
["UL13_10_VFD1","SO0","SPARE"]
["UL13_11_VFD1","I0","UL13_11_DISC","DISCONNECT AUX"]
["UL13_11_VFD1","I1","UL13_11_ENC1","ENCODER"]
["UL13_11_VFD1","I2","UL13_11_TPE1","TRACKING PHOTOEYE"]
["UL13_11_VFD1","I3","SPARE"]
["UL13_11_VFD1","IO0","SPARE"]
["UL13_11_VFD1","IO1","SPARE"]
["UL13_11_VFD1","SI0","SPARE"]
["UL13_11_VFD1","SI1","SPARE"]
["UL13_11_VFD1","SI2","SPARE"]
["UL13_11_VFD1","SI3","SPARE"]
["UL13_11_VFD1","SO0","SPARE"]
["UL13_12_VFD1","I0","UL13_12_DISC","DISCONNECT AUX"]
["UL13_12_VFD1","I1","SPARE"]
["UL13_12_VFD1","I2","SPARE","UL13_12_ENC1"]
["UL13_12_VFD1","I3","SPARE"]
["UL13_12_VFD1","IO0","SPARE"]
["UL13_12_VFD1","IO1","SPARE"]
["UL13_12_VFD1","SI0","SPARE"]
["UL13_12_VFD1","SI1","SPARE"]
["UL13_12_VFD1","SI2","SPARE"]
["UL13_12_VFD1","SI3","SPARE"]
["UL13_12_VFD1","SO0","SPARE"]
[]
["UL13_2_VFD1","I0","UL13_2_DISC","DISCONNECT AUX"]
["UL13_2_VFD1","I1","SPARE"]
["UL13_2_VFD1","I2","UL13_2_TPE1","TRACKING PHOTOEYE"]
["UL13_2_VFD1","I3","SPARE"]
["UL13_2_VFD1","IO0","SPARE"]
["UL13_2_VFD1","IO1","SPARE"]
["UL13_2_VFD1","SI0","SPARE"]
["UL13_2_VFD1","SI1","SPARE"]
["UL13_2_VFD1","SI2","SPARE"]
["UL13_2_VFD1","SI3","SPARE"]
["UL13_2_VFD1","SO0","SPARE"]
["UL13_3_VFD1","I0","UL13_3_DISC","DISCONNECT AUX"]
["UL13_3_VFD1","I1","SPARE"]
["UL13_3_VFD1","I2","UL13_3_TPE1","TRACKING PHOTOEYE"]
["UL13_3_VFD1","I3","SPARE"]
["UL13_3_VFD1","IO0","SPARE"]
["UL13_3_VFD1","IO1","SPARE"]
["UL13_3_VFD1","SI0","SPARE"]
["UL13_3_VFD1","SI1","SPARE"]
["UL13_3_VFD1","SI2","SPARE"]
["UL13_3_VFD1","SI3","SPARE"]
["UL13_3_VFD1","SO0","SPARE"]
["UL13_4_VFD1","I0","UL13_4_DISC","DISCONNECT AUX"]
["UL13_4_VFD1","I1","UL13_4_ENC1","ENCODER"]
["UL13_4_VFD1","I2","UL13_4_TPE1","TRACKING PHOTOEYE"]
["UL13_4_VFD1","I3","SPARE"]
["UL13_4_VFD1","IO0","UL13_4_S1_PB","START PUSHBUTTON"]
["UL13_4_VFD1","IO1","UL13_4_S1_PB_LT","START PUSHBUTTON LIGHT"]
["UL13_4_VFD1","SI0","UL13_4_EPC1","E-STOP PULLCORD"]
["UL13_4_VFD1","SI1","UL13_4_EPC1_2","E-STOP PULLCORD"]
["UL13_4_VFD1","SI2","UL13_4_EPC2","E-STOP PULLCORD"]
["UL13_4_VFD1","SI3","UL13_4_EPC2_2","E-STOP PULLCORD"]
["UL13_4_VFD1","SO0","UL13_4_BCN1_R","RED BEACON LIGHT"]
["UL13_5_VFD1","I0","UL13_5_DISC","DISCONNECT AUX"]
["UL13_5_VFD1","I1","UL13_5_ENC1","ENCODER"]
["UL13_5_VFD1","I2","UL13_5_TPE1","TRACKING PHOTOEYE"]
["UL13_5_VFD1","I3","SPARE"]
["UL13_5_VFD1","IO0","UL13_4_S2_PB","START PUSHBUTTON"]
["UL13_5_VFD1","IO1","UL13_4_S2_PB_LT","START PUSHBUTTON LIGHT"]
["UL13_5_VFD1","SI0","SPARE"]
["UL13_5_VFD1","SI1","SPARE"]
["UL13_5_VFD1","SI2","SPARE"]
["UL13_5_VFD1","SI3","SPARE"]
["UL13_5_VFD1","SO0","UL13_4_BCN2_R","RED BEACON LIGHT"]
["UL13_6_VFD1","I0","SPARE"]
["UL13_6_VFD1","I1","UL13_6_ENC1","ENCODER"]
["UL13_6_VFD1","I2","UL13_6_TPE1","TRACKING PHOTOEYE"]
["UL13_6_VFD1","I3","SPARE"]
["UL13_6_VFD1","IO0","UL13_8_S2_PB","START PUSHBUTTON"]
["UL13_6_VFD1","IO1","UL13_8_S2_PB_LT","START PUSHBUTTON LIGHT"]
["UL13_6_VFD1","SI0","SPARE"]
["UL13_6_VFD1","SI1","SPARE"]
["UL13_6_VFD1","SI2","SPARE"]
["UL13_6_VFD1","SI3","SPARE"]
["UL13_6_VFD1","SO0","SPARE"]
["UL13_7_VFD1","I0","UL13_7_DISC","DISCONNECT AUX"]
["UL13_7_VFD1","I1","UL13_7_ENC1","ENCODER"]
["UL13_7_VFD1","I2","UL13_7_TPE1","TRACKING PHOTOEYE"]
["UL13_7_VFD1","I3","SPARE"]
["UL13_7_VFD1","IO0","UL13_8_S1_PB","START PUSHBUTTON"]
["UL13_7_VFD1","IO1","UL13_8_S1_PB_LT","START PUSHBUTTON LIGHT"]
["UL13_7_VFD1","SI0","SPARE"]
["UL13_7_VFD1","SI1","SPARE"]
["UL13_7_VFD1","SI2","SPARE"]
["UL13_7_VFD1","SI3","SPARE"]
["UL13_7_VFD1","SO0","SPARE"]
["UL13_8_VFD1","I0","UL13_8_DISC","DISCONNECT AUX"]
["UL13_8_VFD1","I1","UL13_8_ENC1","ENCODER"]
["UL13_8_VFD1","I2","UL13_8_TPE1","TRACKING PHOTOEYE"]
["UL13_8_VFD1","I3","UL13_8_TPE2","TRACKING PHOTOEYE"]
["UL13_8_VFD1","IO0","UL13_8_BCN1_A","AMBER BEACON LIGHT"]
["UL13_8_VFD1","IO1","UL13_8_BCN1_R","RED BEACON LIGHT"]
["UL13_8_VFD1","SI0","UL13_8_EPC1","E-STOP PULLCORD"]
["UL13_8_VFD1","SI1","UL13_8_EPC1_2","E-STOP PULLCORD"]
["UL13_8_VFD1","SI2","UL13_8_EPC2","E-STOP PULLCORD"]
["UL13_8_VFD1","SI3","UL13_8_EPC2_2","E-STOP PULLCORD"]
["UL13_8_VFD1","SO0","UL13_8_BCN2_R","RED BEACON LIGHT"]
["UL13_9A_VFD1","I0","UL13_9A_DISC","DISCONNECT AUX"]
["UL13_9A_VFD1","I1","UL13_8_TPE3","TRACKING PHOTOEYE"]
["UL13_9A_VFD1","I2","UL13_8_TPE4","TRACKING PHOTOEYE"]
["UL13_9A_VFD1","I3","UL13_8_TPE5","TRACKING PHOTOEYE"]
["UL13_9A_VFD1","IO0","UL13_8_JR1_PB","JAM RESET PUSHBUTTON"]
["UL13_9A_VFD1","IO1","UL13_8_JR1_PB_LT","JAM RESET PUSHBUTTON LIGHT"]
["UL13_9A_VFD1","SI0","SPARE"]
["UL13_9A_VFD1","SI1","SPARE"]
["UL13_9A_VFD1","SI2","SPARE"]
["UL13_9A_VFD1","SI3","SPARE"]
["UL13_9A_VFD1","SO0","SPARE"]
["UL13_9B_VFD1","I0","UL13_9B_DISC","DISCONNECT AUX"]
["UL13_9B_VFD1","I1","SPARE"]
["UL13_9B_VFD1","I2","SPARE"]
["UL13_9B_VFD1","I3","SPARE"]
["UL13_9B_VFD1","IO0","UL13_8_JR2_PB","JAM RESET PUSHBUTTON"]
["UL13_9B_VFD1","IO1","UL13_8_JR2_PB_LT","JAM RESET PUSHBUTTON LIGHT"]
["UL13_9B_VFD1","SI0","SPARE"]
["UL13_9B_VFD1","SI1","SPARE"]
["UL13_9B_VFD1","SI2","SPARE"]
["UL13_9B_VFD1","SI3","SPARE"]
["UL13_9B_VFD1","SO0","SPARE"]
["UL14_10_VFD1","I0","UL14_10_DISC","DISCONNECT AUX"]
["UL14_10_VFD1","I1","SPARE"]
["UL14_10_VFD1","I2","SPARE"]
["UL14_10_VFD1","I3","SPARE"]
["UL14_10_VFD1","IO0","SPARE"]
["UL14_10_VFD1","IO1","SPARE"]
["UL14_10_VFD1","SI0","SPARE"]
["UL14_10_VFD1","SI1","SPARE"]
["UL14_10_VFD1","SI2","SPARE"]
["UL14_10_VFD1","SI3","SPARE"]
["UL14_10_VFD1","SO0","SPARE"]
["UL14_3_VFD1","I0","UL14_3_DISC","DISCONNECT AUX"]
["UL14_3_VFD1","I1","UL14_3_ENC1","ENCODER"]
["UL14_3_VFD1","I2","UL14_3_TPE1","TRACKING PHOTOEYE"]
["UL14_3_VFD1","I3","UL14_3_TPE2","TRACKING PHOTOEYE"]
["UL14_3_VFD1","IO0","SPARE"]
["UL14_3_VFD1","IO1","SPARE"]
["UL14_3_VFD1","SI0","UL14_3_EPC1","E-STOP PULLCORD"]
["UL14_3_VFD1","SI1","UL14_3_EPC1_2","E-STOP PULLCORD"]
["UL14_3_VFD1","SI2","UL14_3_EPC2","E-STOP PULLCORD"]
["UL14_3_VFD1","SI3","UL14_3_EPC2_2","E-STOP PULLCORD"]
["UL14_3_VFD1","SO0","UL14_1_STO1","E-STOP OK"]
["UL14_4_VFD1","I0","UL14_4_DISC","DISCONNECT AUX"]
["UL14_4_VFD1","I1","UL14_4_ENC1","ENCODER"]
["UL14_4_VFD1","I2","UL14_4_TPE1","TRACKING PHOTOEYE"]
["UL14_4_VFD1","I3","SPARE"]
["UL14_4_VFD1","IO0","UL14_4_S1_PB","START PUSHBUTTON"]
["UL14_4_VFD1","IO1","UL14_4_S1_PB_LT","START PUSHBUTTON LIGHT"]
["UL14_4_VFD1","SI0","UL14_4_EPC1","E-STOP PULLCORD"]
["UL14_4_VFD1","SI1","UL14_4_EPC1_2","E-STOP PULLCORD"]
["UL14_4_VFD1","SI2","UL14_4_EPC2","E-STOP PULLCORD"]
["UL14_4_VFD1","SI3","UL14_4_EPC2_2","E-STOP PULLCORD"]
["UL14_4_VFD1","SO0","UL14_4_BCN1_R","RED BEACON LIGHT"]
["UL14_5_VFD1","I0","UL14_5_DISC","DISCONNECT AUX"]
["UL14_5_VFD1","I1","UL14_5_ENC1","ENCODER"]
["UL14_5_VFD1","I2","UL14_5_TPE1","TRACKING PHOTOEYE"]
["UL14_5_VFD1","I3","SPARE"]
["UL14_5_VFD1","IO0","UL14_4_S2_PB","START PUSHBUTTON"]
["UL14_5_VFD1","IO1","UL14_4_S2_PB_LT","START PUSHBUTTON LIGHT"]
["UL14_5_VFD1","SI0","SPARE"]
["UL14_5_VFD1","SI1","SPARE"]
["UL14_5_VFD1","SI2","SPARE"]
["UL14_5_VFD1","SI3","SPARE"]
["UL14_5_VFD1","SO0","UL14_4_BCN2_R","RED BEACON LIGHT"]
["UL14_6_VFD1","I0","UL14_6_DISC","DISCONNECT AUX"]
["UL14_6_VFD1","I1","UL14_6_ENC1","ENCODER"]
["UL14_6_VFD1","I2","SPARE"]
["UL14_6_VFD1","I3","SPARE"]
["UL14_6_VFD1","IO0","SPARE"]
["UL14_6_VFD1","IO1","SPARE"]
["UL14_6_VFD1","SI0","SPARE"]
["UL14_6_VFD1","SI1","SPARE"]
["UL14_6_VFD1","SI2","SPARE"]
["UL14_6_VFD1","SI3","SPARE"]
["UL14_6_VFD1","SO0","SPARE"]
["UL14_7_VFD1","I0","UL14_7_DISC","DISCONNECT AUX"]
["UL14_7_VFD1","I1","UL14_7_ENC1","ENCODER"]
["UL14_7_VFD1","I2","UL14_7_TPE1","TRACKING PHOTOEYE"]
["UL14_7_VFD1","I3","UL14_7_TPE2","TRACKING PHOTOEYE"]
["UL14_7_VFD1","IO0","SPARE"]
["UL14_7_VFD1","IO1","SPARE"]
["UL14_7_VFD1","SI0","SPARE"]
["UL14_7_VFD1","SI1","SPARE"]
["UL14_7_VFD1","SI2","SPARE"]
["UL14_7_VFD1","SI3","SPARE"]
["UL14_7_VFD1","SO0","SPARE"]
["UL14_8_VFD1","I0","UL14_8_DISC","DISCONNECT AUX"]
["UL14_8_VFD1","I1","UL14_8_ENC1","ENCODER"]
["UL14_8_VFD1","I2","UL14_8_TPE1","TRACKING PHOTOEYE"]
["UL14_8_VFD1","I3","SPARE"]
["UL14_8_VFD1","IO0","SPARE"]
["UL14_8_VFD1","IO1","SPARE"]
["UL14_8_VFD1","SI0","SPARE"]
["UL14_8_VFD1","SI1","SPARE"]
["UL14_8_VFD1","SI2","SPARE"]
["UL14_8_VFD1","SI3","SPARE"]
["UL14_8_VFD1","SO0","SPARE"]
["UL14_9_VFD1","I0","UL14_9_DISC","DISCONNECT AUX"]
["UL14_9_VFD1","I1","UL14_9_ENC1","ENCODER"]
["UL14_9_VFD1","I2","UL14_9_TPE1","TRACKING PHOTOEYE"]
["UL14_9_VFD1","I3","SPARE"]
["UL14_9_VFD1","IO0","SPARE"]
["UL14_9_VFD1","IO1","SPARE"]
["UL14_9_VFD1","SI0","SPARE"]
["UL14_9_VFD1","SI1","SPARE"]
["UL14_9_VFD1","SI2","SPARE"]
["UL14_9_VFD1","SI3","SPARE"]
["UL14_9_VFD1","SO0","SPARE"]
["UL15_10_VFD1","I0","UL15_10_DISC","DISCONNECT AUX"]
["UL15_10_VFD1","I1","UL15_10_ENC1","ENCODER"]
["UL15_10_VFD1","I2","UL15_10_TPE1","TRACKING PHOTOEYE"]
["UL15_10_VFD1","I3","SPARE"]
["UL15_10_VFD1","IO0","SPARE"]
["UL15_10_VFD1","IO1","SPARE"]
["UL15_10_VFD1","SI0","SPARE"]
["UL15_10_VFD1","SI1","SPARE"]
["UL15_10_VFD1","SI2","SPARE"]
["UL15_10_VFD1","SI3","SPARE"]
["UL15_10_VFD1","SO0","SPARE"]
["UL15_11_VFD1","I0","UL15_11_DISC","DISCONNECT AUX"]
["UL15_11_VFD1","I1","UL15_11_ENC1","ENCODER"]
["UL15_11_VFD1","I2","SPARE"]
["UL15_11_VFD1","I3","SPARE"]
["UL15_11_VFD1","IO0","SPARE"]
["UL15_11_VFD1","IO1","SPARE"]
["UL15_11_VFD1","SI0","SPARE"]
["UL15_11_VFD1","SI1","SPARE"]
["UL15_11_VFD1","SI2","SPARE"]
["UL15_11_VFD1","SI3","SPARE"]
["UL15_11_VFD1","SO0","SPARE"]
["UL15_3_VFD1","I0","UL15_3_DISC","DISCONNECT AUX"]
["UL15_3_VFD1","I1","UL15_3_ENC1","ENCODER"]
["UL15_3_VFD1","I2","UL15_3_TPE1","TRACKING PHOTOEYE"]
["UL15_3_VFD1","I3","UL15_3_TPE2","TRACKING PHOTOEYE"]
["UL15_3_VFD1","IO0","SPARE"]
["UL15_3_VFD1","IO1","SPARE"]
["UL15_3_VFD1","SI0","UL15_3_EPC1","E-STOP PULLCORD"]
["UL15_3_VFD1","SI1","UL15_3_EPC1_2","E-STOP PULLCORD"]
["UL15_3_VFD1","SI2","UL15_3_EPC2","E-STOP PULLCORD"]
["UL15_3_VFD1","SI3","UL15_3_EPC2_2","E-STOP PULLCORD"]
["UL15_3_VFD1","SO0","UL15_1_STO1","E-STOP OK"]
["UL15_4_VFD1","I0","UL15_4_DISC","DISCONNECT AUX"]
["UL15_4_VFD1","I1","UL15_4_ENC1","ENCODER"]
["UL15_4_VFD1","I2","UL15_4_TPE1","TRACKING PHOTOEYE"]
["UL15_4_VFD1","I3","SPARE"]
["UL15_4_VFD1","IO0","UL15_4_S1_PB","START PUSHBUTTON"]
["UL15_4_VFD1","IO1","UL15_4_S1_PB_LT","START PUSHBUTTON LIGHT"]
["UL15_4_VFD1","SI0","UL15_4_EPC1","E-STOP PULLCORD"]
["UL15_4_VFD1","SI1","UL15_4_EPC1_2","E-STOP PULLCORD"]
["UL15_4_VFD1","SI2","UL15_4_EPC2","E-STOP PULLCORD"]
["UL15_4_VFD1","SI3","UL15_4_EPC2_2","E-STOP PULLCORD"]
["UL15_4_VFD1","SO0","UL15_4_BCN1_R","RED BEACON LIGHT"]
["UL15_5_VFD1","I0","UL15_5_DISC","DISCONNECT AUX"]
["UL15_5_VFD1","I1","UL15_5_ENC1","ENCODER"]
["UL15_5_VFD1","I2","SPARE"]
["UL15_5_VFD1","I3","SPARE"]
["UL15_5_VFD1","IO0","UL15_4_S2_PB","START PUSHBUTTON"]
["UL15_5_VFD1","IO1","UL15_4_S2_PB_LT","START PUSHBUTTON LIGHT"]
["UL15_5_VFD1","SI0","SPARE"]
["UL15_5_VFD1","SI1","SPARE"]
["UL15_5_VFD1","SI2","SPARE"]
["UL15_5_VFD1","SI3","SPARE"]
["UL15_5_VFD1","SO0","UL15_4_BCN2_R","RED BEACON LIGHT"]
["UL15_6_VFD1","I0","UL15_6_DISC","DISCONNECT AUX"]
["UL15_6_VFD1","I1","UL15_6_ENC1","ENCODER"]
["UL15_6_VFD1","I2","UL15_6_TPE1","TRACKING PHOTOEYE"]
["UL15_6_VFD1","I3","UL15_6_TPE2","TRACKING PHOTOEYE"]
["UL15_6_VFD1","IO0","SPARE"]
["UL15_6_VFD1","IO1","SPARE"]
["UL15_6_VFD1","SI0","SPARE"]
["UL15_6_VFD1","SI1","SPARE"]
["UL15_6_VFD1","SI2","SPARE"]
["UL15_6_VFD1","SI3","SPARE"]
["UL15_6_VFD1","SO0","SPARE"]
["UL15_7_VFD1","I0","UL15_7_DISC","DISCONNECT AUX"]
["UL15_7_VFD1","I1","UL15_7_ENC1","ENCODER"]
["UL15_7_VFD1","I2","UL15_7_TPE1","TRACKING PHOTOEYE"]
["UL15_7_VFD1","I3","SPARE"]
["UL15_7_VFD1","IO0","SPARE"]
["UL15_7_VFD1","IO1","SPARE"]
["UL15_7_VFD1","SI0","SPARE"]
["UL15_7_VFD1","SI1","SPARE"]
["UL15_7_VFD1","SI2","SPARE"]
["UL15_7_VFD1","SI3","SPARE"]
["UL15_7_VFD1","SO0","SPARE"]
["UL15_8_VFD1","I0","UL15_8_DISC","DISCONNECT AUX"]
["UL15_8_VFD1","I1","UL15_8_ENC1","ENCODER"]
["UL15_8_VFD1","I2","UL15_8_TPE1","TRACKING PHOTOEYE"]
["UL15_8_VFD1","I3","SPARE"]
["UL15_8_VFD1","IO0","SPARE"]
["UL15_8_VFD1","IO1","SPARE"]
["UL15_8_VFD1","SI0","SPARE"]
["UL15_8_VFD1","SI1","SPARE"]
["UL15_8_VFD1","SI2","SPARE"]
["UL15_8_VFD1","SI3","SPARE"]
["UL15_8_VFD1","SO0","SPARE"]
["UL15_9_VFD1","I0","UL15_9_DISC","DISCONNECT AUX"]
["UL15_9_VFD1","I1","UL15_9_ENC1","ENCODER"]
["UL15_9_VFD1","I2","UL15_9_TPE1","TRACKING PHOTOEYE"]
["UL15_9_VFD1","I3","SPARE"]
["UL15_9_VFD1","IO0","SPARE"]
["UL15_9_VFD1","IO1","SPARE"]
["UL15_9_VFD1","SI0","SPARE"]
["UL15_9_VFD1","SI1","SPARE"]
["UL15_9_VFD1","SI2","SPARE"]
["UL15_9_VFD1","SI3","SPARE"]
["UL15_9_VFD1","SO0","SPARE"]
["UL16_1_VFD1","I0","UL16_1_DISC","DISCONNECT AUX"]
["UL16_1_VFD1","I1","SPARE"]
["UL16_1_VFD1","I2","UL16_1_TPE1","TRACKING PHOTOEYE"]
["UL16_1_VFD1","I3","UL16_1_SS1_STPB","SS STATION STOP PUSHBUTTON"]
["UL16_1_VFD1","IO0","UL16_1_SS1_SPB","SS STATION START PUSHBUTTON"]
["UL16_1_VFD1","IO1","UL16_1_SS1_SPB_LT","SS STATION START PUSHBUTTON LIGHT"]
["UL16_1_VFD1","SI0","UL16_1_EPC1","E-STOP PULLCORD"]
["UL16_1_VFD1","SI1","UL16_1_EPC1_2","E-STOP PULLCORD"]
["UL16_1_VFD1","SI2","UL16_1_EPC2","E-STOP PULLCORD"]
["UL16_1_VFD1","SI3","UL16_1_EPC2_2","E-STOP PULLCORD"]
["UL16_1_VFD1","SO0","SPARE"]
["UL16_2_VFD1","I0","UL16_2_DISC","DISCONNECT AUX"]
["UL16_2_VFD1","I1","UL16_2_ENC1","ENCODER"]
["UL16_2_VFD1","I2","UL16_2_TPE1","TRACKING PHOTOEYE"]
["UL16_2_VFD1","I3","UL16_2_TPE2","TRACKING PHOTOEYE"]
["UL16_2_VFD1","IO0","UL16_2_BCN3_R","RED BEACON LIGHT"]
["UL16_2_VFD1","IO1","UL16_2_BCN3_H","ALARM HORN"]
["UL16_2_VFD1","SI0","UL16_2_EPC1","E-STOP PULLCORD"]
["UL16_2_VFD1","SI1","UL16_2_EPC1_2","E-STOP PULLCORD"]
["UL16_2_VFD1","SI2","UL16_2_EPC2","E-STOP PULLCORD"]
["UL16_2_VFD1","SI3","UL16_2_EPC2_2","E-STOP PULLCORD"]
["UL16_2_VFD1","SO0","SPARE"]
["UL16_3_VFD1","I0","UL16_3_DISC","DISCONNECT AUX"]
["UL16_3_VFD1","I1","SPARE"]
["UL16_3_VFD1","I2","UL16_3_TPE1","TRACKING PHOTOEYE"]
["UL16_3_VFD1","I3","UL16_3_TPE2","TRACKING PHOTOEYE"]
["UL16_3_VFD1","IO0","SPARE"]
["UL16_3_VFD1","IO1","SPARE"]
["UL16_3_VFD1","SI0","SPARE"]
["UL16_3_VFD1","SI1","SPARE"]
["UL16_3_VFD1","SI2","SPARE"]
["UL16_3_VFD1","SI3","SPARE"]
["UL16_3_VFD1","SO0","SPARE"]
["UL16_4_VFD1","I0","UL16_4_DISC","DISCONNECT AUX"]
["UL16_4_VFD1","I1","UL16_4_ENC1","ENCODER"]
["UL16_4_VFD1","I2","UL16_4_TPE1","TRACKING PHOTOEYE"]
["UL16_4_VFD1","I3","SPARE"]
["UL16_4_VFD1","IO0","SPARE"]
["UL16_4_VFD1","IO1","SPARE"]
["UL16_4_VFD1","SI0","SPARE"]
["UL16_4_VFD1","SI1","SPARE"]
["UL16_4_VFD1","SI2","SPARE"]
["UL16_4_VFD1","SI3","SPARE"]
["UL16_4_VFD1","SO0","UL16_2_BCN4_R","RED BEACON LIGHT"]
["UL16_5_VFD1","I0","UL16_5_DISC","DISCONNECT AUX"]
["UL16_5_VFD1","I1","UL16_5_ENC1","ENCODER"]
["UL16_5_VFD1","I2","SPARE"]
["UL16_5_VFD1","I3","SPARE"]
["UL16_5_VFD1","IO0","SPARE"]
["UL16_5_VFD1","IO1","SPARE"]
["UL16_5_VFD1","SI0","SPARE"]
["UL16_5_VFD1","SI1","SPARE"]
["UL16_5_VFD1","SI2","SPARE"]
["UL16_5_VFD1","SI3","SPARE"]
["UL16_5_VFD1","SO0","SPARE"]
["UL16_6_VFD1","I0","UL16_6_DISC","DISCONNECT AUX"]
["UL16_6_VFD1","I1","UL16_6_ENC1","ENCODER"]
["UL16_6_VFD1","I2","UL16_6_TPE1","TRACKING PHOTOEYE"]
["UL16_6_VFD1","I3","UL16_6_TPE2","TRACKING PHOTOEYE"]
["UL16_6_VFD1","IO0","SPARE"]
["UL16_6_VFD1","IO1","SPARE"]
["UL16_6_VFD1","SI0","SPARE"]
["UL16_6_VFD1","SI1","SPARE"]
["UL16_6_VFD1","SI2","SPARE"]
["UL16_6_VFD1","SI3","SPARE"]
["UL16_6_VFD1","SO0","SPARE"]
["UL16_7_VFD1","I0","UL16_7_DISC","DISCONNECT AUX"]
["UL16_7_VFD1","I1","UL16_7_ENC1","ENCODER"]
["UL16_7_VFD1","I2","UL16_7_TPE1","TRACKING PHOTOEYE"]
["UL16_7_VFD1","I3","SPARE"]
["UL16_7_VFD1","IO0","SPARE"]
["UL16_7_VFD1","IO1","SPARE"]
["UL16_7_VFD1","SI0","SPARE"]
["UL16_7_VFD1","SI1","SPARE"]
["UL16_7_VFD1","SI2","SPARE"]
["UL16_7_VFD1","SI3","SPARE"]
["UL16_7_VFD1","SO0","SPARE"]
["UL16_8_VFD1","I0","UL16_8_DISC","DISCONNECT AUX"]
["UL16_8_VFD1","I1","UL16_8_ENC1","ENCODER"]
["UL16_8_VFD1","I2","UL16_8_TPE1","TRACKING PHOTOEYE"]
["UL16_8_VFD1","I3","SPARE"]
["UL16_8_VFD1","IO0","SPARE"]
["UL16_8_VFD1","IO1","SPARE"]
["UL16_8_VFD1","SI0","SPARE"]
["UL16_8_VFD1","SI1","SPARE"]
["UL16_8_VFD1","SI2","SPARE"]
["UL16_8_VFD1","SI3","SPARE"]
["UL16_8_VFD1","SO0","SPARE"]
["UL16_9_VFD1","I0","UL16_9_DISC","DISCONNECT AUX"]
["UL16_9_VFD1","I1","SPARE"]
["UL16_9_VFD1","I2","SPARE"]
["UL16_9_VFD1","I3","SPARE"]
["UL16_9_VFD1","IO0","SPARE"]
["UL16_9_VFD1","IO1","SPARE"]
["UL16_9_VFD1","SI0","SPARE"]
["UL16_9_VFD1","SI1","SPARE"]
["UL16_9_VFD1","SI2","SPARE"]
["UL16_9_VFD1","SI3","SPARE"]
["UL16_9_VFD1","SO0","SPARE"]
["UL17_10_VFD1","I0","UL17_10_DISC","DISCONNECT AUX"]
["UL17_10_VFD1","I1","SPARE"]
["UL17_10_VFD1","I2","SPARE"]
["UL17_10_VFD1","I3","SPARE"]
["UL17_10_VFD1","IO0","SPARE"]
["UL17_10_VFD1","IO1","SPARE"]
["UL17_10_VFD1","SI0","SPARE"]
["UL17_10_VFD1","SI1","SPARE"]
["UL17_10_VFD1","SI2","SPARE"]
["UL17_10_VFD1","SI3","SPARE"]
["UL17_10_VFD1","SO0","SPARE"]
["UL17_3_VFD1","I0","UL17_3_DISC","DISCONNECT AUX"]
["UL17_3_VFD1","I1","UL17_3_ENC1","ENCODER"]
["UL17_3_VFD1","I2","UL17_3_TPE1","TRACKING PHOTOEYE"]
["UL17_3_VFD1","I3","SPARE"]
["UL17_3_VFD1","IO0","SPARE"]
["UL17_3_VFD1","IO1","SPARE"]
["UL17_3_VFD1","SI0","UL17_3_EPC1","E-STOP PULLCORD"]
["UL17_3_VFD1","SI1","UL17_3_EPC1_2","E-STOP PULLCORD"]
["UL17_3_VFD1","SI2","UL17_3_EPC2","E-STOP PULLCORD"]
["UL17_3_VFD1","SI3","UL17_3_EPC2_2","E-STOP PULLCORD"]
["UL17_3_VFD1","SO0","UL17_1_STO1","E-STOP OK"]
["UL17_4_VFD1","I0","UL17_4_DISC","DISCONNECT AUX"]
["UL17_4_VFD1","I1","UL17_4_ENC1","ENCODER"]
["UL17_4_VFD1","I2","UL17_4_TPE1","TRACKING PHOTOEYE"]
["UL17_4_VFD1","I3","SPARE"]
["UL17_4_VFD1","IO0","UL17_4_S1_PB","START PUSHBUTTON"]
["UL17_4_VFD1","IO1","UL17_4_S1_PB_LT","START PUSHBUTTON LIGHT"]
["UL17_4_VFD1","SI0","UL17_4_EPC1","E-STOP PULLCORD"]
["UL17_4_VFD1","SI1","UL17_4_EPC1_2","E-STOP PULLCORD"]
["UL17_4_VFD1","SI2","UL17_4_EPC2","E-STOP PULLCORD"]
["UL17_4_VFD1","SI3","UL17_4_EPC2_2","E-STOP PULLCORD"]
["UL17_4_VFD1","SO0","UL17_4_BCN1_R","RED BEACON LIGHT"]
["UL17_5_VFD1","I0","UL17_5_DISC","DISCONNECT AUX"]
["UL17_5_VFD1","I1","UL17_5_ENC1","ENCODER"]
["UL17_5_VFD1","I2","UL17_5_TPE1","TRACKING PHOTOEYE"]
["UL17_5_VFD1","I3","SPARE"]
["UL17_5_VFD1","IO0","UL17_4_S2_PB","START PUSHBUTTON"]
["UL17_5_VFD1","IO1","UL17_4_S2_PB_LT","START PUSHBUTTON LIGHT"]
["UL17_5_VFD1","SI0","SPARE"]
["UL17_5_VFD1","SI1","SPARE"]
["UL17_5_VFD1","SI2","SPARE"]
["UL17_5_VFD1","SI3","SPARE"]
["UL17_5_VFD1","SO0","UL17_4_BCN2_R","RED BEACON LIGHT"]
["UL17_6_VFD1","I0","UL17_6_DISC","DISCONNECT AUX"]
["UL17_6_VFD1","I1","UL17_6_ENC1","ENCODER"]
["UL17_6_VFD1","I2","SPARE"]
["UL17_6_VFD1","I3","SPARE"]
["UL17_6_VFD1","IO0","SPARE"]
["UL17_6_VFD1","IO1","SPARE"]
["UL17_6_VFD1","SI0","SPARE"]
["UL17_6_VFD1","SI1","SPARE"]
["UL17_6_VFD1","SI2","SPARE"]
["UL17_6_VFD1","SI3","SPARE"]
["UL17_6_VFD1","SO0","SPARE"]
["UL17_7_VFD1","I0","UL17_7_DISC","DISCONNECT AUX"]
["UL17_7_VFD1","I1","UL17_7_ENC1","ENCODER"]
["UL17_7_VFD1","I2","UL17_7_TPE1","TRACKING PHOTOEYE"]
["UL17_7_VFD1","I3","UL17_7_TPE2","TRACKING PHOTOEYE"]
["UL17_7_VFD1","IO0","SPARE"]
["UL17_7_VFD1","IO1","SPARE"]
["UL17_7_VFD1","SI0","SPARE"]
["UL17_7_VFD1","SI1","SPARE"]
["UL17_7_VFD1","SI2","SPARE"]
["UL17_7_VFD1","SI3","SPARE"]
["UL17_7_VFD1","SO0","SPARE"]
["UL17_8_VFD1","I0","UL17_8_DISC","DISCONNECT AUX"]
["UL17_8_VFD1","I1","UL17_8_ENC1","ENCODER"]
["UL17_8_VFD1","I2","UL17_8_TPE1","TRACKING PHOTOEYE"]
["UL17_8_VFD1","I3","SPARE"]
["UL17_8_VFD1","IO0","SPARE"]
["UL17_8_VFD1","IO1","SPARE"]
["UL17_8_VFD1","SI0","SPARE"]
["UL17_8_VFD1","SI1","SPARE"]
["UL17_8_VFD1","SI2","SPARE"]
["UL17_8_VFD1","SI3","SPARE"]
["UL17_8_VFD1","SO0","SPARE"]
["UL17_9_VFD1","I0","UL17_9_DISC","DISCONNECT AUX"]
["UL17_9_VFD1","I1","UL17_9_ENC1","ENCODER"]
["UL17_9_VFD1","I2","UL17_9_TPE1","TRACKING PHOTOEYE"]
["UL17_9_VFD1","I3","SPARE"]
["UL17_9_VFD1","IO0","SPARE"]
["UL17_9_VFD1","IO1","SPARE"]
["UL17_9_VFD1","SI0","SPARE"]
["UL17_9_VFD1","SI1","SPARE"]
["UL17_9_VFD1","SI2","SPARE"]
["UL17_9_VFD1","SI3","SPARE"]
["UL17_9_VFD1","SO0","SPARE"]
["UL18_10_VFD1","I0","UL18_10_DISC","DISCONNECT AUX"]
["UL18_10_VFD1","I1","UL18_10_ENC1","ENCODER"]
["UL18_10_VFD1","I2","UL18_10_TPE3","TRACKING PHOTOEYE"]
["UL18_10_VFD1","I3","UL18_10_TPE4","TRACKING PHOTOEYE"]
["UL18_10_VFD1","IO0","UL18_10_JR1_PB","JAM RESET PUSHBUTTON"]
["UL18_10_VFD1","IO1","UL18_10_JR1_PB_LT","JAM RESET PUSHBUTTON LIGHT"]
["UL18_10_VFD1","SI0","UL18_10_EPC1","E-STOP PULLCORD"]
["UL18_10_VFD1","SI1","UL18_10_EPC1_2","E-STOP PULLCORD"]
["UL18_10_VFD1","SI2","UL18_10_EPC2","E-STOP PULLCORD"]
["UL18_10_VFD1","SI3","UL18_10_EPC2_2","E-STOP PULLCORD"]
["UL18_10_VFD1","SO0","UL18_10_BCN2_R","RED BEACON LIGHT"]
["UL18_11_VFD1","I0","UL18_11_DISC","DISCONNECT AUX"]
["UL18_11_VFD1","I1","UL18_11_ENC1","ENCODER"]
["UL18_11_VFD1","I2","UL18_10_TPE5","TRACKING PHOTOEYE"]
["UL18_11_VFD1","I3","SPARE"]
["UL18_11_VFD1","IO0","UL18_10_JR2_PB","JAM RESET PUSHBUTTON"]
["UL18_11_VFD1","IO1","UL18_10_JR2_PB_LT","JAM RESET PUSHBUTTON LIGHT"]
["UL18_11_VFD1","SI0","SPARE"]
["UL18_11_VFD1","SI1","SPARE"]
["UL18_11_VFD1","SI2","SPARE"]
["UL18_11_VFD1","SI3","SPARE"]
["UL18_11_VFD1","SO0","SPARE"]
["UL18_12_VFD1","I0","UL18_12_DISC","DISCONNECT AUX"]
["UL18_12_VFD1","I1","UL18_12_ENC1","ENCODER"]
["UL18_12_VFD1","I2","UL18_12_TPE1","TRACKING PHOTOEYE"]
["UL18_12_VFD1","I3","UL18_12_TPE2","TRACKING PHOTOEYE"]
["UL18_12_VFD1","IO0","UL18_10_BCN1_A","AMBER BEACON LIGHT"]
["UL18_12_VFD1","IO1","UL18_10_BCN1_R","RED BEACON LIGHT"]
["UL18_12_VFD1","SI0","SPARE"]
["UL18_12_VFD1","SI1","SPARE"]
["UL18_12_VFD1","SI2","SPARE"]
["UL18_12_VFD1","SI3","SPARE"]
["UL18_12_VFD1","SO0","SPARE"]
["UL18_13A_VFD1","I0","UL18_13A_DISC","DISCONNECT AUX"]
["UL18_13A_VFD1","I1","SPARE"]
["UL18_13A_VFD1","I2","SPARE"]
["UL18_13A_VFD1","I3","SPARE"]
["UL18_13A_VFD1","IO0","SPARE"]
["UL18_13A_VFD1","IO1","SPARE"]
["UL18_13A_VFD1","SI0","SPARE"]
["UL18_13A_VFD1","SI1","SPARE"]
["UL18_13A_VFD1","SI2","SPARE"]
["UL18_13A_VFD1","SI3","SPARE"]
["UL18_13A_VFD1","SO0","SPARE"]
["UL18_13B_VFD1","I0","UL18_13B_DISC","DISCONNECT AUX"]
["UL18_13B_VFD1","I1","SPARE"]
["UL18_13B_VFD1","I2","SPARE"]
["UL18_13B_VFD1","I3","SPARE"]
["UL18_13B_VFD1","IO0","SPARE"]
["UL18_13B_VFD1","IO1","SPARE"]
["UL18_13B_VFD1","SI0","SPARE"]
["UL18_13B_VFD1","SI1","SPARE"]
["UL18_13B_VFD1","SI2","SPARE"]
["UL18_13B_VFD1","SI3","SPARE"]
["UL18_13B_VFD1","SO0","SPARE"]
["UL18_14_VFD1","I0","UL18_14_DISC","DISCONNECT AUX"]
["UL18_14_VFD1","I1","UL18_14_ENC1","ENCODER"]
["UL18_14_VFD1","I2","UL18_14_TPE1","TRACKING PHOTOEYE"]
["UL18_14_VFD1","I3","UL18_14_TPE2","TRACKING PHOTOEYE"]
["UL18_14_VFD1","IO0","SPARE"]
["UL18_14_VFD1","IO1","SPARE"]
["UL18_14_VFD1","SI0","SPARE"]
["UL18_14_VFD1","SI1","SPARE"]
["UL18_14_VFD1","SI2","SPARE"]
["UL18_14_VFD1","SI3","SPARE"]
["UL18_14_VFD1","SO0","SPARE"]
["UL18_15_VFD1","I0","UL18_15_DISC","DISCONNECT AUX"]
["UL18_15_VFD1","I1","UL18_15_ENC1","ENCODER"]
["UL18_15_VFD1","I2","UL18_15_TPE1","TRACKING PHOTOEYE"]
["UL18_15_VFD1","I3","SPARE"]
["UL18_15_VFD1","IO0","SPARE"]
["UL18_15_VFD1","IO1","SPARE"]
["UL18_15_VFD1","SI0","SPARE"]
["UL18_15_VFD1","SI1","SPARE"]
["UL18_15_VFD1","SI2","SPARE"]
["UL18_15_VFD1","SI3","SPARE"]
["UL18_15_VFD1","SO0","SPARE"]
["UL18_16_VFD1","I0","UL18_16_DISC","DISCONNECT AUX"]
["UL18_16_VFD1","I1","SPARE"]
["UL18_16_VFD1","I2","SPARE","UL18_16_ENC1"]
["UL18_16_VFD1","I3","SPARE"]
["UL18_16_VFD1","IO0","SPARE"]
["UL18_16_VFD1","IO1","SPARE"]
["UL18_16_VFD1","SI0","SPARE"]
["UL18_16_VFD1","SI1","SPARE"]
["UL18_16_VFD1","SI2","SPARE"]
["UL18_16_VFD1","SI3","SPARE"]
["UL18_16_VFD1","SO0","SPARE"]
[]
["UL18_3_VFD1","I0","UL18_3_DISC","DISCONNECT AUX"]
["UL18_3_VFD1","I1","UL18_3_ENC1","ENCODER"]
["UL18_3_VFD1","I2","UL18_3_TPE1","TRACKING PHOTOEYE"]
["UL18_3_VFD1","I3","UL18_3_TPE2","TRACKING PHOTOEYE"]
["UL18_3_VFD1","IO0","SPARE"]
["UL18_3_VFD1","IO1","SPARE"]
["UL18_3_VFD1","SI0","UL18_3_EPC1","E-STOP PULLCORD"]
["UL18_3_VFD1","SI1","UL18_3_EPC1_2","E-STOP PULLCORD"]
["UL18_3_VFD1","SI2","UL18_3_EPC2","E-STOP PULLCORD"]
["UL18_3_VFD1","SI3","UL18_3_EPC2_2","E-STOP PULLCORD"]
["UL18_3_VFD1","SO0","UL18_1_STO1","E-STOP OK"]
["UL18_4_VFD1","I0","UL18_4_DISC","DISCONNECT AUX"]
["UL18_4_VFD1","I1","UL18_4_ENC1","ENCODER"]
["UL18_4_VFD1","I2","UL18_4_TPE1","TRACKING PHOTOEYE"]
["UL18_4_VFD1","I3","SPARE"]
["UL18_4_VFD1","IO0","UL18_4_S1_PB","START PUSHBUTTON"]
["UL18_4_VFD1","IO1","UL18_4_S1_PB_LT","START PUSHBUTTON LIGHT"]
["UL18_4_VFD1","SI0","UL18_4_EPC1","E-STOP PULLCORD"]
["UL18_4_VFD1","SI1","UL18_4_EPC1_2","E-STOP PULLCORD"]
["UL18_4_VFD1","SI2","UL18_4_EPC2","E-STOP PULLCORD"]
["UL18_4_VFD1","SI3","UL18_4_EPC2_2","E-STOP PULLCORD"]
["UL18_4_VFD1","SO0","UL18_4_BCN1_R","RED BEACON LIGHT"]
["UL18_5_VFD1","I0","UL18_5_DISC","DISCONNECT AUX"]
["UL18_5_VFD1","I1","UL18_5_ENC1","ENCODER"]
["UL18_5_VFD1","I2","UL18_5_TPE1","TRACKING PHOTOEYE"]
["UL18_5_VFD1","I3","SPARE"]
["UL18_5_VFD1","IO0","UL18_4_S2_PB","START PUSHBUTTON"]
["UL18_5_VFD1","IO1","UL18_4_S2_PB_LT","START PUSHBUTTON LIGHT"]
["UL18_5_VFD1","SI0","SPARE"]
["UL18_5_VFD1","SI1","SPARE"]
["UL18_5_VFD1","SI2","SPARE"]
["UL18_5_VFD1","SI3","SPARE"]
["UL18_5_VFD1","SO0","UL18_4_BCN2_R","RED BEACON LIGHT"]
["UL18_6_VFD1","I0","UL18_6_DISC","DISCONNECT AUX"]
["UL18_6_VFD1","I1","UL18_6_ENC1","ENCODER"]
["UL18_6_VFD1","I2","SPARE"]
["UL18_6_VFD1","I3","SPARE"]
["UL18_6_VFD1","IO0","UL18_10_S2_PB","START PUSHBUTTON"]
["UL18_6_VFD1","IO1","UL18_10_S2_PB_LT","START PUSHBUTTON LIGHT"]
["UL18_6_VFD1","SI0","SPARE"]
["UL18_6_VFD1","SI1","SPARE"]
["UL18_6_VFD1","SI2","SPARE"]
["UL18_6_VFD1","SI3","SPARE"]
["UL18_6_VFD1","SO0","SPARE"]
["UL18_7_VFD1","I0","UL18_7_DISC","DISCONNECT AUX"]
["UL18_7_VFD1","I1","UL18_7_ENC1","ENCODER"]
["UL18_7_VFD1","I2","UL18_7_TPE1","TRACKING PHOTOEYE"]
["UL18_7_VFD1","I3","UL18_7_TPE2","TRACKING PHOTOEYE"]
["UL18_7_VFD1","IO0","UL18_10_JR3_PB","JAM RESET PUSHBUTTON"]
["UL18_7_VFD1","IO1","UL18_10_JR3_PB_LT","JAM RESET PUSHBUTTON LIGHT"]
["UL18_7_VFD1","SI0","SPARE"]
["UL18_7_VFD1","SI1","SPARE"]
["UL18_7_VFD1","SI2","SPARE"]
["UL18_7_VFD1","SI3","SPARE"]
["UL18_7_VFD1","SO0","SPARE"]
["UL18_8_VFD1","I0","UL18_8_DISC","DISCONNECT AUX"]
["UL18_8_VFD1","I1","UL18_8_ENC1","ENCODER"]
["UL18_8_VFD1","I2","UL18_8_TPE1","TRACKING PHOTOEYE"]
["UL18_8_VFD1","I3","SPARE"]
["UL18_8_VFD1","IO0","UL18_10_TPE1","TRACKING PHOTOEYE"]
["UL18_8_VFD1","IO1","UL18_10_TPE2","TRACKING PHOTOEYE"]
["UL18_8_VFD1","SI0","SPARE"]
["UL18_8_VFD1","SI1","SPARE"]
["UL18_8_VFD1","SI2","SPARE"]
["UL18_8_VFD1","SI3","SPARE"]
["UL18_8_VFD1","SO0","SPARE"]
["UL18_9_VFD1","I0","UL18_9_DISC","DISCONNECT AUX"]
["UL18_9_VFD1","I1","UL18_9_ENC1","ENCODER"]
["UL18_9_VFD1","I2","UL18_9_TPE1","TRACKING PHOTOEYE"]
["UL18_9_VFD1","I3","UL18_10_S1_PB","START PUSHBUTTON"]
["UL18_9_VFD1","IO0","UL18_10_S1_PB_LT","START PUSHBUTTON LIGHT"]
["UL18_9_VFD1","IO1","SPARE"]
["UL18_9_VFD1","SI0","SPARE"]
["UL18_9_VFD1","SI1","SPARE"]
["UL18_9_VFD1","SI2","SPARE"]
["UL18_9_VFD1","SI3","SPARE"]
["UL18_9_VFD1","SO0","SPARE"]
["UL19_1_VFD1","I0","UL19_1_DISC","DISCONNECT AUX"]
["UL19_1_VFD1","I1","SPARE"]
["UL19_1_VFD1","I2","UL19_1_TPE1","TRACKING PHOTOEYE"]
["UL19_1_VFD1","I3","UL19_1_SS1_STPB","SS STATION STOP PUSHBUTTON"]
["UL19_1_VFD1","IO0","UL19_1_SS1_SPB","SS STATION START PUSHBUTTON"]
["UL19_1_VFD1","IO1","UL19_1_SS1_SPB_LT","SS STATION START PUSHBUTTON LIGHT"]
["UL19_1_VFD1","SI0","UL19_1_EPC1","E-STOP PULLCORD"]
["UL19_1_VFD1","SI1","UL19_1_EPC1_2","E-STOP PULLCORD"]
["UL19_1_VFD1","SI2","UL19_1_EPC2","E-STOP PULLCORD"]
["UL19_1_VFD1","SI3","UL19_1_EPC2_2","E-STOP PULLCORD"]
["UL19_1_VFD1","SO0","UL19_1_BCN1_R","RED BEACON LIGHT"]
["UL19_2_VFD1","I0","UL19_2_DISC","DISCONNECT AUX"]
["UL19_2_VFD1","I1","UL19_2_ENC1","ENCODER"]
["UL19_2_VFD1","I2","UL19_2_TPE1","TRACKING PHOTOEYE"]
["UL19_2_VFD1","I3","UL19_2_TPE2","TRACKING PHOTOEYE"]
["UL19_2_VFD1","IO0","SPARE"]
["UL19_2_VFD1","IO1","SPARE"]
["UL19_2_VFD1","SI0","UL19_2_EPC1","E-STOP PULLCORD"]
["UL19_2_VFD1","SI1","UL19_2_EPC1_2","E-STOP PULLCORD"]
["UL19_2_VFD1","SI2","UL19_2_EPC2","E-STOP PULLCORD"]
["UL19_2_VFD1","SI3","UL19_2_EPC2_2","E-STOP PULLCORD"]
["UL19_2_VFD1","SO0","UL19_1_BCN2_R","RED BEACON LIGHT"]
["UL19_3_VFD1","I0","UL19_3_DISC","DISCONNECT AUX"]
["UL19_3_VFD1","I1","UL19_3_ENC1","ENCODER"]
["UL19_3_VFD1","I2","SPARE"]
["UL19_3_VFD1","I3","SPARE"]
["UL19_3_VFD1","IO0","SPARE"]
["UL19_3_VFD1","IO1","SPARE"]
["UL19_3_VFD1","SI0","SPARE"]
["UL19_3_VFD1","SI1","SPARE"]
["UL19_3_VFD1","SI2","SPARE"]
["UL19_3_VFD1","SI3","SPARE"]
["UL19_3_VFD1","SO0","SPARE"]
["UL19_4_VFD1","I0","UL19_4_DISC","DISCONNECT AUX"]
["UL19_4_VFD1","I1","UL19_4_ENC1","ENCODER"]
["UL19_4_VFD1","I2","UL19_4_TPE1","TRACKING PHOTOEYE"]
["UL19_4_VFD1","I3","UL19_4_TPE2","TRACKING PHOTOEYE"]
["UL19_4_VFD1","IO0","SPARE"]
["UL19_4_VFD1","IO1","SPARE"]
["UL19_4_VFD1","SI0","SPARE"]
["UL19_4_VFD1","SI1","SPARE"]
["UL19_4_VFD1","SI2","SPARE"]
["UL19_4_VFD1","SI3","SPARE"]
["UL19_4_VFD1","SO0","SPARE"]
["UL19_5_VFD1","I0","UL19_5_DISC","DISCONNECT AUX"]
["UL19_5_VFD1","I1","UL19_5_ENC1","ENCODER"]
["UL19_5_VFD1","I2","UL19_5_TPE1","TRACKING PHOTOEYE"]
["UL19_5_VFD1","I3","SPARE"]
["UL19_5_VFD1","IO0","SPARE"]
["UL19_5_VFD1","IO1","SPARE"]
["UL19_5_VFD1","SI0","SPARE"]
["UL19_5_VFD1","SI1","SPARE"]
["UL19_5_VFD1","SI2","SPARE"]
["UL19_5_VFD1","SI3","SPARE"]
["UL19_5_VFD1","SO0","SPARE"]
["UL19_6_VFD1","I0","UL19_6_DISC","DISCONNECT AUX"]
["UL19_6_VFD1","I1","UL19_6_ENC1","ENCODER"]
["UL19_6_VFD1","I2","UL19_6_TPE1","TRACKING PHOTOEYE"]
["UL19_6_VFD1","I3","SPARE"]
["UL19_6_VFD1","IO0","SPARE"]
["UL19_6_VFD1","IO1","SPARE"]
["UL19_6_VFD1","SI0","SPARE"]
["UL19_6_VFD1","SI1","SPARE"]
["UL19_6_VFD1","SI2","SPARE"]
["UL19_6_VFD1","SI3","SPARE"]
["UL19_6_VFD1","SO0","SPARE"]
["UL19_7_VFD1","I0","UL19_7_DISC","DISCONNECT AUX"]
["UL19_7_VFD1","I1","UL19_7_ENC1","ENCODER"]
["UL19_7_VFD1","I2","UL19_7_TPE1","TRACKING PHOTOEYE"]
["UL19_7_VFD1","I3","SPARE"]
["UL19_7_VFD1","IO0","SPARE"]
["UL19_7_VFD1","IO1","SPARE"]
["UL19_7_VFD1","SI0","SPARE"]
["UL19_7_VFD1","SI1","SPARE"]
["UL19_7_VFD1","SI2","SPARE"]
["UL19_7_VFD1","SI3","SPARE"]
["UL19_7_VFD1","SO0","SPARE"]
["UL19_8_VFD1","I0","UL19_8_DISC","DISCONNECT AUX"]
["UL19_8_VFD1","I1","UL19_8_ENC1","ENCODER"]
["UL19_8_VFD1","I2","UL19_8_TPE1","TRACKING PHOTOEYE"]
["UL19_8_VFD1","I3","SPARE"]
["UL19_8_VFD1","IO0","SPARE"]
["UL19_8_VFD1","IO1","SPARE"]
["UL19_8_VFD1","SI0","SPARE"]
["UL19_8_VFD1","SI1","SPARE"]
["UL19_8_VFD1","SI2","SPARE"]
["UL19_8_VFD1","SI3","SPARE"]
["UL19_8_VFD1","SO0","SPARE"]
["UL19_9_VFD1","I0","UL19_9_DISC","DISCONNECT AUX"]
["UL19_9_VFD1","I1","SPARE"]
["UL19_9_VFD1","I2","SPARE"]
["UL19_9_VFD1","I3","SPARE"]
["UL19_9_VFD1","IO0","SPARE"]
["UL19_9_VFD1","IO1","SPARE"]
["UL19_9_VFD1","SI0","SPARE"]
["UL19_9_VFD1","SI1","SPARE"]
["UL19_9_VFD1","SI2","SPARE"]
["UL19_9_VFD1","SI3","SPARE"]
["UL19_9_VFD1","SO0","SPARE"]
["UL20_10_VFD1","I0","UL20_10_DISC","DISCONNECT AUX"]
["UL20_10_VFD1","I1","UL20_10_ENC1","ENCODER"]
["UL20_10_VFD1","I2","UL20_10_TPE1","TRACKING PHOTOEYE"]
["UL20_10_VFD1","I3","SPARE"]
["UL20_10_VFD1","IO0","SPARE"]
["UL20_10_VFD1","IO1","SPARE"]
["UL20_10_VFD1","SI0","SPARE"]
["UL20_10_VFD1","SI1","SPARE"]
["UL20_10_VFD1","SI2","SPARE"]
["UL20_10_VFD1","SI3","SPARE"]
["UL20_10_VFD1","SO0","SPARE"]
["UL20_11_VFD1","I0","UL20_11_DISC","DISCONNECT AUX"]
["UL20_11_VFD1","I1","SPARE"]
["UL20_11_VFD1","I2","SPARE"]
["UL20_11_VFD1","I3","SPARE"]
["UL20_11_VFD1","IO0","SPARE"]
["UL20_11_VFD1","IO1","SPARE"]
["UL20_11_VFD1","SI0","SPARE"]
["UL20_11_VFD1","SI1","SPARE"]
["UL20_11_VFD1","SI2","SPARE"]
["UL20_11_VFD1","SI3","SPARE"]
["UL20_11_VFD1","SO0","SPARE"]
["UL20_3_VFD1","I0","UL20_3_DISC","DISCONNECT AUX"]
["UL20_3_VFD1","I1","UL20_3_ENC1","ENCODER"]
["UL20_3_VFD1","I2","UL20_3_TPE1","TRACKING PHOTOEYE"]
["UL20_3_VFD1","I3","UL20_3_TPE2","TRACKING PHOTOEYE"]
["UL20_3_VFD1","IO0","SPARE"]
["UL20_3_VFD1","IO1","SPARE"]
["UL20_3_VFD1","SI0","UL20_3_EPC1","E-STOP PULLCORD"]
["UL20_3_VFD1","SI1","UL20_3_EPC1_2","E-STOP PULLCORD"]
["UL20_3_VFD1","SI2","UL20_3_EPC2","E-STOP PULLCORD"]
["UL20_3_VFD1","SI3","UL20_3_EPC2_2","E-STOP PULLCORD"]
["UL20_3_VFD1","SO0","UL20_1_STO1","E-STOP OK"]
["UL20_4_VFD1","I0","UL20_4_DISC","DISCONNECT AUX"]
["UL20_4_VFD1","I1","UL20_4_ENC1","ENCODER"]
["UL20_4_VFD1","I2","UL20_4_TPE1","TRACKING PHOTOEYE"]
["UL20_4_VFD1","I3","SPARE"]
["UL20_4_VFD1","IO0","UL20_4_S1_PB","START PUSHBUTTON"]
["UL20_4_VFD1","IO1","UL20_4_S1_PB_LT","START PUSHBUTTON LIGHT"]
["UL20_4_VFD1","SI0","UL20_4_EPC1","E-STOP PULLCORD"]
["UL20_4_VFD1","SI1","UL20_4_EPC1_2","E-STOP PULLCORD"]
["UL20_4_VFD1","SI2","UL20_4_EPC2","E-STOP PULLCORD"]
["UL20_4_VFD1","SI3","UL20_4_EPC2_2","E-STOP PULLCORD"]
["UL20_4_VFD1","SO0","UL20_4_BCN1_R","RED BEACON LIGHT"]
["UL20_5_VFD1","I0","UL20_5_DISC","DISCONNECT AUX"]
["UL20_5_VFD1","I1","UL20_5_ENC1","ENCODER"]
["UL20_5_VFD1","I2","SPARE"]
["UL20_5_VFD1","I3","SPARE"]
["UL20_5_VFD1","IO0","UL20_4_S2_PB","START PUSHBUTTON"]
["UL20_5_VFD1","IO1","UL20_4_S2_PB_LT","START PUSHBUTTON LIGHT"]
["UL20_5_VFD1","SI0","SPARE"]
["UL20_5_VFD1","SI1","SPARE"]
["UL20_5_VFD1","SI2","SPARE"]
["UL20_5_VFD1","SI3","SPARE"]
["UL20_5_VFD1","SO0","SPARE"]
["UL20_6_VFD1","I0","UL20_6_DISC","DISCONNECT AUX"]
["UL20_6_VFD1","I1","UL20_6_ENC1","ENCODER"]
["UL20_6_VFD1","I2","UL20_6_TPE1","TRACKING PHOTOEYE"]
["UL20_6_VFD1","I3","UL20_6_TPE2","TRACKING PHOTOEYE"]
["UL20_6_VFD1","IO0","UL20_4_BCN2_R","RED BEACON LIGHT"]
["UL20_6_VFD1","IO1","UL20_4_BCN2_H","ALARM HORN"]
["UL20_6_VFD1","SI0","SPARE"]
["UL20_6_VFD1","SI1","SPARE"]
["UL20_6_VFD1","SI2","SPARE"]
["UL20_6_VFD1","SI3","SPARE"]
["UL20_6_VFD1","SO0","SPARE"]
["UL20_7_VFD1","I0","UL20_7_DISC","DISCONNECT AUX"]
["UL20_7_VFD1","I1","UL20_7_ENC1","ENCODER"]
["UL20_7_VFD1","I2","UL20_7_TPE1","TRACKING PHOTOEYE"]
["UL20_7_VFD1","I3","SPARE"]
["UL20_7_VFD1","IO0","SPARE"]
["UL20_7_VFD1","IO1","SPARE"]
["UL20_7_VFD1","SI0","SPARE"]
["UL20_7_VFD1","SI1","SPARE"]
["UL20_7_VFD1","SI2","SPARE"]
["UL20_7_VFD1","SI3","SPARE"]
["UL20_7_VFD1","SO0","SPARE"]
["UL20_8_VFD1","I0","UL20_8_DISC","DISCONNECT AUX"]
["UL20_8_VFD1","I1","UL20_8_ENC1","ENCODER"]
["UL20_8_VFD1","I2","UL20_8_TPE1","TRACKING PHOTOEYE"]
["UL20_8_VFD1","I3","SPARE"]
["UL20_8_VFD1","IO0","SPARE"]
["UL20_8_VFD1","IO1","SPARE"]
["UL20_8_VFD1","SI0","SPARE"]
["UL20_8_VFD1","SI1","SPARE"]
["UL20_8_VFD1","SI2","SPARE"]
["UL20_8_VFD1","SI3","SPARE"]
["UL20_8_VFD1","SO0","SPARE"]
["UL20_9_VFD1","I0","UL20_9_DISC","DISCONNECT AUX"]
["UL20_9_VFD1","I1","UL20_9_ENC1","ENCODER"]
["UL20_9_VFD1","I2","UL20_9_TPE1","TRACKING PHOTOEYE"]
["UL20_9_VFD1","I3","SPARE"]
["UL20_9_VFD1","IO0","UL21_11_TPE1","TRACKING PHOTOEYE"]
["UL20_9_VFD1","IO1","UL21_11_TPE2","TRACKING PHOTOEYE"]
["UL20_9_VFD1","SI0","SPARE"]
["UL20_9_VFD1","SI1","SPARE"]
["UL20_9_VFD1","SI2","SPARE"]
["UL20_9_VFD1","SI3","SPARE"]
["UL20_9_VFD1","SO0","SPARE"]
["UL21_10_VFD1","I0","UL21_10_DISC","DISCONNECT AUX"]
["UL21_10_VFD1","I1","UL21_10_ENC1","ENCODER"]
["UL21_10_VFD1","I2","UL21_10_TPE1","TRACKING PHOTOEYE"]
["UL21_10_VFD1","I3","SPARE"]
["UL21_10_VFD1","IO0","UL21_11_BCN1_A","AMBER BEACON LIGHT"]
["UL21_10_VFD1","IO1","UL21_11_BCN1_R","RED BEACON LIGHT"]
["UL21_10_VFD1","SI0","SPARE"]
["UL21_10_VFD1","SI1","SPARE"]
["UL21_10_VFD1","SI2","SPARE"]
["UL21_10_VFD1","SI3","SPARE"]
["UL21_10_VFD1","SO0","UL21_11_BCN2_R","RED BEACON LIGHT"]
["UL21_11_VFD1","I0","UL21_11_DISC","DISCONNECT AUX"]
["UL21_11_VFD1","I1","UL21_11_ENC1","ENCODER"]
["UL21_11_VFD1","I2","UL21_11_TPE3","TRACKING PHOTOEYE"]
["UL21_11_VFD1","I3","SPARE"]
["UL21_11_VFD1","IO0","UL21_11_JR1_PB","JAM RESET PUSHBUTTON"]
["UL21_11_VFD1","IO1","UL21_11_JR1_PB_LT","JAM RESET PUSHBUTTON LIGHT"]
["UL21_11_VFD1","SI0","UL21_11_EPC1","E-STOP PULLCORD"]
["UL21_11_VFD1","SI1","UL21_11_EPC1_2","E-STOP PULLCORD"]
["UL21_11_VFD1","SI2","UL21_11_EPC2","E-STOP PULLCORD"]
["UL21_11_VFD1","SI3","UL21_11_EPC2_2","E-STOP PULLCORD"]
["UL21_11_VFD1","SO0","SPARE"]
["UL21_12_VFD1","I0","UL21_12_DISC","DISCONNECT AUX"]
["UL21_12_VFD1","I1","UL21_12_ENC1","ENCODER"]
["UL21_12_VFD1","I2","UL21_11_TPE4","TRACKING PHOTOEYE"]
["UL21_12_VFD1","I3","UL21_11_TPE5","TRACKING PHOTOEYE"]
["UL21_12_VFD1","IO0","UL21_11_JR2_PB","JAM RESET PUSHBUTTON"]
["UL21_12_VFD1","IO1","UL21_11_JR2_PB_LT","JAM RESET PUSHBUTTON LIGHT"]
["UL21_12_VFD1","SI0","SPARE"]
["UL21_12_VFD1","SI1","SPARE"]
["UL21_12_VFD1","SI2","SPARE"]
["UL21_12_VFD1","SI3","SPARE"]
["UL21_12_VFD1","SO0","SPARE"]
["UL21_13_VFD1","I0","UL21_13_DISC","DISCONNECT AUX"]
["UL21_13_VFD1","I1","UL21_13_ENC1","ENCODER"]
["UL21_13_VFD1","I2","UL21_13_TPE1","TRACKING PHOTOEYE"]
["UL21_13_VFD1","I3","UL21_13_TPE2","TRACKING PHOTOEYE"]
["UL21_13_VFD1","IO0","UL21_11_S1_PB","START PUSHBUTTON"]
["UL21_13_VFD1","IO1","UL21_11_S1_PB_LT","START PUSHBUTTON LIGHT"]
["UL21_13_VFD1","SI0","UL21_13_EPC1","E-STOP PULLCORD"]
["UL21_13_VFD1","SI1","UL21_13_EPC1_2","E-STOP PULLCORD"]
["UL21_13_VFD1","SI2","UL21_13_EPC2","E-STOP PULLCORD"]
["UL21_13_VFD1","SI3","UL21_13_EPC2_2","E-STOP PULLCORD"]
["UL21_13_VFD1","SO0","SPARE"]
["UL21_14A_VFD1","I0","UL21_14A_DISC","DISCONNECT AUX"]
["UL21_14A_VFD1","I1","SPARE"]
["UL21_14A_VFD1","I2","SPARE"]
["UL21_14A_VFD1","I3","SPARE"]
["UL21_14A_VFD1","IO0","UL21_11_S2_PB","START PUSHBUTTON"]
["UL21_14A_VFD1","IO1","UL21_11_S2_PB_LT","START PUSHBUTTON LIGHT"]
["UL21_14A_VFD1","SI0","SPARE"]
["UL21_14A_VFD1","SI1","SPARE"]
["UL21_14A_VFD1","SI2","SPARE"]
["UL21_14A_VFD1","SI3","SPARE"]
["UL21_14A_VFD1","SO0","SPARE"]
["UL21_14B_VFD1","I0","UL21_14B_DISC","DISCONNECT AUX"]
["UL21_14B_VFD1","I1","SPARE"]
["UL21_14B_VFD1","I2","SPARE"]
["UL21_14B_VFD1","I3","SPARE"]
["UL21_14B_VFD1","IO0","UL21_13_BCN1_R","RED BEACON LIGHT"]
["UL21_14B_VFD1","IO1","UL21_13_BCN2_R","RED BEACON LIGHT"]
["UL21_14B_VFD1","SI0","SPARE"]
["UL21_14B_VFD1","SI1","SPARE"]
["UL21_14B_VFD1","SI2","SPARE"]
["UL21_14B_VFD1","SI3","SPARE"]
["UL21_14B_VFD1","SO0","SPARE"]
["UL21_15_VFD1","I0","UL21_15_DISC","DISCONNECT AUX"]
["UL21_15_VFD1","I1","UL21_15_ENC1","ENCODER"]
["UL21_15_VFD1","I2","UL21_15_TPE1","TRACKING PHOTOEYE"]
["UL21_15_VFD1","I3","UL21_15_TPE2","TRACKING PHOTOEYE"]
["UL21_15_VFD1","IO0","UL21_13_S1_PB","START PUSHBUTTON"]
["UL21_15_VFD1","IO1","UL21_13_S1_PB_LT","START PUSHBUTTON LIGHT"]
["UL21_15_VFD1","SI0","SPARE"]
["UL21_15_VFD1","SI1","SPARE"]
["UL21_15_VFD1","SI2","SPARE"]
["UL21_15_VFD1","SI3","SPARE"]
["UL21_15_VFD1","SO0","SPARE"]
["UL21_16_VFD1","I0","UL21_16_DISC","DISCONNECT AUX"]
["UL21_16_VFD1","I1","UL21_16_ENC1","ENCODER"]
["UL21_16_VFD1","I2","UL21_16_TPE1","TRACKING PHOTOEYE"]
["UL21_16_VFD1","I3","SPARE"]
["UL21_16_VFD1","IO0","UL21_13_S2_PB","START PUSHBUTTON"]
["UL21_16_VFD1","IO1","UL21_13_S2_PB_LT","START PUSHBUTTON LIGHT"]
["UL21_16_VFD1","SI0","SPARE"]
["UL21_16_VFD1","SI1","SPARE"]
["UL21_16_VFD1","SI2","SPARE"]
["UL21_16_VFD1","SI3","SPARE"]
["UL21_16_VFD1","SO0","SPARE"]
["UL21_17_VFD1","I0","UL21_17_DISC","DISCONNECT AUX"]
["UL21_17_VFD1","I1","SPARE"]
["UL21_17_VFD1","I2","SPARE","UL21_17_ENC1"]
["UL21_17_VFD1","I3","SPARE"]
["UL21_17_VFD1","IO0","SPARE"]
["UL21_17_VFD1","IO1","SPARE"]
["UL21_17_VFD1","SI0","SPARE"]
["UL21_17_VFD1","SI1","SPARE"]
["UL21_17_VFD1","SI2","SPARE"]
["UL21_17_VFD1","SI3","SPARE"]
["UL21_17_VFD1","SO0","SPARE"]
[]
["UL21_3_VFD1","I0","UL21_3_DISC","DISCONNECT AUX"]
["UL21_3_VFD1","I1","UL21_3_ENC1","ENCODER"]
["UL21_3_VFD1","I2","UL21_3_TPE1","TRACKING PHOTOEYE"]
["UL21_3_VFD1","I3","UL21_3_TPE2","TRACKING PHOTOEYE"]
["UL21_3_VFD1","IO0","SPARE"]
["UL21_3_VFD1","IO1","SPARE"]
["UL21_3_VFD1","SI0","UL21_3_EPC1","E-STOP PULLCORD"]
["UL21_3_VFD1","SI1","UL21_3_EPC1_2","E-STOP PULLCORD"]
["UL21_3_VFD1","SI2","UL21_3_EPC2","E-STOP PULLCORD"]
["UL21_3_VFD1","SI3","UL21_3_EPC2_2","E-STOP PULLCORD"]
["UL21_3_VFD1","SO0","UL21_4_BCN2_R","RED BEACON LIGHT"]
["UL21_4_VFD1","I0","UL21_4_DISC","DISCONNECT AUX"]
["UL21_4_VFD1","I1","UL21_4_ENC1","ENCODER"]
["UL21_4_VFD1","I2","UL21_4_TPE1","TRACKING PHOTOEYE"]
["UL21_4_VFD1","I3","SPARE"]
["UL21_4_VFD1","IO0","UL21_4_S1_PB","START PUSHBUTTON"]
["UL21_4_VFD1","IO1","UL21_4_S1_PB_LT","START PUSHBUTTON LIGHT"]
["UL21_4_VFD1","SI0","UL21_4_EPC1","E-STOP PULLCORD"]
["UL21_4_VFD1","SI1","UL21_4_EPC1_2","E-STOP PULLCORD"]
["UL21_4_VFD1","SI2","UL21_4_EPC2","E-STOP PULLCORD"]
["UL21_4_VFD1","SI3","UL21_4_EPC2_2","E-STOP PULLCORD"]
["UL21_4_VFD1","SO0","UL21_4_BCN1_R","RED BEACON LIGHT"]
["UL21_5_VFD1","I0","UL21_5_DISC","DISCONNECT AUX"]
["UL21_5_VFD1","I1","UL21_5_ENC1","ENCODER"]
["UL21_5_VFD1","I2","SPARE"]
["UL21_5_VFD1","I3","SPARE"]
["UL21_5_VFD1","IO0","UL21_5_JR1_PB","JAM RESET PUSHBUTTON"]
["UL21_5_VFD1","IO1","UL21_5_JR1_PB_LT","JAM RESET PUSHBUTTON LIGHT"]
["UL21_5_VFD1","SI0","SPARE"]
["UL21_5_VFD1","SI1","SPARE"]
["UL21_5_VFD1","SI2","SPARE"]
["UL21_5_VFD1","SI3","SPARE"]
["UL21_5_VFD1","SO0","UL21_5_BCN1_A","AMBER BEACON LIGHT"]
["UL21_6_VFD1","I0","UL21_6_DISC","DISCONNECT AUX"]
["UL21_6_VFD1","I1","UL21_6_ENC1","ENCODER"]
["UL21_6_VFD1","I2","UL21_6_TPE1","TRACKING PHOTOEYE"]
["UL21_6_VFD1","I3","UL21_6_TPE2","TRACKING PHOTOEYE"]
["UL21_6_VFD1","IO0","UL21_4_S2_PB","START PUSHBUTTON"]
["UL21_6_VFD1","IO1","UL21_4_S2_PB_LT","START PUSHBUTTON LIGHT"]
["UL21_6_VFD1","SI0","SPARE"]
["UL21_6_VFD1","SI1","SPARE"]
["UL21_6_VFD1","SI2","SPARE"]
["UL21_6_VFD1","SI3","SPARE"]
["UL21_6_VFD1","SO0","SPARE"]
["UL21_7_VFD1","I0","UL21_7_DISC","DISCONNECT AUX"]
["UL21_7_VFD1","I1","UL21_7_ENC1","ENCODER"]
["UL21_7_VFD1","I2","UL21_7_TPE1","TRACKING PHOTOEYE"]
["UL21_7_VFD1","I3","SPARE"]
["UL21_7_VFD1","IO0","SPARE"]
["UL21_7_VFD1","IO1","SPARE"]
["UL21_7_VFD1","SI0","SPARE"]
["UL21_7_VFD1","SI1","SPARE"]
["UL21_7_VFD1","SI2","SPARE"]
["UL21_7_VFD1","SI3","SPARE"]
["UL21_7_VFD1","SO0","SPARE"]
["UL21_8_VFD1","I0","UL21_8_DISC","DISCONNECT AUX"]
["UL21_8_VFD1","I1","UL21_8_ENC1","ENCODER"]
["UL21_8_VFD1","I2","UL21_8_TPE1","TRACKING PHOTOEYE"]
["UL21_8_VFD1","I3","SPARE"]
["UL21_8_VFD1","IO0","SPARE"]
["UL21_8_VFD1","IO1","SPARE"]
["UL21_8_VFD1","SI0","SPARE"]
["UL21_8_VFD1","SI1","SPARE"]
["UL21_8_VFD1","SI2","SPARE"]
["UL21_8_VFD1","SI3","SPARE"]
["UL21_8_VFD1","SO0","SPARE"]
["UL21_9_VFD1","I0","UL21_9_DISC","DISCONNECT AUX"]
["UL21_9_VFD1","I1","UL21_9_ENC1","ENCODER"]
["UL21_9_VFD1","I2","UL21_9_TPE1","TRACKING PHOTOEYE"]
["UL21_9_VFD1","I3","SPARE"]
["UL21_9_VFD1","IO0","SPARE"]
["UL21_9_VFD1","IO1","SPARE"]
["UL21_9_VFD1","SI0","SPARE"]
["UL21_9_VFD1","SI1","SPARE"]
["UL21_9_VFD1","SI2","SPARE"]
["UL21_9_VFD1","SI3","SPARE"]
["UL21_9_VFD1","SO0","SPARE"]
["UL13_2_FIO1","IO00","UL13_1_BCN1_R","RED BEACON LIGHT"]
["UL13_2_FIO1","IO01","SPARE"]
["UL13_2_FIO1","IO02","UL13_1_BCN2_R","RED BEACON LIGHT"]
["UL13_2_FIO1","IO03","SPARE"]
["UL13_2_FIO1","IO04","UL13_2_LPE1","LASEREYE"]
["UL13_2_FIO1","IO05","SPARE"]
["UL13_2_FIO1","IO06","UL13_2_LPE2","LASEREYE"]
["UL13_2_FIO1","IO07","SPARE"]
["UL13_2_FIO1","IO08","SPARE"]
["UL13_2_FIO1","IO09","SPARE"]
["UL13_2_FIO1","IO10","SPARE"]
["UL13_2_FIO1","IO11","SPARE"]
["UL13_2_FIO1","IO12","SPARE"]
["UL13_2_FIO1","IO13","SPARE"]
["UL13_2_FIO1","IO14","SPARE"]
["UL13_2_FIO1","IO15","SPARE"]
["UL14_3_FIO1","IO00","UL14_3_BCN1_R","RED BEACON LIGHT"]
["UL14_3_FIO1","IO01","SPARE"]
["UL14_3_FIO1","IO02","UL14_3_BCN2_R","RED BEACON LIGHT"]
["UL14_3_FIO1","IO03","SPARE"]
["UL14_3_FIO1","IO04","UL14_3_LPE1","LASEREYE"]
["UL14_3_FIO1","IO05","SPARE"]
["UL14_3_FIO1","IO06","UL14_3_LPE2","LASEREYE"]
["UL14_3_FIO1","IO07","SPARE"]
["UL14_3_FIO1","IO08","UL14_3_S1_PB","START PUSHBUTTON"]
["UL14_3_FIO1","IO09","UL14_3_S1_PB_LT","START PUSHBUTTON LIGHT"]
["UL14_3_FIO1","IO10","UL14_3_S2_PB","START PUSHBUTTON"]
["UL14_3_FIO1","IO11","UL14_3_S2_PB_LT","START PUSHBUTTON LIGHT"]
["UL14_3_FIO1","IO12","SPARE"]
["UL14_3_FIO1","IO13","SPARE"]
["UL14_3_FIO1","IO14","SPARE"]
["UL14_3_FIO1","IO15","SPARE"]
["UL15_3_FIO1","IO00","UL15_3_BCN1_R","RED BEACON LIGHT"]
["UL15_3_FIO1","IO01","SPARE"]
["UL15_3_FIO1","IO02","UL15_3_BCN2_R","RED BEACON LIGHT"]
["UL15_3_FIO1","IO03","SPARE"]
["UL15_3_FIO1","IO04","UL15_3_LPE1","LASEREYE"]
["UL15_3_FIO1","IO05","SPARE"]
["UL15_3_FIO1","IO06","UL15_3_LPE2","LASEREYE"]
["UL15_3_FIO1","IO07","SPARE"]
["UL15_3_FIO1","IO08","UL15_3_S1_PB","START PUSHBUTTON"]
["UL15_3_FIO1","IO09","UL15_3_S1_PB_LT","START PUSHBUTTON LIGHT"]
["UL15_3_FIO1","IO10","UL15_3_S2_PB","START PUSHBUTTON"]
["UL15_3_FIO1","IO11","UL15_3_S2_PB_LT","START PUSHBUTTON LIGHT"]
["UL15_3_FIO1","IO12","SPARE"]
["UL15_3_FIO1","IO13","SPARE"]
["UL15_3_FIO1","IO14","SPARE"]
["UL15_3_FIO1","IO15","SPARE"]
["UL16_2_FIO1","IO00","UL16_2_BCN1_R","RED BEACON LIGHT"]
["UL16_2_FIO1","IO01","SPARE"]
["UL16_2_FIO1","IO02","UL16_2_BCN2_R","RED BEACON LIGHT"]
["UL16_2_FIO1","IO03","SPARE"]
["UL16_2_FIO1","IO04","UL16_2_LPE1","LASEREYE"]
["UL16_2_FIO1","IO05","SPARE"]
["UL16_2_FIO1","IO06","UL16_2_LPE2","LASEREYE"]
["UL16_2_FIO1","IO07","SPARE"]
["UL16_2_FIO1","IO08","UL16_2_S1_PB","START PUSHBUTTON"]
["UL16_2_FIO1","IO09","UL16_2_S1_PB_LT","START PUSHBUTTON LIGHT"]
["UL16_2_FIO1","IO10","UL16_2_S2_PB","START PUSHBUTTON"]
["UL16_2_FIO1","IO11","UL16_2_S2_PB_LT","START PUSHBUTTON LIGHT"]
["UL16_2_FIO1","IO12","SPARE"]
["UL16_2_FIO1","IO13","SPARE"]
["UL16_2_FIO1","IO14","SPARE"]
["UL16_2_FIO1","IO15","SPARE"]
["UL17_3_FIO1","IO00","UL17_3_BCN1_R","RED BEACON LIGHT"]
["UL17_3_FIO1","IO01","SPARE"]
["UL17_3_FIO1","IO02","UL17_3_BCN2_R","RED BEACON LIGHT"]
["UL17_3_FIO1","IO03","SPARE"]
["UL17_3_FIO1","IO04","UL17_3_LPE1","LASEREYE"]
["UL17_3_FIO1","IO05","SPARE"]
["UL17_3_FIO1","IO06","UL17_3_LPE2","LASEREYE"]
["UL17_3_FIO1","IO07","SPARE"]
["UL17_3_FIO1","IO08","UL17_3_S1_PB","START PUSHBUTTON"]
["UL17_3_FIO1","IO09","UL17_3_S1_PB_LT","START PUSHBUTTON LIGHT"]
["UL17_3_FIO1","IO10","UL17_3_S2_PB","START PUSHBUTTON"]
["UL17_3_FIO1","IO11","UL17_3_S2_PB_LT","START PUSHBUTTON LIGHT"]
["UL17_3_FIO1","IO12","SPARE"]
["UL17_3_FIO1","IO13","SPARE"]
["UL17_3_FIO1","IO14","SPARE"]
["UL17_3_FIO1","IO15","SPARE"]
["UL18_3_FIO1","IO00","UL18_3_BCN1_R","RED BEACON LIGHT"]
["UL18_3_FIO1","IO01","SPARE"]
["UL18_3_FIO1","IO02","UL18_3_BCN2_R","RED BEACON LIGHT"]
["UL18_3_FIO1","IO03","SPARE"]
["UL18_3_FIO1","IO04","UL18_3_LPE1","LASEREYE"]
["UL18_3_FIO1","IO05","SPARE"]
["UL18_3_FIO1","IO06","UL18_3_LPE2","LASEREYE"]
["UL18_3_FIO1","IO07","SPARE"]
["UL18_3_FIO1","IO08","UL18_3_S1_PB","START PUSHBUTTON"]
["UL18_3_FIO1","IO09","UL18_3_S1_PB_LT","START PUSHBUTTON LIGHT"]
["UL18_3_FIO1","IO10","UL18_3_S2_PB","START PUSHBUTTON"]
["UL18_3_FIO1","IO11","UL18_3_S2_PB_LT","START PUSHBUTTON LIGHT"]
["UL18_3_FIO1","IO12","SPARE"]
["UL18_3_FIO1","IO13","SPARE"]
["UL18_3_FIO1","IO14","SPARE"]
["UL18_3_FIO1","IO15","SPARE"]
["UL19_2_FIO1","IO00","UL19_2_BCN1_R","RED BEACON LIGHT"]
["UL19_2_FIO1","IO01","SPARE"]
["UL19_2_FIO1","IO02","UL19_2_BCN2_R","RED BEACON LIGHT"]
["UL19_2_FIO1","IO03","SPARE"]
["UL19_2_FIO1","IO04","UL19_2_LPE1","LASEREYE"]
["UL19_2_FIO1","IO05","SPARE"]
["UL19_2_FIO1","IO06","UL19_2_LPE2","LASEREYE"]
["UL19_2_FIO1","IO07","SPARE"]
["UL19_2_FIO1","IO08","UL19_2_S1_PB","START PUSHBUTTON"]
["UL19_2_FIO1","IO09","UL19_2_S1_PB_LT","START PUSHBUTTON LIGHT"]
["UL19_2_FIO1","IO10","UL19_2_S2_PB","START PUSHBUTTON"]
["UL19_2_FIO1","IO11","UL19_2_S2_PB_LT","START PUSHBUTTON LIGHT"]
["UL19_2_FIO1","IO12","SPARE"]
["UL19_2_FIO1","IO13","SPARE"]
["UL19_2_FIO1","IO14","SPARE"]
["UL19_2_FIO1","IO15","SPARE"]
["UL20_3_FIO1","IO00","UL20_3_BCN1_R","RED BEACON LIGHT"]
["UL20_3_FIO1","IO01","SPARE"]
["UL20_3_FIO1","IO02","UL20_3_BCN2_R","RED BEACON LIGHT"]
["UL20_3_FIO1","IO03","SPARE"]
["UL20_3_FIO1","IO04","UL20_3_LPE1","LASEREYE"]
["UL20_3_FIO1","IO05","SPARE"]
["UL20_3_FIO1","IO06","UL20_3_LPE2","LASEREYE"]
["UL20_3_FIO1","IO07","SPARE"]
["UL20_3_FIO1","IO08","UL20_3_S1_PB","START PUSHBUTTON"]
["UL20_3_FIO1","IO09","UL20_3_S1_PB_LT","START PUSHBUTTON LIGHT"]
["UL20_3_FIO1","IO10","UL20_3_S2_PB","START PUSHBUTTON"]
["UL20_3_FIO1","IO11","UL20_3_S2_PB_LT","START PUSHBUTTON LIGHT"]
["UL20_3_FIO1","IO12","SPARE"]
["UL20_3_FIO1","IO13","SPARE"]
["UL20_3_FIO1","IO14","SPARE"]
["UL20_3_FIO1","IO15","SPARE"]
["UL21_3_FIO1","IO00","UL21_3_BCN1_R","RED BEACON LIGHT"]
["UL21_3_FIO1","IO01","SPARE"]
["UL21_3_FIO1","IO02","UL21_3_BCN2_R","RED BEACON LIGHT"]
["UL21_3_FIO1","IO03","SPARE"]
["UL21_3_FIO1","IO04","UL21_3_LPE1","LASEREYE"]
["UL21_3_FIO1","IO05","SPARE"]
["UL21_3_FIO1","IO06","UL21_3_LPE2","LASEREYE"]
["UL21_3_FIO1","IO07","SPARE"]
["UL21_3_FIO1","IO08","UL21_3_S1_PB","START PUSHBUTTON"]
["UL21_3_FIO1","IO09","UL21_3_S1_PB_LT","START PUSHBUTTON LIGHT"]
["UL21_3_FIO1","IO10","UL21_3_S2_PB","START PUSHBUTTON"]
["UL21_3_FIO1","IO11","UL21_3_S2_PB_LT","START PUSHBUTTON LIGHT"]
["UL21_3_FIO1","IO12","SPARE"]
["UL21_3_FIO1","IO13","SPARE"]
["UL21_3_FIO1","IO14","SPARE"]
["UL21_3_FIO1","IO15","SPARE"]
["UL13_12_FIO1","IO00","UL13_12_PE1","DEBRIS SENSOR"]
["UL13_12_FIO1","IO01"]
["UL13_12_FIO1","IO02","UL13_12_PE2","BELT ENGAGEMENT SENSOR"]
["UL13_12_FIO1","IO03"]
["UL13_12_FIO1","IO04","UL13_12_SOL1","DIVERT MODULE"]
["UL13_12_FIO1","IO05"]
["UL13_12_FIO1","IO06","UL13_12_SOL2","DIVERT MODULE"]
["UL13_12_FIO1","IO07"]
["UL13_12_FIO1","IO08","UL13_12_PE3","ENTRANCE PE"]
["UL13_12_FIO1","IO09"]
["UL13_12_FIO1","IO10","UL13_12_PE4","EXIT PE"]
["UL13_12_FIO1","IO11"]
["UL13_12_FIO1","IO12","UL13_12_SOL3","DIVERT MODULE"]
["UL13_12_FIO1","IO13"]
["UL13_12_FIO1","IO14","UL13_12_PE5","DEBRIS SENSOR"]
["UL13_12_FIO1","IO15"]
["UL18_16_FIO1","IO00","UL18_16_PE1","DEBRIS SENSOR"]
["UL18_16_FIO1","IO01"]
["UL18_16_FIO1","IO02","UL18_16_PE2","BELT ENGAGEMENT SENSOR"]
["UL18_16_FIO1","IO03"]
["UL18_16_FIO1","IO04","UL18_16_SOL1","DIVERT MODULE"]
["UL18_16_FIO1","IO05"]
["UL18_16_FIO1","IO06","UL18_16_SOL2","DIVERT MODULE"]
["UL18_16_FIO1","IO07"]
["UL18_16_FIO1","IO08","UL18_16_PE3","ENTRANCE PE"]
["UL18_16_FIO1","IO09"]
["UL18_16_FIO1","IO10","UL18_16_PE4","EXIT PE"]
["UL18_16_FIO1","IO11"]
["UL18_16_FIO1","IO12","UL18_16_SOL3","DIVERT MODULE"]
["UL18_16_FIO1","IO13"]
["UL18_16_FIO1","IO14","UL18_16_PE5","DEBRIS SENSOR"]
["UL18_16_FIO1","IO15"]
["UL21_17_FIO1","IO00","UL21_17_PE1","DEBRIS SENSOR"]
["UL21_17_FIO1","IO01"]
["UL21_17_FIO1","IO02","UL21_17_PE2","BELT ENGAGEMENT SENSOR"]
["UL21_17_FIO1","IO03"]
["UL21_17_FIO1","IO04","UL21_17_SOL1","DIVERT MODULE"]
["UL21_17_FIO1","IO05"]
["UL21_17_FIO1","IO06","UL21_17_SOL2","DIVERT MODULE"]
["UL21_17_FIO1","IO07"]
["UL21_17_FIO1","IO08","UL21_17_PE3","ENTRANCE PE"]
["UL21_17_FIO1","IO09"]
["UL21_17_FIO1","IO10","UL21_17_PE4","EXIT PE"]
["UL21_17_FIO1","IO11"]
["UL21_17_FIO1","IO12","UL21_17_SOL3","DIVERT MODULE"]
["UL21_17_FIO1","IO13"]
["UL21_17_FIO1","IO14","UL21_17_PE5","DEBRIS SENSOR"]
["UL21_17_FIO1","IO15"]
["PDP3_FIO1","IO00","PDP3_CB1 ","PDP3_CB1"]
["PDP3_FIO1","IO01","PDP3_CB2","PDP3_CB2"]
["PDP3_FIO1","IO02","PDP3_CB3","PDP3_CB3"]
["PDP3_FIO1","IO03","PDP3_CB4","PDP3_CB4"]
["PDP3_FIO1","IO04","PDP3_CB5","PDP3_CB5"]
["PDP3_FIO1","IO05"]
["PDP3_FIO1","IO06","PDP3_CB6","PDP3_CB6"]
["PDP3_FIO1","IO07"]
["PDP3_FIO1","IO08","PDP3_CB7","PDP3_CB7"]
["PDP3_FIO1","IO09","PDP3_CB8","PDP3_CB8"]
["PDP3_FIO1","IO10","PDP3_CB9","PDP3_CB9"]
["PDP3_FIO1","IO11","PDP3_CB10","PDP3_CB10"]
["PDP3_FIO1","IO12","PDP3_PWM1","PDP3_PWM1"]
["PDP3_FIO1","IO13","SPARE"]
["PDP3_FIO1","IO14","PDP3_FIOH1","PDP3_FIO1H"]
["PDP3_FIO1","IO15","SPARE"]
["PDP3_FIOH1","IO00","PDP3_CB11","PDP3_CB11"]
["PDP3_FIOH1","IO01","PDP3_CB12","PDP3_CB12"]
["PDP3_FIOH1","IO02","PDP3_CB13","PDP3_CB13"]
["PDP3_FIOH1","IO03","PDP3_CB14","PDP3_CB14"]
["PDP3_FIOH1","IO04","PDP3_CB15","PDP3_CB15"]
["PDP3_FIOH1","IO05","PDP3_CB16","PDP3_CB16"]
["PDP3_FIOH1","IO06","PDP3_CB17","PDP3_CB17"]
["PDP3_FIOH1","IO07","PDP3_CB18","PDP3_CB18"]
["PDP3_FIOH1","IO08","PDP3_CB19","PDP3_CB19"]
["PDP3_FIOH1","IO09","PDP3_CB20","PDP3_CB20"]
["PDP3_FIOH1","IO10","PDP3_CB21","PDP3_CB21"]
["PDP3_FIOH1","IO11","PDP3_CB22","PDP3_CB22"]
["PDP3_FIOH1","IO12","PDP3_CB23","PDP3_CB23"]
["PDP3_FIOH1","IO13","PDP3_CB24","PDP3_CB24"]
["PDP3_FIOH1","IO14","PDP3_CB25","PDP3_CB25"]
["PDP3_FIOH1","IO15","PDP3_CB26","PDP3_CB26"]
["PDP4_FIO1","IO00","PDP4_CB1 ","PDP4_CB1"]
["PDP4_FIO1","IO01","PDP4_CB2","PDP4_CB2"]
["PDP4_FIO1","IO02","PDP4_CB3","PDP4_CB3"]
["PDP4_FIO1","IO03","PDP4_CB4","PDP4_CB4"]
["PDP4_FIO1","IO04","PDP4_CB5","PDP4_CB5"]
["PDP4_FIO1","IO05"]
["PDP4_FIO1","IO06","PDP4_CB6","PDP4_CB6"]
["PDP4_FIO1","IO07"]
["PDP4_FIO1","IO08","PDP4_CB7","PDP4_CB7"]
["PDP4_FIO1","IO09","PDP4_CB8","PDP4_CB8"]
["PDP4_FIO1","IO10","PDP4_CB9","PDP4_CB9"]
["PDP4_FIO1","IO11","PDP4_CB10","PDP4_CB10"]
["PDP4_FIO1","IO12","PDP4_PWM1","PDP4_PWM1"]
["PDP4_FIO1","IO13","SPARE"]
["PDP4_FIO1","IO14","PDP4_FIOH1","PDP4_FIO1H"]
["PDP4_FIO1","IO15","SPARE"]
["PDP4_FIOH1","IO00","PDP4_CB11","PDP4_CB11"]
["PDP4_FIOH1","IO01","PDP4_CB12","PDP4_CB12"]
["PDP4_FIOH1","IO02","PDP4_CB13","PDP4_CB13"]
["PDP4_FIOH1","IO03","PDP4_CB14","PDP4_CB14"]
["PDP4_FIOH1","IO04","PDP4_CB15","PDP4_CB15"]
["PDP4_FIOH1","IO05","PDP4_CB16","PDP4_CB16"]
["PDP4_FIOH1","IO06","PDP4_CB17","PDP4_CB17"]
["PDP4_FIOH1","IO07","PDP4_CB18","PDP4_CB18"]
["PDP4_FIOH1","IO08","PDP4_CB19","PDP4_CB19"]
["PDP4_FIOH1","IO09","PDP4_CB20","PDP4_CB20"]
["PDP4_FIOH1","IO10","PDP4_CB21","PDP4_CB21"]
["PDP4_FIOH1","IO11","PDP4_CB22","PDP4_CB22"]
["PDP4_FIOH1","IO12","PDP4_CB23","PDP4_CB23"]
["PDP4_FIOH1","IO13","PDP4_CB24","PDP4_CB24"]
["PDP4_FIOH1","IO14","PDP4_CB25","PDP4_CB25"]
["PDP4_FIOH1","IO15","PDP4_CB26","PDP4_CB26"]
["PDP7_FIO1","IO00","PDP7_CB1 ","PDP7_CB1"]
["PDP7_FIO1","IO01","PDP7_CB2","PDP7_CB2"]
["PDP7_FIO1","IO02","PDP7_CB3","PDP7_CB3"]
["PDP7_FIO1","IO03","PDP7_CB4","PDP7_CB4"]
["PDP7_FIO1","IO04","PDP7_CB5","PDP7_CB5"]
["PDP7_FIO1","IO05"]
["PDP7_FIO1","IO06","PDP7_CB6","PDP7_CB6"]
["PDP7_FIO1","IO07"]
["PDP7_FIO1","IO08","PDP7_CB7","PDP7_CB7"]
["PDP7_FIO1","IO09","PDP7_CB8","PDP7_CB8"]
["PDP7_FIO1","IO10","PDP7_CB9","PDP7_CB9"]
["PDP7_FIO1","IO11","PDP7_CB10","PDP7_CB10"]
["PDP7_FIO1","IO12","PDP7_PWM1","PDP7_PWM1"]
["PDP7_FIO1","IO13","SPARE"]
["PDP7_FIO1","IO14","PDP7_FIOH1","PDP7_FIO1H"]
["PDP7_FIO1","IO15","SPARE"]
["PDP7_FIOH1","IO00","PDP7_CB11","PDP7_CB11"]
["PDP7_FIOH1","IO01","PDP7_CB12","PDP7_CB12"]
["PDP7_FIOH1","IO02","PDP7_CB13","PDP7_CB13"]
["PDP7_FIOH1","IO03","PDP7_CB14","PDP7_CB14"]
["PDP7_FIOH1","IO04","PDP7_CB15","PDP7_CB15"]
["PDP7_FIOH1","IO05","PDP7_CB16","PDP7_CB16"]
["PDP7_FIOH1","IO06","PDP7_CB17","PDP7_CB17"]
["PDP7_FIOH1","IO07","PDP7_CB18","PDP7_CB18"]
["PDP7_FIOH1","IO08","PDP7_CB19","PDP7_CB19"]
["PDP7_FIOH1","IO09","PDP7_CB20","PDP7_CB20"]
["PDP7_FIOH1","IO10","PDP7_CB21","PDP7_CB21"]
["PDP7_FIOH1","IO11","PDP7_CB22","PDP7_CB22"]
["PDP7_FIOH1","IO12","PDP7_CB23","PDP7_CB23"]
["PDP7_FIOH1","IO13","PDP7_CB24","PDP7_CB24"]
["PDP7_FIOH1","IO14","PDP7_CB25","PDP7_CB25"]
["PDP7_FIOH1","IO15","PDP7_CB26","PDP7_CB26"]
[]
["SLOT5_IB16","I0","MCM02","S_PBLT START"]
["SLOT5_IB16","I1","MCM02","ST_PB STOP"]
["SLOT5_IB16","I2","MCM02","MF_PBLT MOTOR FAULT RESET"]
["SLOT5_IB16","I3","MCM02","JR_PBLT JAM RESET"]
["SLOT5_IB16","I4","MCM02","LAP_PBLT LOW AIR PRESSURE"]
["SLOT5_IB16","I5","MCM02","PBFR_PBLT POWER BRANCH FAULT RESET"]
["SLOT5_IB16","I6","MCM02","BATTERY_FAULT_UPS BATTERY FAULT"]
["SLOT5_IB16","I7","MCM02","ON_BATTERY ON BATTERY"]
["SLOT5_IB16","I8","MCM02","UPS_BATTERY_LOW UPS BATTERY LOW"]
["SLOT5_IB16","I9","MCM02","NAT_SWITCH ALARM NAT SWITCH"]
["SLOT5_IB16","I10","SPARE"]
["SLOT5_IB16","I11","SPARE"]
["SLOT5_IB16","I12","SPARE"]
["SLOT5_IB16","I13","SPARE"]
["SLOT5_IB16","I14","SPARE"]
["SLOT5_IB16","I15","SPARE"]
["SLOT6_OB16E","O0","MCM02","ES_LT EMERGENCY STOP ACTUATED"]
["SLOT6_OB16E","O1","MCM02","S_PBLT START LIGHT"]
["SLOT6_OB16E","O2","MCM02","MF_PBLT MOTOR FAULT LIGHT"]
["SLOT6_OB16E","O3","MCM02","JR_PBLT JAM RESTART LIGHT"]
["SLOT6_OB16E","O4","MCM02","LAP_PBLT LOW AIR PRESSURE LIGHT"]
["SLOT6_OB16E","O5","MCM02","PBFR_PBLT POWER BRANCH FAULT RESET LIGHT"]
["SLOT6_OB16E","O6","SPARE"]
["SLOT6_OB16E","O7","SPARE"]
["SLOT6_OB16E","O8","SPARE"]
["SLOT6_OB16E","O9","SPARE"]
["SLOT6_OB16E","O10","SPARE"]
["SLOT6_OB16E","O11","SPARE"]
["SLOT6_OB16E","O12","SPARE"]
["SLOT6_OB16E","O13","SPARE"]
["SLOT6_OB16E","O14","SPARE"]
["SLOT6_OB16E","O15","SPARE"]
["SLOT7_IB16S","I0","MCM02","FIRE_ALARM FIRE ALARM"]
["SLOT7_IB16S","I1","SPARE"]
["SLOT7_IB16S","I2","MCM02","ES_PB ES_PB_CH1"]
["SLOT7_IB16S","I3","MCM02","ES_PB ES_PB_CH2"]
["SLOT7_IB16S","I4","SPARE"]
["SLOT7_IB16S","I5","SPARE"]
["SLOT7_IB16S","I6","SPARE"]
["SLOT7_IB16S","I7","SPARE"]
["SLOT7_IB16S","I8","SPARE"]
["SLOT7_IB16S","I9","SPARE"]
["SLOT7_IB16S","I10","SPARE"]
["SLOT7_IB16S","I11","SPARE"]
["SLOT7_IB16S","I12","SPARE"]
["SLOT7_IB16S","I13","SPARE"]
["SLOT7_IB16S","I14","SPARE"]
["SLOT7_IB16S","I15","SPARE"]

{"sheet":"NETWORK_PLC","index":8,"n_rows":161,"n_cols":5,"rows_kept":161,"cut":false,"hidden":false,"merged":[]}
["DPM","DPM_IP","Name","PartNumber","IP"]
["UL13_8_DPM1","11.200.1.2","UL13_1_VFD1","35S-6D2-P101","11.200.1.30"]
["UL13_8_DPM1","11.200.1.2","UL13_2_VFD1","35S-6D5-P111","11.200.1.31"]
["UL13_8_DPM1","11.200.1.2","UL13_3_VFD1","35S-6D3-P101","11.200.1.32"]
["UL13_8_DPM1","11.200.1.2","UL13_4_VFD1","35S-6D3-P101","11.200.1.33"]
["UL13_8_DPM1","11.200.1.2","UL13_5_VFD1","35S-6D3-P101","11.200.1.34"]
["UL13_8_DPM1","11.200.1.2","UL13_6_VFD1","35S-6D3-P101","11.200.1.35"]
["UL13_8_DPM1","11.200.1.2","UL13_7_VFD1","35S-6D3-P101","11.200.1.36"]
["UL13_8_DPM1","11.200.1.2","UL13_8_VFD1","35S-6D4-P111","11.200.1.37"]
["UL13_8_DPM1","11.200.1.2","UL13_9A_VFD1","35S-6D3-P101","11.200.1.38"]
["UL13_8_DPM1","11.200.1.2","UL13_9B_VFD1","35S-6D3-P101","11.200.1.39"]
["UL13_8_DPM1","11.200.1.2","UL13_10_VFD1","35S-6D2-P101","11.200.1.40"]
["UL13_8_DPM1","11.200.1.2","UL13_11_VFD1","35S-6D2-P101","11.200.1.41"]
["UL13_8_DPM1","11.200.1.2","UL13_12_VFD1","35S-6D4-P111","11.200.1.42"]
["UL13_8_DPM1","11.200.1.2","UL14_1_EX1","FMH","11.200.1.43"]
["UL13_8_DPM1","11.200.1.2","UL14_3_VFD1","35S-6D4-P111","11.200.1.44"]
["UL13_8_DPM1","11.200.1.2","UL14_4_VFD1","35S-6D4-P111","11.200.1.45"]
["UL13_8_DPM1","11.200.1.2","UL14_5_VFD1","35S-6D3-P101","11.200.1.46"]
["UL13_8_DPM1","11.200.1.2","UL14_6_VFD1","35S-6D2-P101","11.200.1.47"]
["UL13_8_DPM1","11.200.1.2","UL14_7_VFD1","35S-6D3-P101","11.200.1.48"]
["UL13_8_DPM1","11.200.1.2","UL14_8_VFD1","35S-6D3-P101","11.200.1.49"]
["UL13_8_DPM1","11.200.1.2","UL14_9_VFD1","35S-6D3-P101","11.200.1.50"]
["UL13_8_DPM1","11.200.1.2","UL14_10_VFD1","35S-6D2-P101","11.200.1.51"]
["UL13_8_DPM1","11.200.1.2","UL13_2_FIO1","5032-8IOLM12DR","11.200.1.52"]
["UL13_8_DPM1","11.200.1.2","UL14_3_FIO1","5032-8IOLM12DR","11.200.1.53"]
["UL15_4_DPM1","11.200.1.3","UL15_1_EX1","FMH","11.200.1.54"]
["UL15_4_DPM1","11.200.1.3","UL15_3_VFD1","35S-6D4-P111","11.200.1.55"]
["UL15_4_DPM1","11.200.1.3","UL15_4_VFD1","35S-6D4-P111","11.200.1.56"]
["UL15_4_DPM1","11.200.1.3","UL15_5_VFD1","35S-6D2-P101","11.200.1.57"]
["UL15_4_DPM1","11.200.1.3","UL15_6_VFD1","35S-6D3-P101","11.200.1.58"]
["UL15_4_DPM1","11.200.1.3","UL15_7_VFD1","35S-6D3-P101","11.200.1.59"]
["UL15_4_DPM1","11.200.1.3","UL15_8_VFD1","35S-6D3-P101","11.200.1.60"]
["UL15_4_DPM1","11.200.1.3","UL15_9_VFD1","35S-6D3-P101","11.200.1.61"]
["UL15_4_DPM1","11.200.1.3","UL15_10_VFD1","35S-6D3-P101","11.200.1.62"]
["UL15_4_DPM1","11.200.1.3","UL15_11_VFD1","35S-6D2-P101","11.200.1.63"]
["UL15_4_DPM1","11.200.1.3","UL15_3_FIO1","5032-8IOLM12DR","11.200.1.64"]
["UL15_4_DPM1","11.200.1.3","UL13_12_FIO1","5032-8IOLM12DR","11.200.1.196"]
["UL16_2_DPM1","11.200.1.4","UL16_1_VFD1","35S-6D2-P101","11.200.1.65"]
["UL16_2_DPM1","11.200.1.4","UL16_2_VFD1","35S-6D5-P111","11.200.1.66"]
["UL16_2_DPM1","11.200.1.4","UL16_3_VFD1","35S-6D3-P101","11.200.1.67"]
["UL16_2_DPM1","11.200.1.4","UL16_4_VFD1","35S-6D3-P101","11.200.1.68"]
["UL16_2_DPM1","11.200.1.4","UL16_5_VFD1","35S-6D2-P101","11.200.1.69"]
["UL16_2_DPM1","11.200.1.4","UL16_6_VFD1","35S-6D3-P101","11.200.1.70"]
["UL16_2_DPM1","11.200.1.4","UL16_7_VFD1","35S-6D3-P101","11.200.1.71"]
["UL16_2_DPM1","11.200.1.4","UL16_8_VFD1","35S-6D3-P101","11.200.1.72"]
["UL16_2_DPM1","11.200.1.4","UL16_9_VFD1","35S-6D2-P101","11.200.1.73"]
["UL16_2_DPM1","11.200.1.4","UL17_1_EX1","FMH","11.200.1.74"]
["UL16_2_DPM1","11.200.1.4","UL17_3_VFD1","35S-6D4-P111","11.200.1.75"]
["UL16_2_DPM1","11.200.1.4","UL17_4_VFD1","35S-6D4-P111","11.200.1.76"]
["UL16_2_DPM1","11.200.1.4","UL17_5_VFD1","35S-6D3-P101","11.200.1.77"]
["UL16_2_DPM1","11.200.1.4","UL17_6_VFD1","35S-6D2-P101","11.200.1.78"]
["UL16_2_DPM1","11.200.1.4","UL17_7_VFD1","35S-6D3-P101","11.200.1.79"]
["UL16_2_DPM1","11.200.1.4","UL17_8_VFD1","35S-6D3-P101","11.200.1.80"]
["UL16_2_DPM1","11.200.1.4","UL17_9_VFD1","35S-6D3-P101","11.200.1.81"]
["UL16_2_DPM1","11.200.1.4","UL17_10_VFD1","35S-6D2-P101","11.200.1.82"]
["UL16_2_DPM1","11.200.1.4","UL16_2_FIO1","5032-8IOLM12DR","11.200.1.83"]
["UL16_2_DPM1","11.200.1.4","UL17_3_FIO1","5032-8IOLM12DR","11.200.1.84"]
["UL18_4_DPM1","11.200.1.5","UL18_1_EX1","FMH","11.200.1.85"]
["UL18_4_DPM1","11.200.1.5","UL18_3_VFD1","35S-6D4-P111","11.200.1.86"]
["UL18_4_DPM1","11.200.1.5","UL18_4_VFD1","35S-6D4-P111","11.200.1.87"]
["UL18_4_DPM1","11.200.1.5","UL18_5_VFD1","35S-6D3-P101","11.200.1.88"]
["UL18_4_DPM1","11.200.1.5","UL18_6_VFD1","35S-6D4-P111","11.200.1.89"]
["UL18_4_DPM1","11.200.1.5","UL18_7_VFD1","35S-6D3-P101","11.200.1.90"]
["UL18_4_DPM1","11.200.1.5","UL18_8_VFD1","35S-6D3-P101","11.200.1.91"]
["UL18_4_DPM1","11.200.1.5","UL18_9_VFD1","35S-6D3-P101","11.200.1.92"]
["UL18_4_DPM1","11.200.1.5","UL18_10_VFD1","35S-6D4-P111","11.200.1.93"]
["UL18_4_DPM1","11.200.1.5","UL18_11_VFD1","35S-6D4-P111","11.200.1.94"]
["UL18_4_DPM1","11.200.1.5","UL18_12_VFD1","35S-6D3-P101","11.200.1.95"]
["UL18_4_DPM1","11.200.1.5","UL18_13A_VFD1","35S-6D3-P101","11.200.1.96"]
["UL18_4_DPM1","11.200.1.5","UL18_13B_VFD1","35S-6D3-P101","11.200.1.97"]
["UL18_4_DPM1","11.200.1.5","UL18_14_VFD1","35S-6D2-P101","11.200.1.98"]
["UL18_4_DPM1","11.200.1.5","UL18_15_VFD1","35S-6D2-P101","11.200.1.99"]
["UL18_4_DPM1","11.200.1.5","UL18_16_VFD1","35S-6D4-P111","11.200.1.100"]
["UL18_4_DPM1","11.200.1.5","UL18_3_FIO1","5032-8IOLM12DR","11.200.1.101"]
["UL18_4_DPM1","11.200.1.5","PDP3_FIO1","5032-8IOLM12DR","11.200.1.190"]
["UL18_4_DPM1","11.200.1.5","PDP3_PMM1","1420-V2-ENT","11.200.1.191"]
["UL18_4_DPM1","11.200.1.5","PDP4_FIO1","5032-8IOLM12DR","11.200.1.192"]
["UL18_4_DPM1","11.200.1.5","PDP4_PMM1","1420-V2-ENT","11.200.1.193"]
["UL18_4_DPM1","11.200.1.5","UL18_16_FIO1","5032-8IOLM12DR","11.200.1.197"]
["UL19_2_DPM1","11.200.1.6","UL19_1_VFD1","35S-6D2-P101","11.200.1.102"]
["UL19_2_DPM1","11.200.1.6","UL19_2_VFD1","35S-6D5-P111","11.200.1.103"]
["UL19_2_DPM1","11.200.1.6","UL19_3_VFD1","35S-6D2-P101","11.200.1.104"]
["UL19_2_DPM1","11.200.1.6","UL19_4_VFD1","35S-6D2-P101","11.200.1.105"]
["UL19_2_DPM1","11.200.1.6","UL19_5_VFD1","35S-6D3-P101","11.200.1.106"]
["UL19_2_DPM1","11.200.1.6","UL19_6_VFD1","35S-6D3-P101","11.200.1.107"]
["UL19_2_DPM1","11.200.1.6","UL19_7_VFD1","35S-6D3-P101","11.200.1.108"]
["UL19_2_DPM1","11.200.1.6","UL19_8_VFD1","35S-6D3-P101","11.200.1.109"]
["UL19_2_DPM1","11.200.1.6","UL19_9_VFD1","35S-6D2-P101","11.200.1.110"]
["UL19_2_DPM1","11.200.1.6","UL20_1_EX1","FMH","11.200.1.111"]
["UL19_2_DPM1","11.200.1.6","UL20_3_VFD1","35S-6D4-P111","11.200.1.112"]
["UL19_2_DPM1","11.200.1.6","UL20_4_VFD1","35S-6D4-P111","11.200.1.113"]
["UL19_2_DPM1","11.200.1.6","UL20_5_VFD1","35S-6D2-P101","11.200.1.114"]
["UL19_2_DPM1","11.200.1.6","UL20_6_VFD1","35S-6D2-P101","11.200.1.115"]
["UL19_2_DPM1","11.200.1.6","UL20_7_VFD1","35S-6D3-P101","11.200.1.116"]
["UL19_2_DPM1","11.200.1.6","UL20_8_VFD1","35S-6D3-P101","11.200.1.117"]
["UL19_2_DPM1","11.200.1.6","UL20_9_VFD1","35S-6D3-P101","11.200.1.118"]
["UL19_2_DPM1","11.200.1.6","UL20_10_VFD1","35S-6D3-P101","11.200.1.119"]
["UL19_2_DPM1","11.200.1.6","UL20_11_VFD1","35S-6D2-P101","11.200.1.120"]
["UL19_2_DPM1","11.200.1.6","UL19_2_FIO1","5032-8IOLM12DR","11.200.1.121"]
["UL19_2_DPM1","11.200.1.6","UL20_3_FIO1","5032-8IOLM12DR","11.200.1.122"]
["UL21_11_DPM1","11.200.1.7","UL21_1_EX1","FMH","11.200.1.123"]
["UL21_11_DPM1","11.200.1.7","UL21_3_VFD1","35S-6D4-P111","11.200.1.124"]
["UL21_11_DPM1","11.200.1.7","UL21_4_VFD1","35S-6D4-P111","11.200.1.125"]
["UL21_11_DPM1","11.200.1.7","UL21_5_VFD1","35S-6D4-P111","11.200.1.126"]
["UL21_11_DPM1","11.200.1.7","UL21_6_VFD1","35S-6D3-P101","11.200.1.127"]
["UL21_11_DPM1","11.200.1.7","UL21_7_VFD1","35S-6D3-P101","11.200.1.128"]
["UL21_11_DPM1","11.200.1.7","UL21_8_VFD1","35S-6D3-P101","11.200.1.129"]
["UL21_11_DPM1","11.200.1.7","UL21_9_VFD1","35S-6D3-P101","11.200.1.130"]
["UL21_11_DPM1","11.200.1.7","UL21_10_VFD1","35S-6D3-P101","11.200.1.131"]
["UL21_11_DPM1","11.200.1.7","UL21_11_VFD1","35S-6D5-P111","11.200.1.132"]
["UL21_11_DPM1","11.200.1.7","UL21_12_VFD1","35S-6D4-P111","11.200.1.133"]
["UL21_11_DPM1","11.200.1.7","UL21_13_VFD1","35S-6D2-P101","11.200.1.134"]
["UL21_11_DPM1","11.200.1.7","UL21_14A_VFD1","35S-6D3-P101","11.200.1.135"]
["UL21_11_DPM1","11.200.1.7","UL21_14B_VFD1","35S-6D3-P101","11.200.1.136"]
["UL21_11_DPM1","11.200.1.7","UL21_15_VFD1","35S-6D2-P101","11.200.1.137"]
["UL21_11_DPM1","11.200.1.7","UL21_16_VFD1","35S-6D2-P101","11.200.1.138"]
["UL21_11_DPM1","11.200.1.7","UL21_17_VFD1","35S-6D4-P111","11.200.1.139"]
["UL21_11_DPM1","11.200.1.7","UL21_3_FIO1","5032-8IOLM12DR","11.200.1.140"]
["UL21_11_DPM1","11.200.1.7","PDP7_FIO1","5032-8IOLM12DR","11.200.1.194"]
["UL21_11_DPM1","11.200.1.7","PDP7_PMM1","1420-V2-ENT","11.200.1.195"]
["UL21_11_DPM1","11.200.1.7","UL21_17_FIO1","5032-8IOLM12DR","11.200.1.198"]
["PS5_7_DPM1","11.200.1.8","PS5_1_VFD1","35S-6D2-P101","11.200.1.141"]
["PS5_7_DPM1","11.200.1.8","PS5_2_VFD1","35S-6D3-P101","11.200.1.142"]
["PS5_7_DPM1","11.200.1.8","PS5_3_VFD1","35S-6D2-P101","11.200.1.143"]
["PS5_7_DPM1","11.200.1.8","PS5_4_VFD1","35S-6D3-P101","11.200.1.144"]
["PS5_7_DPM1","11.200.1.8","PS5_5_VFD1","35S-6D4-P111","11.200.1.145"]
["PS5_7_DPM1","11.200.1.8","PS5_6_VFD1","35S-6D4-P111","11.200.1.146"]
["PS5_7_DPM1","11.200.1.8","PS5_7_VFD1","35S-6D6-P111","11.200.1.147"]
["PS5_7_DPM1","11.200.1.8","PS5_8_VFD1","35S-6D4-P111","11.200.1.148"]
["PS5_7_DPM1","11.200.1.8","PS5_9_VFD1","35S-6D3-P101","11.200.1.149"]
["PS5_7_DPM1","11.200.1.8","PS5_10_VFD1","35S-6D6-P111","11.200.1.150"]
["PS5_7_DPM1","11.200.1.8","PS5_11_VFD1","35S-6D2-P101","11.200.1.151"]
["PS5_7_DPM1","11.200.1.8","PS5_12_VFD1","35S-6D6-P111","11.200.1.152"]
["PS5_7_DPM1","11.200.1.8","PS5_13_VFD1","35S-6D3-P101","11.200.1.153"]
["PS6_7_DPM1","11.200.1.9","PS6_1_VFD1","35S-6D2-P101","11.200.1.154"]
["PS6_7_DPM1","11.200.1.9","PS6_2_VFD1","35S-6D3-P101","11.200.1.155"]
["PS6_7_DPM1","11.200.1.9","PS6_3_VFD1","35S-6D2-P101","11.200.1.156"]
["PS6_7_DPM1","11.200.1.9","PS6_4_VFD1","35S-6D3-P101","11.200.1.157"]
["PS6_7_DPM1","11.200.1.9","PS6_5_VFD1","35S-6D4-P111","11.200.1.158"]
["PS6_7_DPM1","11.200.1.9","PS6_6_VFD1","35S-6D4-P111","11.200.1.159"]
["PS6_7_DPM1","11.200.1.9","PS6_7_VFD1","35S-6D5-P111","11.200.1.160"]
["PS6_7_DPM1","11.200.1.9","PS6_8_VFD1","35S-6D4-P111","11.200.1.161"]
["PS6_7_DPM1","11.200.1.9","PS6_9_VFD1","35S-6D3-P101","11.200.1.162"]
["PS6_7_DPM1","11.200.1.9","PS6_10_VFD1","35S-6D6-P111","11.200.1.163"]
["PS6_7_DPM1","11.200.1.9","PS6_11_VFD1","35S-6D3-P101","11.200.1.164"]
["PS6_7_DPM1","11.200.1.9","PS6_12_VFD1","35S-6D6-P111","11.200.1.165"]
["PS6_7_DPM1","11.200.1.9","PS6_13_VFD1","35S-6D3-P101","11.200.1.166"]
["PS7_7_DPM1","11.200.1.10","PS7_1_VFD1","35S-6D2-P101","11.200.1.167"]
["PS7_7_DPM1","11.200.1.10","PS7_2_VFD1","35S-6D3-P101","11.200.1.168"]
["PS7_7_DPM1","11.200.1.10","PS7_3_VFD1","35S-6D2-P101","11.200.1.169"]
["PS7_7_DPM1","11.200.1.10","PS7_4_VFD1","35S-6D3-P101","11.200.1.170"]
["PS7_7_DPM1","11.200.1.10","PS7_5_VFD1","35S-6D5-P111","11.200.1.171"]
["PS7_7_DPM1","11.200.1.10","PS7_6_VFD1","35S-6D5-P111","11.200.1.172"]
["PS7_7_DPM1","11.200.1.10","PS7_7_VFD1","35S-6D6-P111","11.200.1.173"]
["PS7_7_DPM1","11.200.1.10","PS7_8_VFD1","35S-6D6-P111","11.200.1.174"]
["PS7_7_DPM1","11.200.1.10","PS7_9_VFD1","35S-6D5-P111","11.200.1.175"]
["PS7_7_DPM1","11.200.1.10","PS7_10_VFD1","35S-6D3-P101","11.200.1.176"]
["PS7_7_DPM1","11.200.1.10","PS7_11_VFD1","35S-6D3-P101","11.200.1.177"]
["PS7_7_DPM1","11.200.1.10","PS7_12_VFD1","35S-6D3-P101","11.200.1.178"]
["PS7_7_DPM1","11.200.1.10","PS7_13_VFD1","35S-6D3-P101","11.200.1.179"]
["PS7_7_DPM1","11.200.1.10","PS7_14_VFD1","35S-6D5-P111","11.200.1.180"]