{"text_format":"1","workbook":"xlsx","n_sheets":9,"sheets":["Templates","Devices","Instructions","NETWORK","Part Number","IO Assignment MCM02","MCM02_DESC","DESC_PLC","NETWORK_PLC"],"not_rendered":{"charts":0,"images":10,"macros":1,"external_links":0,"defined_names":5,"comments":3,"pivot_tables":0},"unopened":[],"bounds":{"document_bytes":16777216,"sheet_cells":100000,"rows_first":2000,"rows_last":500,"rows_between":2000,"halvings":0,"cell_chars":16384,"cell_head_chars":4096},"cells_cut":0,"cells_raw":0,"read":"whole","date_system":"1900"}

{"sheet":"Templates","index":0,"n_rows":19,"n_cols":3,"rows_kept":19,"cut":false,"hidden":false,"merged":[]}
[]
["VFD IO TEMPLATE",null,"FIO IO Template"]
["I0",null,"IO00"]
["I1",null,"IO01"]
["I2",null,"IO02"]
["I3",null,"IO03"]
["IO0",null,"IO04"]
["IO1",null,"IO05"]
["SI0",null,"IO06"]
["SI1",null,"IO07"]
["SI2",null,"IO08"]
["SI3",null,"IO09"]
["SO0",null,"IO10"]
[null,null,"IO11"]
[null,null,"IO12"]
[null,null,"IO13"]
[null,null,"IO14"]
[null,null,"IO15"]
[null,null,"IO16"]

{"sheet":"Devices","index":1,"n_rows":827,"n_cols":9,"rows_kept":827,"cut":false,"hidden":false,"merged":[]}
[null,null,null,null,null,null,null,"Which MCM we assign?","MCM02"]
["PS5_1_BCN1_R"]
["PS5_1_DISC"]
["PS5_1_EPC1"]
["PS5_1_EPC1_2"]
["PS5_1_EPC2"]
["PS5_1_EPC2_2"]
["PS5_1_S1_PB"]
["PS5_1_S1_PB_LT"]
["PS5_1_S2_PB"]
["PS5_1_S2_PB_LT"]
["PS5_1_VFD1"]
["PS5_10_DISC"]
["PS5_10_JR1_PB"]
["PS5_10_JR1_PB_LT"]
["PS5_10_TPE1"]
["PS5_10_TPE2"]
["PS5_10_VFD1"]
["PS5_11_BCN1_A"]
["PS5_11_DISC"]
{"$rows_left_out":808}
{"sheet":"Instructions","index":2,"n_rows":116,"n_cols":2,"rows_kept":116,"cut":false,"hidden":false,"merged":[]}
[]
["1. ","Put all device tags to cell A2"]
[]
[]
[]
[]
[]
[]
[]
[]
[]
[]
[]
[]
[]
[]
[]
[]
[]
[]
{"$rows_left_out":97}
{"sheet":"NETWORK","index":3,"n_rows":163,"n_cols":23,"rows_kept":163,"cut":false,"hidden":false,"merged":[[149,3,162,3],[149,4,162,4],[136,3,148,3],[136,4,148,4],[3,3,26,3],[3,4,26,4],[59,3,80,3],[59,4,80,4],[102,3,122,3],[102,4,122,4],[27,3,38,3],[27,4,38,4],[123,3,135,3],[123,4,135,4],[1,5,1,7],[120,8,121,8],[39,3,58,3],[39,4,58,4],[76,8,79,8],[123,2,135,2],[81,3,101,3],[81,4,101,4],[81,2,101,2],[1,3,1,4]]}
[null,"MCM07"]
["SLOT0","1756-L83ES","IP","RING",null,"STAR",null,null,null,null,null,null,null,null,null,null,null,null,null,"VFD",null,"HP","PART NUMBER"]
["SLOT1","1756-N2",null,"DPM","IP","VFD NAME","VFD PART NUMBER","IP",null,null,null,null,null,null,null,"UL13_8_DPM1",{"$f":"_xlfn.CONCAT(P3,\"_ENET\")","v":"UL13_8_DPM1_ENET"},"UL13_8_DPM1_ENET",null,{"$f":"_xlfn.CONCAT(U3,\"_VFD1\")","v":"UL13_1_VFD1"},"UL13_1",2,{"$f":"VLOOKUP(V3,'Part Number'!$C$1:$D$13,2,FALSE)","v":"35S-6D2-P101"}]
["SLOT2","1756-EN4TR","11.200.1.1","UL13_8_DPM1","11.200.1.2","UL13_1_VFD1","35S-6D2-P101","11.200.1.30",null,null,null,null,null,null,null,"UL15_4_DPM1",{"$f":"_xlfn.CONCAT(P4,\"_ENET\")","v":"UL15_4_DPM1_ENET"},"UL15_4_DPM1_ENET",null,{"$f":"_xlfn.CONCAT(U4,\"_VFD1\")","v":"UL13_2_VFD1"},"UL13_2",7.5,{"$f":"VLOOKUP(V4,'Part Number'!$C$1:$D$13,2,FALSE)","v":"35S-6D5-P111"}]
["SLOT3","1756-N2",null,null,null,"UL13_2_VFD1","35S-6D5-P111","11.200.1.31",null,null,null,null,null,null,null,"UL16_2_DPM1","UL16_2_DPM1_ENET","UL16_2_DPM1_ENET",null,"UL13_3_VFD1","UL13_3",3,{"$f":"VLOOKUP(V5,'Part Number'!$C$1:$D$13,2,FALSE)","v":"35S-6D3-P101"}]
["SLOT4","1756-N2",null,null,null,"UL13_3_VFD1","35S-6D3-P101","11.200.1.32",null,null,null,null,null,null,null,"UL18_4_DPM1","UL18_4_DPM1_ENET","UL18_4_DPM1_ENET",null,"UL13_4_VFD1","UL13_4",3,{"$f":"VLOOKUP(V6,'Part Number'!$C$1:$D$13,2,FALSE)","v":"35S-6D3-P101"}]
["SLOT5","1756-IB16",null,null,null,"UL13_4_VFD1","35S-6D3-P101","11.200.1.33",null,null,null,null,null,null,null,"UL19_2_DPM1","UL19_2_DPM1_ENET","UL19_2_DPM1_ENET",null,"UL13_5_VFD1","UL13_5",3,{"$f":"VLOOKUP(V7,'Part Number'!$C$1:$D$13,2,FALSE)","v":"35S-6D3-P101"}]
["SLOT6","1756-OB16E",null,null,null,"UL13_5_VFD1","35S-6D3-P101","11.200.1.34",null,null,null,null,null,null,null,"UL21_11_DPM1","UL21_11_DPM1_ENET","UL21_11_DPM1_ENET",null,"UL13_6_VFD1","UL13_6",3,{"$f":"VLOOKUP(V8,'Part Number'!$C$1:$D$13,2,FALSE)","v":"35S-6D3-P101"}]
["SLOT7","1756-IB16S",null,null,null,"UL13_6_VFD1","35S-6D3-P101","11.200.1.35",null,null,null,null,null,null,null,"PS5_7_DPM1","PS5_7_DPM1_ENET","PS5_7_DPM1_ENET",null,"UL13_7_VFD1","UL13_7",3,{"$f":"VLOOKUP(V9,'Part Number'!$C$1:$D$13,2,FALSE)","v":"35S-6D3-P101"}]
["SLOT8","1756-N2",null,null,null,"UL13_7_VFD1","35S-6D3-P101","11.200.1.36",null,null,null,null,null,null,null,"PS6_7_DPM1","PS6_7_DPM1_ENET","PS6_7_DPM1_ENET",null,"UL13_8_VFD1","UL13_8",5,{"$f":"VLOOKUP(V10,'Part Number'!$C$1:$D$13,2,FALSE)","v":"35S-6D4-P111"}]
["SLOT9","1756-N2",null,null,null,"UL13_8_VFD1","35S-6D4-P111","11.200.1.37",null,null,null,null,null,null,null,"PS7_7_DPM1","PS7_7_DPM1_ENET","PS7_7_DPM1_ENET",null,"UL13_9A_VFD1","UL13_9A",3,{"$f":"VLOOKUP(V11,'Part Number'!$C$1:$D$13,2,FALSE)","v":"35S-6D3-P101"}]
[null,null,null,null,null,"UL13_9A_VFD1","35S-6D3-P101","11.200.1.38",null,null,null,null,null,null,null,null,null,null,null,"UL13_9B_VFD1","UL13_9B",3,{"$f":"VLOOKUP(V12,'Part Number'!$C$1:$D$13,2,FALSE)","v":"35S-6D3-P101"}]
[null,null,null,null,null,"UL13_9B_VFD1","35S-6D3-P101","11.200.1.39",null,null,null,null,null,null,null,null,null,null,null,"UL13_10_VFD1","UL13_10",2,{"$f":"VLOOKUP(V13,'Part Number'!$C$1:$D$13,2,FALSE)","v":"35S-6D2-P101"}]
["DPM COUNT",9,null,null,null,"UL13_10_VFD1","35S-6D2-P101","11.200.1.40",null,null,null,null,null,null,null,null,null,null,null,"UL13_11_VFD1","UL13_11",2,{"$f":"VLOOKUP(V14,'Part Number'!$C$1:$D$13,2,FALSE)","v":"35S-6D2-P101"}]
[null,null,null,null,null,"UL13_11_VFD1","35S-6D2-P101","11.200.1.41",null,null,null,null,null,null,null,null,null,null,null,"UL13_12_VFD1","UL13_12",5,{"$f":"VLOOKUP(V15,'Part Number'!$C$1:$D$13,2,FALSE)","v":"35S-6D4-P111"}]
[null,null,null,null,null,"UL13_12_VFD1","35S-6D4-P111","11.200.1.42","add",null,null,null,null,null,null,null,null,null,null,"UL14_3_VFD1","UL14_3",5,{"$f":"VLOOKUP(V16,'Part Number'!$C$1:$D$13,2,FALSE)","v":"35S-6D4-P111"}]
[null,null,null,null,null,"UL14_1_EX1","CALJAN","11.200.1.43",null,null,null,null,null,null,null,null,null,null,null,"UL14_4_VFD1","UL14_4",5,{"$f":"VLOOKUP(V17,'Part Number'!$C$1:$D$13,2,FALSE)","v":"35S-6D4-P111"}]
[null,null,null,null,null,"UL14_3_VFD1","35S-6D4-P111","11.200.1.44",null,null,null,null,null,null,null,null,null,null,null,"UL14_5_VFD1","UL14_5",3,{"$f":"VLOOKUP(V18,'Part Number'!$C$1:$D$13,2,FALSE)","v":"35S-6D3-P101"}]
[null,null,null,null,null,"UL14_4_VFD1","35S-6D4-P111","11.200.1.45",null,null,null,null,null,null,null,null,null,null,null,"UL14_6_VFD1","UL14_6",2,{"$f":"VLOOKUP(V19,'Part Number'!$C$1:$D$13,2,FALSE)","v":"35S-6D2-P101"}]
[null,null,null,null,null,"UL14_5_VFD1","35S-6D3-P101","11.200.1.46",null,null,null,null,null,null,null,null,null,null,null,"UL14_7_VFD1","UL14_7",3,{"$f":"VLOOKUP(V20,'Part Number'!$C$1:$D$13,2,FALSE)","v":"35S-6D3-P101"}]
{"$rows_left_out":144}
{"sheet":"Part Number","index":4,"n_rows":13,"n_cols":4,"rows_kept":13,"cut":false,"hidden":false,"merged":[]}
[null,"PART NUMBER","HP","PART NUMBER"]
[null,"35S-6D2-P101",2,"35S-6D2-P101"]
[null,"35S-6D3-P101",3,"35S-6D3-P101"]
[null,"35S-6D4-P111",5,"35S-6D4-P111"]
[null,"35S-6D5-P111",7.5,"35S-6D5-P111"]
[null,"35S-6D6-P111",10,"35S-6D6-P111"]
[null,"25B-D024N104",15,"25B-D024N104"]
[null,"25B-D030N104",20,"25B-D030N104"]
[null,"25B-D043N114 ",30,"25B-D043N114 "]
[null,"CALJAN","EXTENDO","CALJAN"]
[null,"PIONEER","TIPPER","PIONEER"]
[null,"ZMX-3DE2500HF-Q7-AMZCHD","ZMX","ZMX-3DE2500HF-Q7-AMZCHD"]
[null,"5032-8IOLM12DR","FIO","5032-8IOLM12DR"]

{"sheet":"IO Assignment MCM02","index":5,"n_rows":1689,"n_cols":11,"rows_kept":1689,"cut":false,"hidden":false,"merged":[]}
["Controller name","Signal type","Address name","Assigned device","Unassigned Device",null,null,null,null,null,"MCM02_DESC"]
["PS5_1_VFD1","I0","PS5_1_VFD1_I0","PS5_1_DISC"]
["PS5_1_VFD1","I1","PS5_1_VFD1_I1"]
["PS5_1_VFD1","I2","PS5_1_VFD1_I2"]
["PS5_1_VFD1","I3","PS5_1_VFD1_I3"]
["PS5_1_VFD1","IO0","PS5_1_VFD1_IO0","PS5_1_S1_PB"]
["PS5_1_VFD1","IO1","PS5_1_VFD1_IO1","PS5_1_S1_PB_LT"]
["PS5_1_VFD1","SI0","PS5_1_VFD1_SI0","PS5_1_EPC1"]
["PS5_1_VFD1","SI1","PS5_1_VFD1_SI1","PS5_1_EPC1_2"]
["PS5_1_VFD1","SI2","PS5_1_VFD1_SI2","PS5_1_EPC2"]
["PS5_1_VFD1","SI3","PS5_1_VFD1_SI3","PS5_1_EPC2_2"]
["PS5_1_VFD1","SO0","PS5_1_VFD1_SO0","PS5_1_BCN1_R"]
["PS5_10_VFD1","I0","PS5_10_VFD1_I0","PS5_10_DISC"]
["PS5_10_VFD1","I1","PS5_10_VFD1_I1"]
["PS5_10_VFD1","I2","PS5_10_VFD1_I2","PS5_10_TPE1"]
["PS5_10_VFD1","I3","PS5_10_VFD1_I3","PS5_10_TPE2"]
["PS5_10_VFD1","IO0","PS5_10_VFD1_IO0","PS5_10_JR1_PB"]
["PS5_10_VFD1","IO1","PS5_10_VFD1_IO1","PS5_10_JR1_PB_LT"]
["PS5_10_VFD1","SI0","PS5_10_VFD1_SI0"]
["PS5_10_VFD1","SI1","PS5_10_VFD1_SI1"]
{"$rows_left_out":1670}
{"sheet":"MCM02_DESC","index":6,"n_rows":1788,"n_cols":22,"rows_kept":1788,"cut":false,"hidden":false,"merged":[[1692,5,1787,5],[1644,5,1691,5],[26,8,30,8],[1,8,5,8],[6,8,10,8],[11,8,15,8],[16,8,20,8],[21,8,25,8],[86,8,90,8],[31,8,35,8],[36,8,40,8],[41,8,45,8],[46,8,50,8],[51,8,55,8],[56,8,60,8],[61,8,65,8],[66,8,70,8],[71,8,75,8],[76,8,80,8],[81,8,85,8],[146,8,150,8],[91,8,95,8],[96,8,100,8],[101,8,105,8],[106,8,110,8],[111,8,115,8],[116,8,120,8],[121,8,125,8],[126,8,130,8],[131,8,135,8],[136,8,140,8],[141,8,145,8],[181,8,185,8],[151,8,155,8],[156,8,160,8],[161,8,165,8],[166,8,170,8],[171,8,175,8],[176,8,180,8]]}
["TAGNAME","ADDR","TERM","TERMDESC","DESCA","DESCB",null,"CONTROLLERS"]
["PS5_1_VFD1","PS5_1_VFD1_I0","I0",null,"PS5_1_DISC","DISCONNECT AUX",null,"PS5_1_VFD1",600,null,{"$f":"_xlfn.CONCAT(H2,\"/\",H3,\"/\",H4,\"/\",H5,\" IO DRAWINGS\")","v":"PS5_1_VFD1/PS5_10_VFD1/PS5_11_VFD1/PS5_12_VFD1 IO DRAWINGS"},null,null,null,null,null,null,null,null,null,null,"PS5_1_VFD1/PS5_10_VFD1/PS5_11_VFD1/PS5_12_VFD1 IO DRAWINGS"]
["PS5_1_VFD1","PS5_1_VFD1_I1","I1",null,"SPARE",null,null,"PS5_10_VFD1",null,null,{"$f":"_xlfn.CONCAT(H7,\"/\",H8,\"/\",H9,\"/\",H10,\" IO DRAWINGS\")","v":"PS5_13_VFD1/PS5_2_VFD1/PS5_3_VFD1/PS5_4_VFD1 IO DRAWINGS"},null,null,null,null,null,null,null,null,null,null,"PS5_13_VFD1/PS5_2_VFD1/PS5_3_VFD1/PS5_4_VFD1 IO DRAWINGS"]
["PS5_1_VFD1","PS5_1_VFD1_I2","I2",null,"SPARE",null,null,"PS5_11_VFD1",null,null,{"$f":"_xlfn.CONCAT(H12,\"/\",H13,\"/\",H14,\"/\",H15,\" IO DRAWINGS\")","v":"PS5_5_VFD1/PS5_6_VFD1/PS5_7_VFD1/PS5_8_VFD1 IO DRAWINGS"},null,null,null,null,null,null,null,null,null,null,"PS5_5_VFD1/PS5_6_VFD1/PS5_7_VFD1/PS5_8_VFD1 IO DRAWINGS"]
["PS5_1_VFD1","PS5_1_VFD1_I3","I3",null,"SPARE",null,null,"PS5_12_VFD1",null,null,{"$f":"_xlfn.CONCAT(H17,\"/\",H18,\"/\",H19,\"/\",H20,\" IO DRAWINGS\")","v":"PS5_9_VFD1/PS6_1_VFD1/PS6_10_VFD1/PS6_11_VFD1 IO DRAWINGS"},null,null,null,null,null,null,null,null,null,null,"PS5_9_VFD1/PS6_1_VFD1/PS6_10_VFD1/PS6_11_VFD1 IO DRAWINGS"]
["PS5_1_VFD1","PS5_1_VFD1_IO0","IO0",null,"PS5_1_S1_PB","START PUSHBUTTON",null,null,null,null,{"$f":"_xlfn.CONCAT(H22,\"/\",H23,\"/\",H24,\"/\",H25,\" IO DRAWINGS\")","v":"PS6_12_VFD1/PS6_13_VFD1/PS6_2_VFD1/PS6_3_VFD1 IO DRAWINGS"},null,null,null,null,null,null,null,null,null,null,"PS6_12_VFD1/PS6_13_VFD1/PS6_2_VFD1/PS6_3_VFD1 IO DRAWINGS"]
["PS5_1_VFD1","PS5_1_VFD1_IO1","IO1",null,"PS5_1_S1_PB_LT","START PUSHBUTTON LIGHT",null,"PS5_13_VFD1",601,null,{"$f":"_xlfn.CONCAT(H27,\"/\",H28,\"/\",H29,\"/\",H30,\" IO DRAWINGS\")","v":"PS6_4_VFD1/PS6_5_VFD1/PS6_6_VFD1/PS6_7_VFD1 IO DRAWINGS"},null,null,null,null,null,null,null,null,null,null,"PS6_4_VFD1/PS6_5_VFD1/PS6_6_VFD1/PS6_7_VFD1 IO DRAWINGS"]
["PS5_1_VFD1","PS5_1_VFD1_SI0","SI0",null,"PS5_1_EPC1","E-STOP PULLCORD",null,"PS5_2_VFD1",null,null,{"$f":"_xlfn.CONCAT(H32,\"/\",H33,\"/\",H34,\"/\",H35,\" IO DRAWINGS\")","v":"PS6_8_VFD1/PS6_9_VFD1/PS7_1_VFD1/PS7_10_VFD1 IO DRAWINGS"},null,null,null,null,null,null,null,null,null,null,"PS6_8_VFD1/PS6_9_VFD1/PS7_1_VFD1/PS7_10_VFD1 IO DRAWINGS"]
["PS5_1_VFD1","PS5_1_VFD1_SI1","SI1",null,"PS5_1_EPC1_2","E-STOP PULLCORD",null,"PS5_3_VFD1",null,null,{"$f":"_xlfn.CONCAT(H37,\"/\",H38,\"/\",H39,\"/\",H40,\" IO DRAWINGS\")","v":"PS7_11_VFD1/PS7_12_VFD1/PS7_13_VFD1/PS7_14_VFD1 IO DRAWINGS"},null,null,null,null,null,null,null,null,null,null,"PS7_11_VFD1/PS7_12_VFD1/PS7_13_VFD1/PS7_14_VFD1 IO DRAWINGS"]
["PS5_1_VFD1","PS5_1_VFD1_SI2","SI2",null,"PS5_1_EPC2","E-STOP PULLCORD",null,"PS5_4_VFD1",null,null,{"$f":"_xlfn.CONCAT(H42,\"/\",H43,\"/\",H44,\"/\",H45,\" IO DRAWINGS\")","v":"PS7_2_VFD1/PS7_3_VFD1/PS7_4_VFD1/PS7_5_VFD1 IO DRAWINGS"},null,null,null,null,null,null,null,null,null,null,"PS7_2_VFD1/PS7_3_VFD1/PS7_4_VFD1/PS7_5_VFD1 IO DRAWINGS"]
["PS5_1_VFD1","PS5_1_VFD1_SI3","SI3",null,"PS5_1_EPC2_2","E-STOP PULLCORD",null,null,null,null,{"$f":"_xlfn.CONCAT(H47,\"/\",H48,\"/\",H49,\"/\",H50,\" IO DRAWINGS\")","v":"PS7_6_VFD1/PS7_7_VFD1/PS7_8_VFD1/PS7_9_VFD1 IO DRAWINGS"},null,null,null,null,null,null,null,null,null,null,"PS7_6_VFD1/PS7_7_VFD1/PS7_8_VFD1/PS7_9_VFD1 IO DRAWINGS"]
["PS5_1_VFD1","PS5_1_VFD1_SO0","SO0",null,"PS5_1_BCN1_R","RED BEACON LIGHT",null,"PS5_5_VFD1",602,null,{"$f":"_xlfn.CONCAT(H52,\"/\",H53,\"/\",H54,\"/\",H55,\" IO DRAWINGS\")","v":"UL13_1_VFD1/UL13_10_VFD1/UL13_11_VFD1/UL13_12_VFD1 IO DRAWINGS"},null,null,null,null,null,null,null,null,null,null,"UL13_1_VFD1/UL13_10_VFD1/UL13_11_VFD1/UL13_12_VFD1 IO DRAWINGS"]
["PS5_10_VFD1","PS5_10_VFD1_I0","I0",null,"PS5_10_DISC","DISCONNECT AUX",null,"PS5_6_VFD1",null,null,{"$f":"_xlfn.CONCAT(H57,\"/\",H58,\"/\",H59,\"/\",H60,\" IO DRAWINGS\")","v":"UL13_2_VFD1/UL13_3_VFD1/UL13_4_VFD1/UL13_5_VFD1 IO DRAWINGS"},null,null,null,null,null,null,null,null,null,null,"UL13_2_VFD1/UL13_3_VFD1/UL13_4_VFD1/UL13_5_VFD1 IO DRAWINGS"]
["PS5_10_VFD1","PS5_10_VFD1_I1","I1",null,"SPARE",null,null,"PS5_7_VFD1",null,null,{"$f":"_xlfn.CONCAT(H62,\"/\",H63,\"/\",H64,\"/\",H65,\" IO DRAWINGS\")","v":"UL13_6_VFD1/UL13_7_VFD1/UL13_8_VFD1/UL13_9A_VFD1 IO DRAWINGS"},null,null,null,null,null,null,null,null,null,null,"UL13_6_VFD1/UL13_7_VFD1/UL13_8_VFD1/UL13_9A_VFD1 IO DRAWINGS"]
["PS5_10_VFD1","PS5_10_VFD1_I2","I2",null,"PS5_10_TPE1","TRACKING PHOTOEYE",null,"PS5_8_VFD1",null,null,{"$f":"_xlfn.CONCAT(H67,\"/\",H68,\"/\",H69,\"/\",H70,\" IO DRAWINGS\")","v":"UL13_9B_VFD1/UL14_10_VFD1/UL14_3_VFD1/UL14_4_VFD1 IO DRAWINGS"},null,null,null,null,null,null,null,null,null,null,"UL13_9B_VFD1/UL14_10_VFD1/UL14_3_VFD1/UL14_4_VFD1 IO DRAWINGS"]
["PS5_10_VFD1","PS5_10_VFD1_I3","I3",null,"PS5_10_TPE2","TRACKING PHOTOEYE",null,null,null,null,{"$f":"_xlfn.CONCAT(H72,\"/\",H73,\"/\",H74,\"/\",H75,\" IO DRAWINGS\")","v":"UL14_5_VFD1/UL14_6_VFD1/UL14_7_VFD1/UL14_8_VFD1 IO DRAWINGS"},null,null,null,null,null,null,null,null,null,null,"UL14_5_VFD1/UL14_6_VFD1/UL14_7_VFD1/UL14_8_VFD1 IO DRAWINGS"]
["PS5_10_VFD1","PS5_10_VFD1_IO0","IO0",null,"PS5_10_JR1_PB","JAM RESET PUSHBUTTON",null,"PS5_9_VFD1",603,null,{"$f":"_xlfn.CONCAT(H77,\"/\",H78,\"/\",H79,\"/\",H80,\" IO DRAWINGS\")","v":"UL14_9_VFD1/UL15_10_VFD1/UL15_11_VFD1/UL15_3_VFD1 IO DRAWINGS"},null,null,null,null,null,null,null,null,null,null,"UL14_9_VFD1/UL15_10_VFD1/UL15_11_VFD1/UL15_3_VFD1 IO DRAWINGS"]
["PS5_10_VFD1","PS5_10_VFD1_IO1","IO1",null,"PS5_10_JR1_PB_LT","JAM RESET PUSHBUTTON LIGHT",null,"PS6_1_VFD1",null,null,{"$f":"_xlfn.CONCAT(H82,\"/\",H83,\"/\",H84,\"/\",H85,\" IO DRAWINGS\")","v":"UL15_4_VFD1/UL15_5_VFD1/UL15_6_VFD1/UL15_7_VFD1 IO DRAWINGS"},null,null,null,null,null,null,null,null,null,null,"UL15_4_VFD1/UL15_5_VFD1/UL15_6_VFD1/UL15_7_VFD1 IO DRAWINGS"]
["PS5_10_VFD1","PS5_10_VFD1_SI0","SI0",null,"SPARE",null,null,"PS6_10_VFD1",null,null,{"$f":"_xlfn.CONCAT(H87,\"/\",H88,\"/\",H89,\"/\",H90,\" IO DRAWINGS\")","v":"UL15_8_VFD1/UL15_9_VFD1/UL16_1_VFD1/UL16_2_VFD1 IO DRAWINGS"},null,null,null,null,null,null,null,null,null,null,"UL15_8_VFD1/UL15_9_VFD1/UL16_1_VFD1/UL16_2_VFD1 IO DRAWINGS"]
["PS5_10_VFD1","PS5_10_VFD1_SI1","SI1",null,"SPARE",null,null,"PS6_11_VFD1",null,null,{"$f":"_xlfn.CONCAT(H92,\"/\",H93,\"/\",H94,\"/\",H95,\" IO DRAWINGS\")","v":"UL16_3_VFD1/UL16_4_VFD1/UL16_5_VFD1/UL16_6_VFD1 IO DRAWINGS"},null,null,null,null,null,null,null,null,null,null,"UL16_3_VFD1/UL16_4_VFD1/UL16_5_VFD1/UL16_6_VFD1 IO DRAWINGS"]
{"$rows_left_out":1769}
{"sheet":"DESC_PLC","index":7,"n_rows":1837,"n_cols":4,"rows_kept":1837,"cut":false,"hidden":false,"merged":[]}
["TAGNAME","TERM","DESCA","DESCB"]
["PS5_1_VFD1","I0","PS5_1_DISC","DISCONNECT AUX"]
["PS5_1_VFD1","I1","SPARE"]
["PS5_1_VFD1","I2","SPARE"]
["PS5_1_VFD1","I3","SPARE"]
["PS5_1_VFD1","IO0","PS5_1_S1_PB","START PUSHBUTTON"]
["PS5_1_VFD1","IO1","PS5_1_S1_PB_LT","START PUSHBUTTON LIGHT"]
["PS5_1_VFD1","SI0","PS5_1_EPC1","E-STOP PULLCORD"]
["PS5_1_VFD1","SI1","PS5_1_EPC1_2","E-STOP PULLCORD"]
["PS5_1_VFD1","SI2","PS5_1_EPC2","E-STOP PULLCORD"]
["PS5_1_VFD1","SI3","PS5_1_EPC2_2","E-STOP PULLCORD"]
["PS5_1_VFD1","SO0","PS5_1_BCN1_R","RED BEACON LIGHT"]
["PS5_10_VFD1","I0","PS5_10_DISC","DISCONNECT AUX"]
["PS5_10_VFD1","I1","SPARE"]
["PS5_10_VFD1","I2","PS5_10_TPE1","TRACKING PHOTOEYE"]
["PS5_10_VFD1","I3","PS5_10_TPE2","TRACKING PHOTOEYE"]
["PS5_10_VFD1","IO0","PS5_10_JR1_PB","JAM RESET PUSHBUTTON"]
["PS5_10_VFD1","IO1","PS5_10_JR1_PB_LT","JAM RESET PUSHBUTTON LIGHT"]
["PS5_10_VFD1","SI0","SPARE"]
["PS5_10_VFD1","SI1","SPARE"]
{"$rows_left_out":1818}
{"sheet":"NETWORK_PLC","index":8,"n_rows":161,"n_cols":5,"rows_kept":161,"cut":false,"hidden":false,"merged":[]}
["DPM","DPM_IP","Name","PartNumber","IP"]
["UL13_8_DPM1","11.200.1.2","UL13_1_VFD1","35S-6D2-P101","11.200.1.30"]
["UL13_8_DPM1","11.200.1.2","UL13_2_VFD1","35S-6D5-P111","11.200.1.31"]
["UL13_8_DPM1","11.200.1.2","UL13_3_VFD1","35S-6D3-P101","11.200.1.32"]
["UL13_8_DPM1","11.200.1.2","UL13_4_VFD1","35S-6D3-P101","11.200.1.33"]
["UL13_8_DPM1","11.200.1.2","UL13_5_VFD1","35S-6D3-P101","11.200.1.34"]
["UL13_8_DPM1","11.200.1.2","UL13_6_VFD1","35S-6D3-P101","11.200.1.35"]
["UL13_8_DPM1","11.200.1.2","UL13_7_VFD1","35S-6D3-P101","11.200.1.36"]
["UL13_8_DPM1","11.200.1.2","UL13_8_VFD1","35S-6D4-P111","11.200.1.37"]
["UL13_8_DPM1","11.200.1.2","UL13_9A_VFD1","35S-6D3-P101","11.200.1.38"]
["UL13_8_DPM1","11.200.1.2","UL13_9B_VFD1","35S-6D3-P101","11.200.1.39"]
["UL13_8_DPM1","11.200.1.2","UL13_10_VFD1","35S-6D2-P101","11.200.1.40"]
["UL13_8_DPM1","11.200.1.2","UL13_11_VFD1","35S-6D2-P101","11.200.1.41"]
["UL13_8_DPM1","11.200.1.2","UL13_12_VFD1","35S-6D4-P111","11.200.1.42"]
["UL13_8_DPM1","11.200.1.2","UL14_1_EX1","FMH","11.200.1.43"]
["UL13_8_DPM1","11.200.1.2","UL14_3_VFD1","35S-6D4-P111","11.200.1.44"]
["UL13_8_DPM1","11.200.1.2","UL14_4_VFD1","35S-6D4-P111","11.200.1.45"]
["UL13_8_DPM1","11.200.1.2","UL14_5_VFD1","35S-6D3-P101","11.200.1.46"]
["UL13_8_DPM1","11.200.1.2","UL14_6_VFD1","35S-6D2-P101","11.200.1.47"]
["UL13_8_DPM1","11.200.1.2","UL14_7_VFD1","35S-6D3-P101","11.200.1.48"]
{"$rows_left_out":141}