{"text_format":"1","workbook":"xlsx","n_sheets":8,"sheets":["Templates","Devices","Instructions","IO Assignment MCM03","NETWORK","Part number","MCM03_DESC","IO Assignment MCM04"],"not_rendered":{"charts":0,"images":10,"macros":1,"external_links":0,"defined_names":5,"comments":2,"pivot_tables":0},"unopened":[],"bounds":{"document_bytes":16777216,"sheet_cells":100000,"rows_first":2000,"rows_last":500,"rows_between":2000,"halvings":0,"cell_chars":16384,"cell_head_chars":4096},"cells_cut":0,"cells_raw":0,"read":"whole","date_system":"1900"}

{"sheet":"Templates","index":0,"n_rows":19,"n_cols":3,"rows_kept":19,"cut":false,"hidden":true,"merged":[]}
[]
["VFD IO TEMPLATE",null,"FIO IO Template"]
["I0",null,"IO00"]
["I1",null,"IO01"]
["I2",null,"IO02"]
["I3",null,"IO03"]
["IO0",null,"IO04"]
["IO1",null,"IO05"]
["SI0",null,"IO06"]
["SI1",null,"IO07"]
["SI2",null,"IO08"]
["SI3",null,"IO09"]
["SO0",null,"IO10"]
[null,null,"IO11"]
[null,null,"IO12"]
[null,null,"IO13"]
[null,null,"IO14"]
[null,null,"IO15"]
[null,null,"IO16"]

{"sheet":"Devices","index":1,"n_rows":362,"n_cols":9,"rows_kept":362,"cut":false,"hidden":false,"merged":[]}
[null,null,null,null,null,null,null,"Which MCM we assign?","MCM04"]
["NCP1_1_BCN1_R"]
["NCP1_1_BCN2_A"]
["NCP1_1_BCN2_R"]
["NCP1_1_BCN3_A"]
["NCP1_1_DISC"]
["NCP1_1_ENC1"]
["NCP1_1_EPC1"]
["NCP1_1_EPC1_2"]
["NCP1_1_EPC2"]
["NCP1_1_EPC2_2"]
["NCP1_1_JR1_PB"]
["NCP1_1_JR1_PB_LT"]
["NCP1_1_S1_PB"]
["NCP1_1_S1_PB_LT"]
["NCP1_1_S2_PB"]
["NCP1_1_S2_PB_LT"]
["NCP1_1_TPE1"]
["NCP1_1_TPE2"]
["NCP1_1_TPE3"]
["NCP1_1_TPE4"]
["NCP1_1_TPE5"]
["NCP1_1_VFD"]
["NCP1_2_BCN1_R"]
["NCP1_2_BCN2_A"]
["NCP1_2_BCN2_R"]
["NCP1_2_BCN3_A"]
["NCP1_2_DISC"]
["NCP1_2_ENC1"]
["NCP1_2_EPC1"]
["NCP1_2_EPC1_2"]
["NCP1_2_EPC2"]
["NCP1_2_EPC2_2"]
["NCP1_2_JR1_PB"]
["NCP1_2_JR1_PB_LT"]
["NCP1_2_S1_PB"]
["NCP1_2_S1_PB_LT"]
["NCP1_2_S2_PB"]
["NCP1_2_S2_PB_LT"]
["NCP1_2_TPE1"]
{"$rows_left_out":323}
{"sheet":"Instructions","index":2,"n_rows":116,"n_cols":2,"rows_kept":116,"cut":false,"hidden":false,"merged":[]}
[]
["1. ","Put all device tags to cell A2"]
[]
[]
[]
[]
[]
[]
[]
[]
[]
[]
[]
[]
[]
[]
[]
[]
[]
[]
[]
[]
[]
[]
[]
[]
[]
[]
[]
[]
[]
[]
[]
[]
[]
[]
["2.","In cell I1 write MCM number"]
[]
[]
[]
{"$rows_left_out":77}
{"sheet":"IO Assignment MCM03","index":3,"n_rows":692,"n_cols":11,"rows_kept":692,"cut":false,"hidden":false,"merged":[]}
["Controller name","Signal type","Address name","Assigned device","Unassigned Device",null,null,null,null,null,"MCM03_DESC"]
["NCP1_1_VFD1","I0","NCP1_1_VFD_I0","NCP1_1_VFD1_DISC"]
["NCP1_1_VFD1","I1","NCP1_1_VFD_I1","NCP1_1_ENC1"]
["NCP1_1_VFD1","I2","NCP1_1_VFD_I2","NCP1_1_TPE1"]
["NCP1_1_VFD1","I3","NCP1_1_VFD_I3","NCP1_1_TPE2"]
["NCP1_1_VFD1","IO0","NCP1_1_VFD_IO0","NCP1_1_BCN2_A"]
["NCP1_1_VFD1","IO1","NCP1_1_VFD_IO1","NCP1_1_BCN2_R"]
["NCP1_1_VFD1","SI0","NCP1_1_VFD_SI0","NCP1_1_EPC1"]
["NCP1_1_VFD1","SI1","NCP1_1_VFD_SI1","NCP1_1_EPC1_2"]
["NCP1_1_VFD1","SI2","NCP1_1_VFD_SI2","NCP1_1_EPC2"]
["NCP1_1_VFD1","SI3","NCP1_1_VFD_SI3","NCP1_1_EPC2_2"]
["NCP1_1_VFD1","SO0","NCP1_1_VFD_SO0"]
["NCP1_1_FIO1","IO00","NCP1_1_FIO1_IO00","NCP1_1_BCN1_R"]
["NCP1_1_FIO1","IO01","NCP1_1_FIO1_IO01"]
["NCP1_1_FIO1","IO02","NCP1_1_FIO1_IO02","NCP1_1_S1_PB"]
["NCP1_1_FIO1","IO03","NCP1_1_FIO1_IO03","NCP1_1_S1_PB_LT"]
["NCP1_1_FIO1","IO04","NCP1_1_FIO1_IO04","NCP1_1_S2_PB"]
["NCP1_1_FIO1","IO05","NCP1_1_FIO1_IO05","NCP1_1_S2_PB_LT"]
["NCP1_1_FIO1","IO06","NCP1_1_FIO1_IO06","NCP1_1_TPE3"]
["NCP1_1_FIO1","IO07","NCP1_1_FIO1_IO07","NCP1_1_TPE4"]
["NCP1_1_FIO1","IO08","NCP1_1_FIO1_IO08","NCP1_1_TPE5"]
["NCP1_1_FIO1","IO09","NCP1_1_FIO1_IO09"]
["NCP1_1_FIO1","IO10","NCP1_1_FIO1_IO10","NCP1_1_BCN3_A"]
["NCP1_1_FIO1","IO11","NCP1_1_FIO1_IO11","NCP1_1_BCN3_H"]
["NCP1_1_FIO1","IO12","NCP1_1_FIO1_IO12"]
["NCP1_1_FIO1","IO13","NCP1_1_FIO1_IO13"]
["NCP1_1_FIO1","IO14","NCP1_1_FIO1_IO14"]
["NCP1_1_FIO1","IO15","NCP1_1_FIO1_IO15"]
["NCP1_2_VFD1","I0","NCP1_2_VFD1_I0","NCP1_2_VFD1_DISC"]
["NCP1_2_VFD1","I1","NCP1_2_VFD1_I1","NCP1_2_ENC1"]
["NCP1_2_VFD1","I2","NCP1_2_VFD1_I2","NCP1_2_TPE1"]
["NCP1_2_VFD1","I3","NCP1_2_VFD1_I3","NCP1_2_TPE2"]
["NCP1_2_VFD1","IO0","NCP1_2_VFD1_IO0","NCP1_1_JR1_PB"]
["NCP1_2_VFD1","IO1","NCP1_2_VFD1_IO1","NCP1_1_JR1_PB_LT"]
["NCP1_2_VFD1","SI0","NCP1_2_VFD1_SI0","NCP1_2_EPC1"]
["NCP1_2_VFD1","SI1","NCP1_2_VFD1_SI1","NCP1_2_EPC1_2"]
["NCP1_2_VFD1","SI2","NCP1_2_VFD1_SI2","NCP1_2_EPC2"]
["NCP1_2_VFD1","SI3","NCP1_2_VFD1_SI3","NCP1_2_EPC2_2"]
["NCP1_2_VFD1","SO0","NCP1_2_VFD1_SO0"]
["NCP1_2_FIO1","IO00","NCP1_2_FIO1_IO00","NCP1_2_BCN2_A"]
{"$rows_left_out":653}
{"sheet":"NETWORK","index":4,"n_rows":66,"n_cols":22,"rows_kept":66,"cut":false,"hidden":false,"merged":[[34,12,50,12],[34,13,50,13],[51,12,66,12],[51,13,66,13],[2,12,2,13],[2,14,2,16],[4,12,18,12],[4,13,18,13],[19,12,33,12],[19,13,33,13],[1,5,1,7],[3,3,17,3],[3,4,17,4],[18,3,32,3],[18,4,32,4],[50,3,65,3],[50,4,65,4],[1,3,1,4],[33,3,49,3],[33,4,49,4]]}
[null,"MCM03"]
["SLOT0","1756-L83ES","IP","RING",null,"STAR"]
["SLOT1","1756-N2",null,"DPM","IP","VFD NAME","VFD PART NUMBER","IP","HP"]
["SLOT2","1756-EN4TR","11.200.1.1","NCP1_1_DPM1","11.200.1.2","UL1_14_VFD1","35S-6D3-P101","11.200.1.30",{"$f":"VLOOKUP(G4,'Part number'!$A$1:$B$13,2,0)","v":3}]
["SLOT3","1756-N2",null,null,null,"UL1_15_VFD1","35S-6D3-P101","11.200.1.31",{"$f":"VLOOKUP(G5,'Part number'!$A$1:$B$13,2,0)","v":3}]
["SLOT4","1756-N2",null,null,null,"UL1_16_VFD1","35S-6D3-P101","11.200.1.32",{"$f":"VLOOKUP(G6,'Part number'!$A$1:$B$13,2,0)","v":3}]
["SLOT5","1756-IB16",null,null,null,"UL1_17_VFD1","35S-6D3-P101","11.200.1.33",{"$f":"VLOOKUP(G7,'Part number'!$A$1:$B$13,2,0)","v":3},null,null,null,null,null,null,null,null,null,"MCM03",null,"NCP1_1_DPM1",{"$f":"_xlfn.CONCAT(U7,\" CONNECTIONS\")","v":"NCP1_1_DPM1 CONNECTIONS"}]
["SLOT6","1756-OB16E",null,null,null,"UL1_18_VFD1","35S-6D4-P111","11.200.1.34",{"$f":"VLOOKUP(G8,'Part number'!$A$1:$B$13,2,0)","v":5},null,null,null,null,null,null,null,null,null,null,null,"NCP1_2_DPM1",{"$f":"_xlfn.CONCAT(U8,\" CONNECTIONS\")","v":"NCP1_2_DPM1 CONNECTIONS"}]
["SLOT7","1756-IB16S",null,null,null,"UL1_19_VFD1","35S-6D3-P101","11.200.1.35",{"$f":"VLOOKUP(G9,'Part number'!$A$1:$B$13,2,0)","v":3},null,null,null,null,null,null,null,null,null,null,null,"NCP1_3_DPM1","NCP1_3_DPM1 CONNECTIONS"]
["SLOT8","1756-N2",null,null,null,"UL1_20_VFD1","35S-6D2-P101","11.200.1.36",{"$f":"VLOOKUP(G10,'Part number'!$A$1:$B$13,2,0)","v":2},null,null,null,null,null,null,null,null,null,null,null,"NCP1_5_DPM1","NCP1_5_DPM1 CONNECTIONS"]
["SLOT9","1756-N2",null,null,null,"UL4_14_VFD1","35S-6D2-P101","11.200.1.37",{"$f":"VLOOKUP(G11,'Part number'!$A$1:$B$13,2,0)","v":2}]
[null,null,null,null,null,"UL4_15_VFD1","35S-6D3-P101","11.200.1.38",{"$f":"VLOOKUP(G12,'Part number'!$A$1:$B$13,2,0)","v":3}]
[null,null,null,null,null,"UL4_16_VFD1","35S-6D3-P101","11.200.1.39",{"$f":"VLOOKUP(G13,'Part number'!$A$1:$B$13,2,0)","v":3}]
["DPM COUNT",4,null,null,null,"UL4_17_VFD1","35S-6D3-P101","11.200.1.40",{"$f":"VLOOKUP(G14,'Part number'!$A$1:$B$13,2,0)","v":3}]
[null,null,null,null,null,"UL4_18_VFD1","35S-6D4-P111","11.200.1.41",{"$f":"VLOOKUP(G15,'Part number'!$A$1:$B$13,2,0)","v":5}]
[null,null,null,null,null,"UL4_19_VFD1","35S-6D3-P101","11.200.1.42",{"$f":"VLOOKUP(G16,'Part number'!$A$1:$B$13,2,0)","v":3}]
[null,null,null,null,null,"UL4_20_VFD1","35S-6D2-P101","11.200.1.43",{"$f":"VLOOKUP(G17,'Part number'!$A$1:$B$13,2,0)","v":2}]
[null,null,null,null,null,"NCP1_1_FIO1","5032-8IOLM12DR","11.200.1.44",{"$f":"VLOOKUP(G18,'Part number'!$A$1:$B$13,2,0)","v":"FIO"}]
[null,null,null,"NCP1_2_DPM1","11.200.1.3","UL7_14_VFD1","35S-6D3-P101","11.200.1.45",{"$f":"VLOOKUP(G19,'Part number'!$A$1:$B$13,2,0)","v":3}]
[null,null,null,null,null,"UL7_15_VFD1","35S-6D3-P101","11.200.1.46",{"$f":"VLOOKUP(G20,'Part number'!$A$1:$B$13,2,0)","v":3}]
[null,null,null,null,null,"UL7_16_VFD1","35S-6D3-P101","11.200.1.47",{"$f":"VLOOKUP(G21,'Part number'!$A$1:$B$13,2,0)","v":3}]
[null,null,null,null,null,"UL7_17_VFD1","35S-6D3-P101","11.200.1.48",{"$f":"VLOOKUP(G22,'Part number'!$A$1:$B$13,2,0)","v":3}]
[null,null,null,null,null,"UL7_18_VFD1","35S-6D4-P111","11.200.1.49",{"$f":"VLOOKUP(G23,'Part number'!$A$1:$B$13,2,0)","v":5}]
[null,null,null,null,null,"UL7_19_VFD1","35S-6D3-P101","11.200.1.50",{"$f":"VLOOKUP(G24,'Part number'!$A$1:$B$13,2,0)","v":3}]
[null,null,null,null,null,"UL7_20_VFD1","35S-6D2-P101","11.200.1.51",{"$f":"VLOOKUP(G25,'Part number'!$A$1:$B$13,2,0)","v":2}]
[null,null,null,null,null,"UL11_14_VFD1","35S-6D3-P101","11.200.1.52",{"$f":"VLOOKUP(G26,'Part number'!$A$1:$B$13,2,0)","v":3}]
[null,null,null,null,null,"UL11_15_VFD1","35S-6D3-P101","11.200.1.53",{"$f":"VLOOKUP(G27,'Part number'!$A$1:$B$13,2,0)","v":3}]
[null,null,null,null,null,"UL11_16_VFD1","35S-6D3-P101","11.200.1.54",{"$f":"VLOOKUP(G28,'Part number'!$A$1:$B$13,2,0)","v":3}]
[null,null,null,null,null,"UL11_17_VFD1","35S-6D3-P101","11.200.1.55",{"$f":"VLOOKUP(G29,'Part number'!$A$1:$B$13,2,0)","v":3}]
[null,null,null,null,null,"UL11_18_VFD1","35S-6D4-P111","11.200.1.56",{"$f":"VLOOKUP(G30,'Part number'!$A$1:$B$13,2,0)","v":5}]
[null,null,null,null,null,"UL11_19_VFD1","35S-6D3-P101","11.200.1.57",{"$f":"VLOOKUP(G31,'Part number'!$A$1:$B$13,2,0)","v":3}]
[null,null,null,null,null,"UL11_20_VFD1","35S-6D2-P101","11.200.1.58",{"$f":"VLOOKUP(G32,'Part number'!$A$1:$B$13,2,0)","v":2}]
[null,null,null,null,null,"NCP1_2_FIO1","5032-8IOLM12DR","11.200.1.59",{"$f":"VLOOKUP(G33,'Part number'!$A$1:$B$13,2,0)","v":"FIO"}]
[null,null,null,"NCP1_3_DPM1","11.200.1.4","UL13_13_VFD1","35S-6D3-P101","11.200.1.60",{"$f":"VLOOKUP(G34,'Part number'!$A$1:$B$13,2,0)","v":3}]
[null,null,null,null,null,"UL13_14_VFD1","35S-6D3-P101","11.200.1.61",{"$f":"VLOOKUP(G35,'Part number'!$A$1:$B$13,2,0)","v":3}]
[null,null,null,null,null,"UL13_15_VFD1","35S-6D3-P101","11.200.1.62",{"$f":"VLOOKUP(G36,'Part number'!$A$1:$B$13,2,0)","v":3}]
[null,null,null,null,null,"UL13_16_VFD1","35S-6D3-P101","11.200.1.63",{"$f":"VLOOKUP(G37,'Part number'!$A$1:$B$13,2,0)","v":3}]
[null,null,null,null,null,"UL13_17_VFD1","35S-6D4-P111","11.200.1.64",{"$f":"VLOOKUP(G38,'Part number'!$A$1:$B$13,2,0)","v":5}]
[null,null,null,null,null,"UL13_18_VFD1","35S-6D3-P101","11.200.1.65",{"$f":"VLOOKUP(G39,'Part number'!$A$1:$B$13,2,0)","v":3}]
[null,null,null,null,null,"UL13_19_VFD1","35S-6D2-P101","11.200.1.66",{"$f":"VLOOKUP(G40,'Part number'!$A$1:$B$13,2,0)","v":2}]
{"$rows_left_out":27}
{"sheet":"Part number","index":5,"n_rows":13,"n_cols":2,"rows_kept":13,"cut":false,"hidden":false,"merged":[]}
["PART NUMBER","HP"]
["35S-6D2-P101",2]
["35S-6D3-P101",3]
["35S-6D4-P111",5]
["35S-6D5-P111",7.5]
["35S-6D6-P111",10]
["25B-D024N104",15]
["25B-D030N104",20]
["25B-D043N114 ",30]
["CALJAN","EXTENDO"]
["PIONEER","TIPPER"]
["ZMX-3DE2500HF-Q7-AMZCHD","ZMX"]
["5032-8IOLM12DR","FIO"]

{"sheet":"MCM03_DESC","index":6,"n_rows":692,"n_cols":11,"rows_kept":692,"cut":false,"hidden":false,"merged":[[61,8,65,8],[66,8,70,8],[71,8,75,8],[76,8,80,8],[31,8,35,8],[36,8,40,8],[41,8,45,8],[46,8,50,8],[51,8,55,8],[56,8,60,8],[26,8,30,8],[1,8,5,8],[6,8,10,8],[11,8,15,8],[16,8,20,8],[21,8,25,8]]}
["TAGNAME","ADDR","TERM","TERMDESC","DESCA","DESCB",null,"CONTROLLERS"]
["NCP1_1_VFD1","NCP1_1_VFD_I0","I0",null,"NCP1_1_VFD1_DISC","DISCONNECT AUX",null,"NCP1_1_VFD1",600,null,{"$f":"_xlfn.CONCAT(H2,\"/\",H3,\"/\",H4,\"/\",H5,\" IO DRAWINGS\")","v":"NCP1_1_VFD1/NCP1_1_FIO1/NCP1_2_VFD1/NCP1_2_FIO1 IO DRAWINGS"}]
["NCP1_1_VFD1","NCP1_1_VFD_I1","I1",null,"NCP1_1_ENC1","ENCODER",null,"NCP1_1_FIO1",null,null,{"$f":"_xlfn.CONCAT(H7,\"/\",H8,\"/\",H9,\"/\",H10,\" IO DRAWINGS\")","v":"NCP1_3_VFD1/NCP1_3_FIO1/NCP1_4_VFD1/NCP1_5_VFD1 IO DRAWINGS"}]
["NCP1_1_VFD1","NCP1_1_VFD_I2","I2",null,"NCP1_1_TPE1","TRACKING PHOTOEYE",null,"NCP1_2_VFD1",null,null,{"$f":"_xlfn.CONCAT(H12,\"/\",H13,\"/\",H14,\"/\",H15,\" IO DRAWINGS\")","v":"NCP1_6_VFD1/NCP1_7_VFD1/NCP1_8_VFD1/UL1_14_VFD1 IO DRAWINGS"}]
["NCP1_1_VFD1","NCP1_1_VFD_I3","I3",null,"NCP1_1_TPE2","TRACKING PHOTOEYE",null,"NCP1_2_FIO1",null,null,{"$f":"_xlfn.CONCAT(H17,\"/\",H18,\"/\",H19,\"/\",H20,\" IO DRAWINGS\")","v":"UL1_15_VFD1/UL1_16_VFD1/UL1_17_VFD1/UL1_18_VFD1 IO DRAWINGS"}]
["NCP1_1_VFD1","NCP1_1_VFD_IO0","IO0",null,"NCP1_1_BCN2_A","AMBER BEACON LIGHT",null,null,null,null,{"$f":"_xlfn.CONCAT(H22,\"/\",H23,\"/\",H24,\"/\",H25,\" IO DRAWINGS\")","v":"UL1_19_VFD1/UL1_20_VFD1/UL11_14_VFD1/UL11_15_VFD1 IO DRAWINGS"}]
["NCP1_1_VFD1","NCP1_1_VFD_IO1","IO1",null,"NCP1_1_BCN2_R","RED BEACON LIGHT",null,"NCP1_3_VFD1",601,null,{"$f":"_xlfn.CONCAT(H27,\"/\",H28,\"/\",H29,\"/\",H30,\" IO DRAWINGS\")","v":"UL11_16_VFD1/UL11_17_VFD1/UL11_18_VFD1/UL11_19_VFD1 IO DRAWINGS"}]
["NCP1_1_VFD1","NCP1_1_VFD_SI0","SI0",null,"NCP1_1_EPC1","E-STOP PULLCORD",null,"NCP1_3_FIO1",null,null,{"$f":"_xlfn.CONCAT(H32,\"/\",H33,\"/\",H34,\"/\",H35,\" IO DRAWINGS\")","v":"UL11_20_VFD1/UL13_13_VFD1/UL13_14_VFD1/UL13_15_VFD1 IO DRAWINGS"}]
["NCP1_1_VFD1","NCP1_1_VFD_SI1","SI1",null,"NCP1_1_EPC1_2","E-STOP PULLCORD",null,"NCP1_4_VFD1",null,null,{"$f":"_xlfn.CONCAT(H37,\"/\",H38,\"/\",H39,\"/\",H40,\" IO DRAWINGS\")","v":"UL13_16_VFD1/UL13_17_VFD1/UL13_18_VFD1/UL13_19_VFD1 IO DRAWINGS"}]
["NCP1_1_VFD1","NCP1_1_VFD_SI2","SI2",null,"NCP1_1_EPC2","E-STOP PULLCORD",null,"NCP1_5_VFD1",null,null,{"$f":"_xlfn.CONCAT(H42,\"/\",H43,\"/\",H44,\"/\",H45,\" IO DRAWINGS\")","v":"UL18_17_VFD1/UL18_18_VFD1/UL18_19_VFD1/UL18_20_VFD1 IO DRAWINGS"}]
["NCP1_1_VFD1","NCP1_1_VFD_SI3","SI3",null,"NCP1_1_EPC2_2","E-STOP PULLCORD",null,null,null,null,{"$f":"_xlfn.CONCAT(H47,\"/\",H48,\"/\",H49,\"/\",H50,\" IO DRAWINGS\")","v":"UL18_21_VFD1/UL18_22_VFD1/UL18_23_VFD1/UL21_18_VFD1 IO DRAWINGS"}]
["NCP1_1_VFD1","NCP1_1_VFD_SO0","SO0",null,"SPARE",null,null,"NCP1_6_VFD1",602,null,{"$f":"_xlfn.CONCAT(H52,\"/\",H53,\"/\",H54,\"/\",H55,\" IO DRAWINGS\")","v":"UL21_19_VFD1/UL21_20_VFD1/UL21_21_VFD1/UL21_22_VFD1 IO DRAWINGS"}]
["NCP1_1_FIO1","NCP1_1_FIO1_IO00","IO00",null,"NCP1_1_BCN1_R","RED BEACON LIGHT",null,"NCP1_7_VFD1",null,null,{"$f":"_xlfn.CONCAT(H57,\"/\",H58,\"/\",H59,\"/\",H60,\" IO DRAWINGS\")","v":"UL21_23_VFD1/UL21_24_VFD1/UL4_14_VFD1/UL4_15_VFD1 IO DRAWINGS"}]
["NCP1_1_FIO1","NCP1_1_FIO1_IO01","IO01",null,"NCP1_1_BCN3_A","AMBER BEACON LIGHT",null,"NCP1_8_VFD1",null,null,{"$f":"_xlfn.CONCAT(H62,\"/\",H63,\"/\",H64,\"/\",H65,\" IO DRAWINGS\")","v":"UL4_16_VFD1/UL4_17_VFD1/UL4_18_VFD1/UL4_19_VFD1 IO DRAWINGS"}]
["NCP1_1_FIO1","NCP1_1_FIO1_IO02","IO02",null,"NCP1_1_S1_PB","START PUSHBUTTON",null,"UL1_14_VFD1",null,null,{"$f":"_xlfn.CONCAT(H67,\"/\",H68,\"/\",H69,\"/\",H70,\" IO DRAWINGS\")","v":"UL4_20_VFD1/UL7_14_VFD1/UL7_15_VFD1/UL7_16_VFD1 IO DRAWINGS"}]
["NCP1_1_FIO1","NCP1_1_FIO1_IO03","IO03",null,"NCP1_1_S1_PB_LT","START PUSHBUTTON LIGHT",null,null,null,null,{"$f":"_xlfn.CONCAT(H72,\"/\",H73,\"/\",H74,\"/\",H75,\" IO DRAWINGS\")","v":"UL7_17_VFD1/UL7_18_VFD1/UL7_19_VFD1/UL7_20_VFD1 IO DRAWINGS"}]
["NCP1_1_FIO1","NCP1_1_FIO1_IO04","IO04",null,"NCP1_1_S2_PB","START PUSHBUTTON",null,"UL1_15_VFD1",603,null,{"$f":"_xlfn.CONCAT(H77,\" IO DRAWINGS\")","v":"NCP1_8_FIO1 IO DRAWINGS"}]
["NCP1_1_FIO1","NCP1_1_FIO1_IO05","IO05",null,"NCP1_1_S2_PB_LT","START PUSHBUTTON LIGHT",null,"UL1_16_VFD1"]
["NCP1_1_FIO1","NCP1_1_FIO1_IO06","IO06",null,"NCP1_1_TPE3","TRACKING PHOTOEYE",null,"UL1_17_VFD1"]
["NCP1_1_FIO1","NCP1_1_FIO1_IO07","IO07",null,"NCP1_1_TPE4","TRACKING PHOTOEYE",null,"UL1_18_VFD1"]
["NCP1_1_FIO1","NCP1_1_FIO1_IO08","IO08",null,"NCP1_1_TPE5","TRACKING PHOTOEYE"]
["NCP1_1_FIO1","NCP1_1_FIO1_IO09","IO09",null,"SPARE",null,null,"UL1_19_VFD1",604]
["NCP1_1_FIO1","NCP1_1_FIO1_IO10","IO10",null,"SPARE",null,null,"UL1_20_VFD1"]
["NCP1_1_FIO1","NCP1_1_FIO1_IO11","IO11",null,"SPARE",null,null,"UL11_14_VFD1"]
["NCP1_1_FIO1","NCP1_1_FIO1_IO12","IO12",null,"SPARE",null,null,"UL11_15_VFD1"]
["NCP1_1_FIO1","NCP1_1_FIO1_IO13","IO13",null,"SPARE"]
["NCP1_1_FIO1","NCP1_1_FIO1_IO14","IO14",null,"SPARE",null,null,"UL11_16_VFD1",605]
["NCP1_1_FIO1","NCP1_1_FIO1_IO15","IO15",null,"SPARE",null,null,"UL11_17_VFD1"]
["NCP1_2_VFD1","NCP1_2_VFD1_I0","I0",null,"NCP1_2_VFD1_DISC","DISCONNECT AUX",null,"UL11_18_VFD1"]
["NCP1_2_VFD1","NCP1_2_VFD1_I1","I1",null,"NCP1_2_ENC1","ENCODER",null,"UL11_19_VFD1"]
["NCP1_2_VFD1","NCP1_2_VFD1_I2","I2",null,"NCP1_2_TPE1","TRACKING PHOTOEYE"]
["NCP1_2_VFD1","NCP1_2_VFD1_I3","I3",null,"NCP1_2_TPE2","TRACKING PHOTOEYE",null,"UL11_20_VFD1",606]
["NCP1_2_VFD1","NCP1_2_VFD1_IO0","IO0",null,"NCP1_1_JR1_PB","JAM RESET PUSHBUTTON",null,"UL13_13_VFD1"]
["NCP1_2_VFD1","NCP1_2_VFD1_IO1","IO1",null,"NCP1_1_JR1_PB_LT","JAM RESET PUSHBUTTON LIGHT",null,"UL13_14_VFD1"]
["NCP1_2_VFD1","NCP1_2_VFD1_SI0","SI0",null,"NCP1_2_EPC1","E-STOP PULLCORD",null,"UL13_15_VFD1"]
["NCP1_2_VFD1","NCP1_2_VFD1_SI1","SI1",null,"NCP1_2_EPC1_2","E-STOP PULLCORD"]
["NCP1_2_VFD1","NCP1_2_VFD1_SI2","SI2",null,"NCP1_2_EPC2","E-STOP PULLCORD",null,"UL13_16_VFD1",607]
["NCP1_2_VFD1","NCP1_2_VFD1_SI3","SI3",null,"NCP1_2_EPC2_2","E-STOP PULLCORD",null,"UL13_17_VFD1"]
["NCP1_2_VFD1","NCP1_2_VFD1_SO0","SO0",null,"SPARE",null,null,"UL13_18_VFD1"]
["NCP1_2_FIO1","NCP1_2_FIO1_IO00","IO00",null,"NCP1_2_BCN2_A","AMBER BEACON LIGHT",null,"UL13_19_VFD1"]
{"$rows_left_out":653}
{"sheet":"IO Assignment MCM04","index":7,"n_rows":644,"n_cols":5,"rows_kept":644,"cut":false,"hidden":false,"merged":[]}
["Controller name","Signal type","Address name","Assigned device","Unassigned Device"]
["NCP1_1_VFD","I0","NCP1_1_VFD_I0","NCP1_1_DISC","NCP1_1_BCN1_R"]
["NCP1_1_VFD","I1","NCP1_1_VFD_I1","NCP1_1_ENC1","NCP1_1_BCN2_A"]
["NCP1_1_VFD","I2","NCP1_1_VFD_I2","NCP1_1_TPE1","NCP1_1_BCN2_R"]
["NCP1_1_VFD","I3","NCP1_1_VFD_I3","NCP1_1_TPE2","NCP1_1_BCN3_A"]
["NCP1_1_VFD","IO0","NCP1_1_VFD_IO0",null,"NCP1_1_JR1_PB"]
["NCP1_1_VFD","IO1","NCP1_1_VFD_IO1",null,"NCP1_1_JR1_PB_LT"]
["NCP1_1_VFD","SI0","NCP1_1_VFD_SI0","NCP1_1_EPC1","NCP1_1_S1_PB"]
["NCP1_1_VFD","SI1","NCP1_1_VFD_SI1","NCP1_1_EPC1_2","NCP1_1_S1_PB_LT"]
["NCP1_1_VFD","SI2","NCP1_1_VFD_SI2","NCP1_1_EPC2","NCP1_1_S2_PB"]
["NCP1_1_VFD","SI3","NCP1_1_VFD_SI3","NCP1_1_EPC2_2","NCP1_1_S2_PB_LT"]
["NCP1_1_VFD","SO0","NCP1_1_VFD_SO0",null,"NCP1_1_TPE3"]
["NCP1_2_VFD1","I0","NCP1_2_VFD1_I0","NCP1_2_DISC","NCP1_1_TPE4"]
["NCP1_2_VFD1","I1","NCP1_2_VFD1_I1","NCP1_2_ENC1","NCP1_1_TPE5"]
["NCP1_2_VFD1","I2","NCP1_2_VFD1_I2","NCP1_2_TPE1","NCP1_2_BCN1_R"]
["NCP1_2_VFD1","I3","NCP1_2_VFD1_I3","NCP1_2_TPE2","NCP1_2_BCN2_A"]
["NCP1_2_VFD1","IO0","NCP1_2_VFD1_IO0",null,"NCP1_2_BCN2_R"]
["NCP1_2_VFD1","IO1","NCP1_2_VFD1_IO1",null,"NCP1_2_BCN3_A"]
["NCP1_2_VFD1","SI0","NCP1_2_VFD1_SI0","NCP1_2_EPC1","NCP1_2_JR1_PB"]
["NCP1_2_VFD1","SI1","NCP1_2_VFD1_SI1","NCP1_2_EPC1_2","NCP1_2_JR1_PB_LT"]
["NCP1_2_VFD1","SI2","NCP1_2_VFD1_SI2","NCP1_2_EPC2","NCP1_2_S1_PB"]
["NCP1_2_VFD1","SI3","NCP1_2_VFD1_SI3","NCP1_2_EPC2_2","NCP1_2_S1_PB_LT"]
["NCP1_2_VFD1","SO0","NCP1_2_VFD1_SO0",null,"NCP1_2_S2_PB"]
["NCP1_3_VFD1","I0","NCP1_3_VFD1_I0","NCP1_3_DISC","NCP1_2_S2_PB_LT"]
["NCP1_3_VFD1","I1","NCP1_3_VFD1_I1","NCP1_3_ENC1","NCP1_2_TPE3"]
["NCP1_3_VFD1","I2","NCP1_3_VFD1_I2","NCP1_3_TPE1","NCP1_2_TPE4"]
["NCP1_3_VFD1","I3","NCP1_3_VFD1_I3","NCP1_3_TPE2","NCP1_2_TPE5"]
["NCP1_3_VFD1","IO0","NCP1_3_VFD1_IO0",null,"NCP1_3_BCN1_R"]
["NCP1_3_VFD1","IO1","NCP1_3_VFD1_IO1",null,"NCP1_3_BCN2_A"]
["NCP1_3_VFD1","SI0","NCP1_3_VFD1_SI0","NCP1_3_EPC1","NCP1_3_BCN2_R"]
["NCP1_3_VFD1","SI1","NCP1_3_VFD1_SI1","NCP1_3_EPC1_2","NCP1_3_BCN3_A"]
["NCP1_3_VFD1","SI2","NCP1_3_VFD1_SI2","NCP1_3_EPC2","NCP1_3_BCN4_A"]
["NCP1_3_VFD1","SI3","NCP1_3_VFD1_SI3","NCP1_3_EPC2_2","NCP1_3_BCN5_A"]
["NCP1_3_VFD1","SO0","NCP1_3_VFD1_SO0",null,"NCP1_3_JR1_PB"]
["NCP1_4_VFD1","I0","NCP1_4_VFD1_I0","NCP1_4_DISC","NCP1_3_JR1_PB_LT"]
["NCP1_4_VFD1","I1","NCP1_4_VFD1_I1",null,"NCP1_3_JR2_PB"]
["NCP1_4_VFD1","I2","NCP1_4_VFD1_I2",null,"NCP1_3_JR2_PB_LT"]
["NCP1_4_VFD1","I3","NCP1_4_VFD1_I3",null,"NCP1_3_JR3_PB"]
["NCP1_4_VFD1","IO0","NCP1_4_VFD1_IO0",null,"NCP1_3_JR3_PB_LT"]
["NCP1_4_VFD1","IO1","NCP1_4_VFD1_IO1",null,"NCP1_3_S1_PB"]
{"$rows_left_out":604}