{"text_format":"1","workbook":"xlsx","n_sheets":8,"sheets":["Templates","Devices","Instructions","IO Assignment MCM04","NETWORK","Part number","MCM04_DESC","MCM04_DESC_v2"],"not_rendered":{"charts":0,"images":10,"macros":1,"external_links":0,"defined_names":6,"comments":2,"pivot_tables":0},"unopened":[],"bounds":{"document_bytes":16777216,"sheet_cells":100000,"rows_first":2000,"rows_last":500,"rows_between":2000,"halvings":0,"cell_chars":16384,"cell_head_chars":4096},"cells_cut":0,"cells_raw":0,"read":"whole","date_system":"1900"}

{"sheet":"Templates","index":0,"n_rows":19,"n_cols":3,"rows_kept":19,"cut":false,"hidden":true,"merged":[]}
[]
["VFD IO TEMPLATE",null,"FIO IO Template"]
["I0",null,"IO00"]
["I1",null,"IO01"]
["I2",null,"IO02"]
["I3",null,"IO03"]
["IO0",null,"IO04"]
["IO1",null,"IO05"]
["SI0",null,"IO06"]
["SI1",null,"IO07"]
["SI2",null,"IO08"]
["SI3",null,"IO09"]
["SO0",null,"IO10"]
[null,null,"IO11"]
[null,null,"IO12"]
[null,null,"IO13"]
[null,null,"IO14"]
[null,null,"IO15"]
[null,null,"IO16"]

{"sheet":"Devices","index":1,"n_rows":506,"n_cols":9,"rows_kept":506,"cut":false,"hidden":false,"merged":[]}
[null,null,null,null,null,null,null,"Which MCM we assign?","MCM01"]
["PRS3_1ACH_BCN1_A"]
["PRS3_1ACH_BCN1_B"]
["PRS3_1ACH_JPE1"]
["PRS3_1ACH_JR1_PB"]
["PRS3_1ACH_JR1_PB_LT"]
["PRS3_1BCH_BCN1_A"]
["PRS3_1BCH_BCN1_B"]
["PRS3_1BCH_JPE1"]
["PRS3_1BCH_JR1_PB"]
["PRS3_1BCH_JR1_PB_LT"]
["PRS3_2A_BCN1_A"]
["PRS3_2A_DISC"]
["PRS3_2A_FIOM1"]
["PRS3_2A_JPE1"]
["PRS3_2A_JR1_PB"]
["PRS3_2A_JR1_PB_LT"]
["PRS3_2A_VFD1"]
["PRS3_2B_BCN1_A"]
["PRS3_2B_DISC"]
["PRS3_2B_FIO1"]
["PRS3_2B_JPE1"]
["PRS3_2B_JR1_PB"]
["PRS3_2B_JR1_PB_LT"]
["PRS3_2B_VFD1"]
["PRS3_3A_BCN1_A"]
["PRS3_3A_BCN1_B"]
["PRS3_3A_DISC"]
["PRS3_3A_JPE1"]
["PRS3_3A_JPE2"]
["PRS3_3A_JR1_PB"]
["PRS3_3A_JR1_PB_LT"]
["PRS3_3A_VFD1"]
["PRS3_3B_BCN1_A"]
["PRS3_3B_BCN1_B"]
["PRS3_3B_DISC"]
["PRS3_3B_JPE1"]
["PRS3_3B_JPE2"]
["PRS3_3B_JR1_PB"]
["PRS3_3B_JR1_PB_LT"]
["PRS3_3B_VFD1"]
["PRS3_4CH_FIO1"]
["PRS3_4CH_FPE1"]
["PRS3_4CH_FPE2"]
["PRS3_5_BCN1_A"]
["PRS3_5_BCN1_R"]
["PRS3_5_BCN2_R"]
["PRS3_5_BCN3_A"]
["PRS3_5_BCN3_B"]
["PRS3_5_DISC"]
["PRS3_5_EPC1"]
["PRS3_5_EPC1_2"]
["PRS3_5_EPC2"]
["PRS3_5_EPC2_2"]
["PRS3_5_JPE1"]
["PRS3_5_JPE2"]
["PRS3_5_S1_PB"]
["PRS3_5_S1_PB_LT"]
["PRS3_5_S2_PB"]
["PRS3_5_S2_PB_LT"]
["PRS3_5_VFD1"]
["PRS3_6_ERSC1"]
["PRS3_6_ERSC10"]
["PRS3_6_ERSC11"]
["PRS3_6_ERSC12"]
["PRS3_6_ERSC13"]
["PRS3_6_ERSC14"]
["PRS3_6_ERSC15"]
["PRS3_6_ERSC2"]
["PRS3_6_ERSC3"]
["PRS3_6_ERSC4"]
["PRS3_6_ERSC5"]
["PRS3_6_ERSC6"]
["PRS3_6_ERSC7"]
["PRS3_6_ERSC8"]
["PRS3_6_ERSC9"]
["PRS3_6_PE1"]
["PRS3_6_PE10"]
["PRS3_6_PE11"]
["PRS3_6_PE12"]
["PRS3_6_PE13"]
["PRS3_6_PE14"]
["PRS3_6_PE15"]
["PRS3_6_PE16"]
["PRS3_6_PE17"]
["PRS3_6_PE18"]
["PRS3_6_PE19"]
["PRS3_6_PE2"]
["PRS3_6_PE20"]
["PRS3_6_PE21"]
["PRS3_6_PE22"]
["PRS3_6_PE23"]
["PRS3_6_PE24"]
["PRS3_6_PE25"]
["PRS3_6_PE26"]
["PRS3_6_PE27"]
["PRS3_6_PE28"]
["PRS3_6_PE29"]
["PRS3_6_PE3"]
["PRS3_6_PE30"]
["PRS3_6_PE4"]
["PRS3_6_PE5"]
["PRS3_6_PE6"]
["PRS3_6_PE7"]
["PRS3_6_PE8"]
["PRS3_6_PE9"]
["PRS3_6_PSU1"]
["PRS3_6_PSU2"]
["PRS4_1_BCN1_R"]
["PRS4_1_BCN2_A"]
["PRS4_1_BCN2_R"]
["PRS4_1_DISC"]
["PRS4_1_ENC1"]
["PRS4_1_EPC1"]
["PRS4_1_EPC1_2"]
["PRS4_1_EPC2"]
["PRS4_1_EPC2_2"]
["PRS4_1_JPE1"]
["PRS4_1_S1_PB"]
["PRS4_1_S1_PB_LT"]
["PRS4_1_S2_PB"]
["PRS4_1_S2_PB_LT"]
["PRS4_1_VFD1"]
["PRS4_2_BCN1_R"]
["PRS4_2_DISC"]
["PRS4_2_ENC1"]
["PRS4_2_EPC1"]
["PRS4_2_EPC1_2"]
["PRS4_2_EPC2"]
["PRS4_2_EPC2_2"]
["PRS4_2_FIO1"]
["PRS4_2_JPE1"]
["PRS4_2_JPE2"]
["PRS4_2_JR1_PB"]
["PRS4_2_JR1_PB_LT"]
["PRS4_2_S1_PB"]
["PRS4_2_S1_PB_LT"]
["PRS4_2_S2_PB"]
["PRS4_2_S2_PB_LT"]
["PRS4_2_VFD1"]
["PS10_1_BCN1_A"]
["PS10_1_BCN1_R"]
["PS10_1_DISC"]
["PS10_1_ENC1"]
["PS10_1_EPC1"]
["PS10_1_EPC1_2"]
["PS10_1_FIO1"]
["PS10_1_FIOH1"]
["PS10_1_FIOH2"]
["PS10_1_JPE1"]
["PS10_1_JPE2"]
["PS10_1_JPE3"]
["PS10_1_JPE4"]
["PS10_1_JR1_PB"]
["PS10_1_JR1_PB_LT"]
["PS10_1_SS1_SPB"]
["PS10_1_SS1_STPB"]
["PS10_1_SS1_STPB_LT"]
["PS10_1_VFD1"]
["PS10_2_DISC"]
["PS10_2_ENC1"]
["PS10_2_TPE"]
["PS10_2_VFD1"]
["PS10_3_BCN1_A"]
["PS10_3_BCN1_R"]
["PS10_3_DISC"]
["PS10_3_ENC1"]
["PS10_3_JPE1"]
["PS10_3_JR1_PB"]
["PS10_3_JR1_PB_LT"]
["PS10_3_VFD1"]
["PS10_5_BCN1_A"]
["PS10_5_BCN2_A"]
["PS10_5_DISC"]
["PS10_5_ENC1"]
["PS10_5_EPC1"]
["PS10_5_EPC1_2"]
["PS10_5_FIO1"]
["PS10_5_FIO2"]
["PS10_5_FIOH1"]
["PS10_5_FIOH2"]
["PS10_5_FIOH3"]
["PS10_5_FIOH4"]
["PS10_5_JPE1"]
["PS10_5_JPE2"]
["PS10_5_JPE3"]
["PS10_5_JPE4"]
["PS10_5_JPE5"]
["PS10_5_JR1_PB"]
["PS10_5_JR1_PB_LT"]
["PS10_5_JR2_PB"]
["PS10_5_JR2_PB_LT"]
["PS10_5_PS1"]
["PS10_5_TPE1"]
["PS10_5_VFD1"]
["PS10_5CH1_BCN1_A"]
["PS10_5CH1_BCN1_B"]
["PS10_5CH1_BCN1_G"]
["PS10_5CH1_FPE1"]
["PS10_5CH1_FPE2"]
["PS10_5CH1_JPE1"]
["PS10_5CH1_S1_PB"]
["PS10_5CH1_S1_PB_LT"]
["PS10_5CH2_BCN1_A"]
["PS10_5CH2_BCN1_B"]
["PS10_5CH2_BCN1_G"]
["PS10_5CH2_FPE1"]
["PS10_5CH2_FPE2"]
["PS10_5CH2_JPE1"]
["PS10_5CH2_S1_PB"]
["PS10_5CH2_S1_PB_LT"]
["PS10_5CH3_BCN1_A"]
["PS10_5CH3_BCN1_B"]
["PS10_5CH3_BCN1_G"]
["PS10_5CH3_FPE1"]
["PS10_5CH3_FPE2"]
["PS10_5CH3_JPE1"]
["PS10_5CH3_S1_PB"]
["PS10_5CH3_S1_PB_LT"]
["PS10_5CH5_BCN1_A"]
["PS10_5CH5_BCN1_B"]
["PS10_5CH5_BCN1_G"]
["PS10_5CH5_FPE1"]
["PS10_5CH5_FPE2"]
["PS10_5CH5_JPE1"]
["PS10_5CH5_S1_PB"]
["PS10_5CH5_S1_PB_LT"]
["PS10_5DIV1_LS1"]
["PS10_5DIV1_LS2"]
["PS10_5DIV1_SOL1"]
["PS10_5DIV1_SOL2"]
["PS10_5DIV2_LS1"]
["PS10_5DIV2_LS2"]
["PS10_5DIV2_SOL1"]
["PS10_5DIV2_SOL2"]
["PS10_5DIV3_LS1"]
["PS10_5DIV3_LS2"]
["PS10_5DIV3_SOL1"]
["PS10_5DIV3_SOL2"]
["PS10_5DIV5_LS1"]
["PS10_5DIV5_LS2"]
["PS10_5DIV5_SOL1"]
["PS10_5DIV5_SOL2"]
["PS10_6CH_FPE1"]
["PS11_1_BCN1_A"]
["PS11_1_BCN1_R"]
["PS11_1_DISC"]
["PS11_1_ENC1"]
["PS11_1_EPC1"]
["PS11_1_EPC1_2"]
["PS11_1_FIO1"]
["PS11_1_FIOH1"]
["PS11_1_FIOH2"]
["PS11_1_JPE1"]
["PS11_1_JPE2"]
["PS11_1_JPE3"]
["PS11_1_JPE4"]
["PS11_1_JR1_PB"]
["PS11_1_JR1_PB_LT"]
["PS11_1_JR2_PB"]
["PS11_1_JR2_PB_LT"]
["PS11_1_VFD1"]
["PS11_11_BCN1_R"]
["PS11_11_BCN2_A"]
["PS11_11_BCN3_A"]
["PS11_11_BCN4_A"]
["PS11_11_DISC"]
["PS11_11_ENC1"]
["PS11_11_EPC1"]
["PS11_11_EPC1_2"]
["PS11_11_FIO1"]
["PS11_11_FIO2"]
["PS11_11_FIO3"]
["PS11_11_FIOH1"]
["PS11_11_FIOH2"]
["PS11_11_FIOH3"]
["PS11_11_FIOH4"]
["PS11_11_FIOH5"]
["PS11_11_FIOH6"]
["PS11_11_JPE1"]
["PS11_11_JPE2"]
["PS11_11_JPE3"]
["PS11_11_JPE4"]
["PS11_11_JPE5"]
["PS11_11_JPE6"]
["PS11_11_JR1_PB"]
["PS11_11_JR1_PB_LT"]
["PS11_11_JR2_PB"]
["PS11_11_JR2_PB_LT"]
["PS11_11_JR3_PB"]
["PS11_11_JR3_PB_LT"]
["PS11_11_PS1"]
["PS11_11_S1_PB"]
["PS11_11_S1_PB_LT"]
["PS11_11_TPE1"]
["PS11_11_VFD1"]
["PS11_11CH1_BCN1_A"]
["PS11_11CH1_BCN1_B"]
["PS11_11CH1_BCN1_G"]
["PS11_11CH1_FPE1"]
["PS11_11CH1_FPE2"]
["PS11_11CH1_JPE1"]
["PS11_11CH1_S1_PB"]
["PS11_11CH1_S1_PB_LT"]
["PS11_11CH2_BCN1_A"]
["PS11_11CH2_BCN1_B"]
["PS11_11CH2_BCN1_G"]
["PS11_11CH2_FPE1"]
["PS11_11CH2_FPE2"]
["PS11_11CH2_JPE1"]
["PS11_11CH2_S1_PB"]
["PS11_11CH2_S1_PB_LT"]
["PS11_11CH3_BCN1_G"]
["PS11_11CH3_BCN2_A"]
["PS11_11CH3_BCN3_B"]
["PS11_11CH3_FPE1"]
["PS11_11CH3_FPE2"]
["PS11_11CH3_JPE1"]
["PS11_11CH3_S1_PB"]
["PS11_11CH3_S1_PB_LT"]
["PS11_11CH4_BCN1_A"]
["PS11_11CH4_BCN1_B"]
["PS11_11CH4_BCN1_G"]
["PS11_11CH4_FPE1"]
["PS11_11CH4_FPE2"]
["PS11_11CH4_JPE1"]
["PS11_11CH4_S1_PB"]
["PS11_11CH4_S1_PB_LT"]
["PS11_11CH5_BCN1_A"]
["PS11_11CH5_BCN1_B"]
["PS11_11CH5_BCN1_G"]
["PS11_11CH5_FPE1"]
["PS11_11CH5_FPE2"]
["PS11_11CH5_JPE1"]
["PS11_11CH5_S1_PB"]
["PS11_11CH5_S1_PB_LT"]
["PS11_11CH6_BCN1_A"]
["PS11_11CH6_BCN1_B"]
["PS11_11CH6_BCN1_G"]
["PS11_11CH6_FPE1"]
["PS11_11CH6_FPE2"]
["PS11_11CH6_JPE1"]
["PS11_11CH6_S1_PB"]
["PS11_11CH6_S1_PB_LT"]
["PS11_11DIV1_LS1"]
["PS11_11DIV1_LS2"]
["PS11_11DIV1_SOL1"]
["PS11_11DIV1_SOL2"]
["PS11_11DIV2_LS1"]
["PS11_11DIV2_LS2"]
["PS11_11DIV2_SOL1"]
["PS11_11DIV2_SOL2"]
["PS11_11DIV3_LS1"]
["PS11_11DIV3_LS2"]
["PS11_11DIV3_SOL1"]
["PS11_11DIV3_SOL2"]
["PS11_11DIV4_LS1"]
["PS11_11DIV4_LS2"]
["PS11_11DIV4_SOL1"]
["PS11_11DIV4_SOL2"]
["PS11_11DIV5_LS1"]
["PS11_11DIV5_LS2"]
["PS11_11DIV5_SOL1"]
["PS11_11DIV5_SOL2"]
["PS11_11DIV6_LS1"]
["PS11_11DIV6_LS2"]
["PS11_11DIV6_SOL1"]
["PS11_11DIV6_SOL2"]
["PS11_12CH_FPE1"]
["PS11_2_BCN1_A"]
["PS11_2_DISC"]
["PS11_2_ENC1"]
["PS11_2_JPE1"]
["PS11_2_VFD1"]
["PS11_3_BCN1_A"]
["PS11_3_BCN1_R"]
["PS11_3_BCN2_R"]
["PS11_3_DISC"]
["PS11_3_ENC1"]
["PS11_3_EPC1"]
["PS11_3_EPC1_2"]
["PS11_3_EPC2"]
["PS11_3_EPC2_2"]
["PS11_3_FIO1"]
["PS11_3_JPE1"]
["PS11_3_JPE2"]
["PS11_3_S1_PB"]
["PS11_3_S1_PB_LT"]
["PS11_3_S2_PB"]
["PS11_3_S2_PB_LT"]
["PS11_3_VFD1"]
["PS11_4_BCN1_A"]
["PS11_4_BCN1_R"]
["PS11_4_BCN2_R"]
["PS11_4_DISC"]
["PS11_4_ENC1"]
["PS11_4_EPC1"]
["PS11_4_EPC1_2"]
["PS11_4_EPC2"]
["PS11_4_EPC2_2"]
["PS11_4_FIO1"]
["PS11_4_JPE1"]
["PS11_4_S1_PB"]
["PS11_4_S1_PB_LT"]
["PS11_4_S2_PB"]
["PS11_4_S2_PB_LT"]
["PS11_4_VFD1"]
["PS11_6_DISC"]
["PS11_6_ENC1"]
["PS11_6_TPE1"]
["PS11_6_TPE2"]
["PS11_6_VFD1"]
["PS11_7_BCN1_R"]
["PS11_7_BCN2_R"]
["PS11_7_DISC"]
["PS11_7_ENC1"]
["PS11_7_EPC1"]
["PS11_7_EPC1_2"]
["PS11_7_EPC2"]
["PS11_7_EPC2_2"]
["PS11_7_FIO1"]
["PS11_7_S1_PB"]
["PS11_7_S1_PB_LT"]
["PS11_7_S2_PB"]
["PS11_7_S2_PB_LT"]
["PS11_7_TPE1"]
["PS11_7_VFD1"]
["PS11_8_BCN1_R"]
["PS11_8_DISC"]
["PS11_8_ENC1"]
["PS11_8_EPC1"]
["PS11_8_EPC1_2"]
["PS11_8_S1_PB"]
["PS11_8_S1_PB_LT"]
["PS11_8_TPE1"]
["PS11_8_VFD1"]
["PS11_9_BCN1_A"]
["PS11_9_DISC"]
["PS11_9_ENC1"]
["PS11_9_VFD1"]
["ULC5_3_BCN1_A"]
["ULC5_3_BCN1_R"]
["ULC5_3_DISC"]
["ULC5_3_ENC1"]
["ULC5_3_EPC1"]
["ULC5_3_EPC1_2"]
["ULC5_3_EPC2"]
["ULC5_3_EPC2_2"]
["ULC5_3_JPE1"]
["ULC5_3_JPE2"]
["ULC5_3_JR1_PB"]
["ULC5_3_JR1_PB_LT"]
["ULC5_3_SS1_SPB"]
["ULC5_3_SS1_STPB"]
["ULC5_3_SS1_STPB_LT"]
["ULC5_3_SS2_SPB"]
["ULC5_3_SS2_STPB"]
["ULC5_3_SS2_STPB_LT"]
["ULC5_3_VFD1"]
["ULC6_3_BCN1_A"]
["ULC6_3_BCN1_R"]
["ULC6_3_DISC"]
["ULC6_3_ENC1"]
["ULC6_3_EPC1"]
["ULC6_3_EPC1_2"]
["ULC6_3_JPE1"]
["ULC6_3_JPE2"]
["ULC6_3_JR1_PB"]
["ULC6_3_JR1_PB_LT"]
["ULC6_3_SS2_SPB"]
["ULC6_3_SS2_STPB"]
["ULC6_3_SS2_STPB_LT"]
["ULC6_3_VFD1"]
["ULC7_3_BCN1_A"]
["ULC7_3_BCN1_R"]
["ULC7_3_DISC"]
["ULC7_3_ENC1"]
["ULC7_3_EPC1"]
["ULC7_3_EPC1_2"]
["ULC7_3_EPC2"]
["ULC7_3_EPC2_2"]
["ULC7_3_JPE1"]
["ULC7_3_JPE2"]
["ULC7_3_JR1_PB"]
["ULC7_3_JR1_PB_LT"]
["ULC7_3_SS1_SPB"]
["ULC7_3_SS1_STPB"]
["ULC7_3_SS1_STPB_LT"]
["ULC7_3_SS2_SPB"]
["ULC7_3_SS2_STPB"]
["ULC7_3_SS2_STPB_LT"]
["ULC7_3_VFD1"]
["ULC8_3_BCN1_A"]
["ULC8_3_BCN1_R"]
["ULC8_3_DISC"]
["ULC8_3_ENC1"]
["ULC8_3_EPC1"]
["ULC8_3_EPC1_2"]
["ULC8_3_JPE1"]
["ULC8_3_JPE2"]
["ULC8_3_JR1_PB"]
["ULC8_3_JR1_PB_LT"]
["ULC8_3_SS1_SPB"]
["ULC8_3_SS1_STPB"]
["ULC8_3_SS1_STPB_LT"]
["ULC8_3_VFD1"]

{"sheet":"Instructions","index":2,"n_rows":116,"n_cols":2,"rows_kept":116,"cut":false,"hidden":false,"merged":[]}
[]
["1. ","Put all device tags to cell A2"]
[]
[]
[]
[]
[]
[]
[]
[]
[]
[]
[]
[]
[]
[]
[]
[]
[]
[]
[]
[]
[]
[]
[]
[]
[]
[]
[]
[]
[]
[]
[]
[]
[]
[]
["2.","In cell I1 write MCM number"]
[]
[]
[]
[]
[]
[]
[]
[]
[]
["3. ","Click on \"Add Disconnects\" button. "]
[]
[]
[]
[]
[]
[]
[]
[]
[]
["4. ","Replace all _VFD1_DISC with _DISC. Without this point it will generate IO points for _VFD1_DISC device"]
[]
[]
[]
[]
[]
[]
[]
[]
[]
[]
[]
["5. ","Click on \"Split SS station\". This will split all _SS to SS_STPB, SS_SPB and SS_STPB_LT"]
[]
[]
[]
[]
[]
[]
[]
[]
["6. ","Click on \"Split start PB\". This will split all _S and _JR to _S_PB, _S_PB_LT, JR_PB and JR_PB_LT"]
[]
[]
[]
[]
[]
[]
[]
[]
["7.","Click on \"Duplicate EPC Tag\". This will add duplicate for all EPC and add _2 to copy"]
[]
[]
[]
[]
[]
[]
[]
[]
[]
["8.","Click on \"Create Assignment table template\". This will add new sheet with name \"IO Assignment MCM01 and fill with VFD and FIO names and their adresses"]
[]
[]
[]
[]
[]
[]
[]
[]
[]
["9.","Click on \"Assign Devices to VFD\". This will add device tags to correspond VFD IO. Works for Disc, TPE, JPE, EPC, ENC"]
[]
[]
[]
[]
[]
[]
[]
[]
["10. ","All Unassigned Pushbuttons and lights fill manually and all devices, that couldn't filled to VFD also will be here."]

{"sheet":"IO Assignment MCM04","index":3,"n_rows":755,"n_cols":11,"rows_kept":755,"cut":false,"hidden":false,"merged":[]}
["Controller name","Signal type","Address name","Assigned device","Unassigned Device",null,null,null,null,null,"MCM04_DESC_v2"]
["PRS3_2A_VFD1","I0","PRS3_2A_VFD1_I0","PRS3_2A_VFD1_DISC"]
["PRS3_2A_VFD1","I1","PRS3_2A_VFD1_I1"]
["PRS3_2A_VFD1","I2","PRS3_2A_VFD1_I2","PRS3_2A_JPE1"]
["PRS3_2A_VFD1","I3","PRS3_2A_VFD1_I3"]
["PRS3_2A_VFD1","IO0","PRS3_2A_VFD1_IO0"]
["PRS3_2A_VFD1","IO1","PRS3_2A_VFD1_IO1"]
["PRS3_2A_VFD1","SI0","PRS3_2A_VFD1_SI0"]
["PRS3_2A_VFD1","SI1","PRS3_2A_VFD1_SI1"]
["PRS3_2A_VFD1","SI2","PRS3_2A_VFD1_SI2"]
["PRS3_2A_VFD1","SI3","PRS3_2A_VFD1_SI3"]
["PRS3_2A_VFD1","SO0","PRS3_2A_VFD1_SO0"]
["PRS3_2B_VFD1","I0","PRS3_2B_VFD1_I0","PRS3_2B_VFD1_DISC"]
["PRS3_2B_VFD1","I1","PRS3_2B_VFD1_I1"]
["PRS3_2B_VFD1","I2","PRS3_2B_VFD1_I2","PRS3_2B_JPE1"]
["PRS3_2B_VFD1","I3","PRS3_2B_VFD1_I3"]
["PRS3_2B_VFD1","IO0","PRS3_2B_VFD1_IO0"]
["PRS3_2B_VFD1","IO1","PRS3_2B_VFD1_IO1"]
["PRS3_2B_VFD1","SI0","PRS3_2B_VFD1_SI0"]
["PRS3_2B_VFD1","SI1","PRS3_2B_VFD1_SI1"]
["PRS3_2B_VFD1","SI2","PRS3_2B_VFD1_SI2"]
["PRS3_2B_VFD1","SI3","PRS3_2B_VFD1_SI3"]
["PRS3_2B_VFD1","SO0","PRS3_2B_VFD1_SO0"]
["PRS3_3A_VFD1","I0","PRS3_3A_VFD1_I0","PRS3_3A_VFD1_DISC"]
["PRS3_3A_VFD1","I1","PRS3_3A_VFD1_I1"]
["PRS3_3A_VFD1","I2","PRS3_3A_VFD1_I2","PRS3_3A_JPE1"]
["PRS3_3A_VFD1","I3","PRS3_3A_VFD1_I3","PRS3_3A_JPE2"]
["PRS3_3A_VFD1","IO0","PRS3_3A_VFD1_IO0","PRS3_3A_BCN1_A"]
["PRS3_3A_VFD1","IO1","PRS3_3A_VFD1_IO1","PRS3_3A_BCN1_B"]
["PRS3_3A_VFD1","SI0","PRS3_3A_VFD1_SI0"]
["PRS3_3A_VFD1","SI1","PRS3_3A_VFD1_SI1"]
["PRS3_3A_VFD1","SI2","PRS3_3A_VFD1_SI2"]
["PRS3_3A_VFD1","SI3","PRS3_3A_VFD1_SI3"]
["PRS3_3A_VFD1","SO0","PRS3_3A_VFD1_SO0"]
["PRS3_3B_VFD1","I0","PRS3_3B_VFD1_I0","PRS3_3B_VFD1_DISC"]
["PRS3_3B_VFD1","I1","PRS3_3B_VFD1_I1"]
["PRS3_3B_VFD1","I2","PRS3_3B_VFD1_I2","PRS3_3B_JPE1"]
["PRS3_3B_VFD1","I3","PRS3_3B_VFD1_I3","PRS3_3B_JPE2"]
["PRS3_3B_VFD1","IO0","PRS3_3B_VFD1_IO0","PRS3_3B_BCN1_A"]
["PRS3_3B_VFD1","IO1","PRS3_3B_VFD1_IO1","PRS3_3B_BCN1_B"]
["PRS3_3B_VFD1","SI0","PRS3_3B_VFD1_SI0"]
["PRS3_3B_VFD1","SI1","PRS3_3B_VFD1_SI1"]
["PRS3_3B_VFD1","SI2","PRS3_3B_VFD1_SI2"]
["PRS3_3B_VFD1","SI3","PRS3_3B_VFD1_SI3"]
["PRS3_3B_VFD1","SO0","PRS3_3B_VFD1_SO0"]
["PRS3_5_VFD1","I0","PRS3_5_VFD1_I0","PRS3_5_VFD1_DISC"]
["PRS3_5_VFD1","I1","PRS3_5_VFD1_I1"]
["PRS3_5_VFD1","I2","PRS3_5_VFD1_I2","PRS3_5_JPE1"]
["PRS3_5_VFD1","I3","PRS3_5_VFD1_I3","PRS3_5_JPE2"]
["PRS3_5_VFD1","IO0","PRS3_5_VFD1_IO0"]
["PRS3_5_VFD1","IO1","PRS3_5_VFD1_IO1"]
["PRS3_5_VFD1","SI0","PRS3_5_VFD1_SI0","PRS3_5_EPC1"]
["PRS3_5_VFD1","SI1","PRS3_5_VFD1_SI1","PRS3_5_EPC1_2"]
["PRS3_5_VFD1","SI2","PRS3_5_VFD1_SI2","PRS3_5_EPC2"]
["PRS3_5_VFD1","SI3","PRS3_5_VFD1_SI3","PRS3_5_EPC2_2"]
["PRS3_5_VFD1","SO0","PRS3_5_VFD1_SO0"]
["PRS4_1_VFD1","I0","PRS4_1_VFD1_I0","PRS4_1_VFD1_DISC"]
["PRS4_1_VFD1","I1","PRS4_1_VFD1_I1","PRS4_1_ENC1"]
["PRS4_1_VFD1","I2","PRS4_1_VFD1_I2","PRS4_1_JPE1"]
["PRS4_1_VFD1","I3","PRS4_1_VFD1_I3"]
["PRS4_1_VFD1","IO0","PRS4_1_VFD1_IO0"]
["PRS4_1_VFD1","IO1","PRS4_1_VFD1_IO1"]
["PRS4_1_VFD1","SI0","PRS4_1_VFD1_SI0","PRS4_1_EPC1"]
["PRS4_1_VFD1","SI1","PRS4_1_VFD1_SI1","PRS4_1_EPC1_2"]
["PRS4_1_VFD1","SI2","PRS4_1_VFD1_SI2","PRS4_1_EPC2"]
["PRS4_1_VFD1","SI3","PRS4_1_VFD1_SI3","PRS4_1_EPC2_2"]
["PRS4_1_VFD1","SO0","PRS4_1_VFD1_SO0"]
["PRS4_2_VFD1","I0","PRS4_2_VFD1_I0","PRS4_2_VFD1_DISC"]
["PRS4_2_VFD1","I1","PRS4_2_VFD1_I1","PRS4_2_ENC1"]
["PRS4_2_VFD1","I2","PRS4_2_VFD1_I2","PRS4_2_JPE1"]
["PRS4_2_VFD1","I3","PRS4_2_VFD1_I3","PRS4_2_JPE2"]
["PRS4_2_VFD1","IO0","PRS4_2_VFD1_IO0"]
["PRS4_2_VFD1","IO1","PRS4_2_VFD1_IO1"]
["PRS4_2_VFD1","SI0","PRS4_2_VFD1_SI0","PRS4_2_EPC1"]
["PRS4_2_VFD1","SI1","PRS4_2_VFD1_SI1","PRS4_2_EPC1_2"]
["PRS4_2_VFD1","SI2","PRS4_2_VFD1_SI2","PRS4_2_EPC2"]
["PRS4_2_VFD1","SI3","PRS4_2_VFD1_SI3","PRS4_2_EPC2_2"]
["PRS4_2_VFD1","SO0","PRS4_2_VFD1_SO0"]
["PS10_1_VFD1","I0","PS10_1_VFD1_I0","PS10_1_VFD1_DISC"]
["PS10_1_VFD1","I1","PS10_1_VFD1_I1","PS10_1_ENC1"]
["PS10_1_VFD1","I2","PS10_1_VFD1_I2","PS10_1_JPE1"]
["PS10_1_VFD1","I3","PS10_1_VFD1_I3","PS10_1_JPE2"]
["PS10_1_VFD1","IO0","PS10_1_VFD1_IO0","PS10_1_BCN1_A"]
["PS10_1_VFD1","IO1","PS10_1_VFD1_IO1","PS10_1_BCN1_R"]
["PS10_1_VFD1","SI0","PS10_1_VFD1_SI0","PS10_1_EPC1"]
["PS10_1_VFD1","SI1","PS10_1_VFD1_SI1","PS10_1_EPC1_2"]
["PS10_1_VFD1","SI2","PS10_1_VFD1_SI2"]
["PS10_1_VFD1","SI3","PS10_1_VFD1_SI3"]
["PS10_1_VFD1","SO0","PS10_1_VFD1_SO0"]
["PS10_2_VFD1","I0","PS10_2_VFD1_I0","PS10_2_VFD1_DISC"]
["PS10_3_VFD1","I0","PS10_3_VFD1_I0","PS10_3_VFD1_DISC"]
["PS10_5_VFD1","I0","PS10_5_VFD1_I0","PS10_5_VFD1_DISC"]
["PS10_5_SIO1","SI0",{"$f":"_xlfn.CONCAT(A93,\"_\",B93)","v":"PS10_5_SIO1_SI0"},"PS10_5_EPC1"]
["PS10_5_SIO1","SI1","PS10_5_SIO1_SI1","PS10_5_EPC1_2"]
["PS10_5_SIO1","SI2","PS10_5_SIO1_SI2"]
["PS10_5_SIO1","SI3","PS10_5_SIO1_SI3"]
["PS10_5_SIO1","SI4","PS10_5_SIO1_SI4"]
["PS10_5_SIO1","SI5","PS10_5_SIO1_SI5"]
["PS10_5_SIO1","SI6","PS10_5_SIO1_SI6"]
["PS10_5_SIO1","SI7","PS10_5_SIO1_SI7"]
["PS10_5_SIO1","SO0","PS10_5_SIO1_SO0","PS10_5_VFD1_STO"]
["PS10_5_SIO1","SO1","PS10_5_SIO1_SO1","PS10_3_VFD1_STO"]
["PS10_5_SIO1","SO2","PS10_5_SIO1_SO2","PS10_2_VFD1_STO"]
["PS10_5_SIO1","SO3","PS10_5_SIO1_SO3"]
["PS10_5_SIO1","IO0","PS10_5_SIO1_IO0","PS10_3_ENC1"]
["PS10_5_SIO1","IO1","PS10_5_SIO1_IO1"]
["PS10_5_SIO1","IO2","PS10_5_SIO1_IO2","PS10_3_JPE1"]
["PS10_5_SIO1","IO3","PS10_5_SIO1_IO3"]
["PS11_1_VFD1","I0","PS11_1_VFD1_I0","PS11_1_VFD1_DISC"]
["PS11_1_VFD1","I1","PS11_1_VFD1_I1","PS11_1_ENC1"]
["PS11_1_VFD1","I2","PS11_1_VFD1_I2","PS11_1_JPE1"]
["PS11_1_VFD1","I3","PS11_1_VFD1_I3","PS11_1_JPE2"]
["PS11_1_VFD1","IO0","PS11_1_VFD1_IO0"]
["PS11_1_VFD1","IO1","PS11_1_VFD1_IO1"]
["PS11_1_VFD1","SI0","PS11_1_VFD1_SI0","PS11_1_EPC1"]
["PS11_1_VFD1","SI1","PS11_1_VFD1_SI1","PS11_1_EPC1_2"]
["PS11_1_VFD1","SI2","PS11_1_VFD1_SI2"]
["PS11_1_VFD1","SI3","PS11_1_VFD1_SI3"]
["PS11_1_VFD1","SO0","PS11_1_VFD1_SO0"]
["PS11_2_VFD1","I0","PS11_2_VFD1_I0","PS11_2_VFD1_DISC"]
["PS11_2_VFD1","I1","PS11_2_VFD1_I1","PS11_2_ENC1"]
["PS11_2_VFD1","I2","PS11_2_VFD1_I2","PS11_2_JPE1"]
["PS11_2_VFD1","I3","PS11_2_VFD1_I3"]
["PS11_2_VFD1","IO0","PS11_2_VFD1_IO0","PS11_2_BCN1_A"]
["PS11_2_VFD1","IO1","PS11_2_VFD1_IO1"]
["PS11_2_VFD1","SI0","PS11_2_VFD1_SI0"]
["PS11_2_VFD1","SI1","PS11_2_VFD1_SI1"]
["PS11_2_VFD1","SI2","PS11_2_VFD1_SI2"]
["PS11_2_VFD1","SI3","PS11_2_VFD1_SI3"]
["PS11_2_VFD1","SO0","PS11_2_VFD1_SO0"]
["PS11_3_VFD1","I0","PS11_3_VFD1_I0","PS11_3_VFD1_DISC"]
["PS11_3_VFD1","I1","PS11_3_VFD1_I1","PS11_3_ENC1"]
["PS11_3_VFD1","I2","PS11_3_VFD1_I2","PS11_3_JPE1"]
["PS11_3_VFD1","I3","PS11_3_VFD1_I3","PS11_3_JPE2"]
["PS11_3_VFD1","IO0","PS11_3_VFD1_IO0","PS11_3_BCN1_A"]
["PS11_3_VFD1","IO1","PS11_3_VFD1_IO1","PS11_3_BCN1_R"]
["PS11_3_VFD1","SI0","PS11_3_VFD1_SI0","PS11_3_EPC1"]
["PS11_3_VFD1","SI1","PS11_3_VFD1_SI1","PS11_3_EPC1_2"]
["PS11_3_VFD1","SI2","PS11_3_VFD1_SI2","PS11_3_EPC2"]
["PS11_3_VFD1","SI3","PS11_3_VFD1_SI3","PS11_3_EPC2_2"]
["PS11_3_VFD1","SO0","PS11_3_VFD1_SO0"]
["PS11_4_VFD1","I0","PS11_4_VFD1_I0","PS11_4_VFD1_DISC"]
["PS11_4_VFD1","I1","PS11_4_VFD1_I1","PS11_4_ENC1"]
["PS11_4_VFD1","I2","PS11_4_VFD1_I2","PS11_4_JPE1"]
["PS11_4_VFD1","I3","PS11_4_VFD1_I3"]
["PS11_4_VFD1","IO0","PS11_4_VFD1_IO0"]
["PS11_4_VFD1","IO1","PS11_4_VFD1_IO1"]
["PS11_4_VFD1","SI0","PS11_4_VFD1_SI0","PS11_4_EPC1"]
["PS11_4_VFD1","SI1","PS11_4_VFD1_SI1","PS11_4_EPC1_2"]
["PS11_4_VFD1","SI2","PS11_4_VFD1_SI2","PS11_4_EPC2"]
["PS11_4_VFD1","SI3","PS11_4_VFD1_SI3","PS11_4_EPC2_2"]
["PS11_4_VFD1","SO0","PS11_4_VFD1_SO0"]
["PS11_6_VFD1","I0","PS11_6_VFD1_I0","PS11_6_VFD1_DISC"]
["PS11_6_VFD1","I1","PS11_6_VFD1_I1","PS11_6_ENC1"]
["PS11_6_VFD1","I2","PS11_6_VFD1_I2","PS11_6_JPE1"]
["PS11_6_VFD1","I3","PS11_6_VFD1_I3","PS11_6_JPE2"]
["PS11_6_VFD1","IO0","PS11_6_VFD1_IO0","PS11_7_ENC1"]
["PS11_6_VFD1","IO1","PS11_6_VFD1_IO1","PS11_7_JPE1"]
["PS11_6_VFD1","SI0","PS11_6_VFD1_SI0","PS11_7_EPC1"]
["PS11_6_VFD1","SI1","PS11_6_VFD1_SI1","PS11_7_EPC1_2"]
["PS11_6_VFD1","SI2","PS11_6_VFD1_SI2","PS11_7_EPC2"]
["PS11_6_VFD1","SI3","PS11_6_VFD1_SI3","PS11_7_EPC2_2"]
["PS11_6_VFD1","SO0","PS11_6_VFD1_SO0"]
["PS11_7_VFD1","I0","PS11_7_VFD1_I0","PS11_7_VFD1_DISC"]
["PS11_8_VFD1","I0","PS11_8_VFD1_I0","PS11_8_VFD1_DISC"]
["PS11_9_VFD1","I0","PS11_9_VFD1_I0","PS11_9_VFD1_DISC"]
["PS11_11_VFD1","I0","PS11_11_VFD1_I0","PS11_11_VFD1_DISC"]
["PS11_8_SIO1","SI0",{"$f":"_xlfn.CONCAT(A168,\"_\",B168)","v":"PS11_8_SIO1_SI0"},"PS11_11_EPC1"]
["PS11_8_SIO1","SI1","PS11_8_SIO1_SI1","PS11_11_EPC1_2"]
["PS11_8_SIO1","SI2","PS11_8_SIO1_SI2","PS11_8_EPC1"]
["PS11_8_SIO1","SI3","PS11_8_SIO1_SI3","PS11_8_EPC1_2"]
["PS11_8_SIO1","SI4","PS11_8_SIO1_SI4"]
["PS11_8_SIO1","SI5","PS11_8_SIO1_SI5"]
["PS11_8_SIO1","SI6","PS11_8_SIO1_SI6"]
["PS11_8_SIO1","SI7","PS11_8_SIO1_SI7"]
["PS11_8_SIO1","SO0","PS11_8_SIO1_SO0","PS11_7_VFD1_STO"]
["PS11_8_SIO1","SO1","PS11_8_SIO1_SO1","PS11_8_VFD1_STO"]
["PS11_8_SIO1","SO2","PS11_8_SIO1_SO2","PS11_9_VFD1_STO"]
["PS11_8_SIO1","SO3","PS11_8_SIO1_SO3","PS11_11_VFD1_STO"]
["PS11_8_SIO1","IO0","PS11_8_SIO1_IO0","PS11_8_ENC1"]
["PS11_8_SIO1","IO1","PS11_8_SIO1_IO1","PS11_8_JPE1"]
["PS11_8_SIO1","IO2","PS11_8_SIO1_IO2","PS11_8_FIOH1"]
["PS11_8_SIO1","IO3","PS11_8_SIO1_IO3"]
["PS11_8_FIOH1","IO0","PS11_8_FIOH1_IO0","PS11_8_BCN1_R"]
["PS11_8_FIOH1","IO1","PS11_8_FIOH1_IO1","PS11_8_BCN1_H"]
["PS11_8_FIOH1","IO2","PS11_8_FIOH1_IO2","PS11_9_ENC1"]
["PS11_8_FIOH1","IO3","PS11_8_FIOH1_IO3"]
["PS11_8_FIOH1","IO4","PS11_8_FIOH1_IO4","PS11_9_BCN1_A"]
["PS11_8_FIOH1","IO5","PS11_8_FIOH1_IO5"]
["PS11_8_FIOH1","IO6","PS11_8_FIOH1_IO6","PS11_8_S1_PB"]
["PS11_8_FIOH1","IO7","PS11_8_FIOH1_IO7","PS11_8_S1_PB_LT"]
["PS11_8_FIOH1","IO8","PS11_8_FIOH1_IO8"]
["PS11_8_FIOH1","IO9","PS11_8_FIOH1_IO9"]
["PS11_8_FIOH1","IO10","PS11_8_FIOH1_IO10"]
["PS11_8_FIOH1","IO11","PS11_8_FIOH1_IO11"]
["PS11_8_FIOH1","IO12","PS11_8_FIOH1_IO12"]
["PS11_8_FIOH1","IO13","PS11_8_FIOH1_IO13"]
["PS11_8_FIOH1","IO14","PS11_8_FIOH1_IO14"]
["PS11_8_FIOH1","IO15","PS11_8_FIOH1_IO15"]
["ULC5_3_VFD1","I0","ULC5_3_VFD1_I0","ULC5_3_VFD1_DISC"]
["ULC5_3_VFD1","I1","ULC5_3_VFD1_I1","ULC5_3_ENC1"]
["ULC5_3_VFD1","I2","ULC5_3_VFD1_I2","ULC5_3_JPE1"]
["ULC5_3_VFD1","I3","ULC5_3_VFD1_I3","ULC5_3_JPE2"]
["ULC5_3_VFD1","IO0","ULC5_3_VFD1_IO0","ULC5_3_BCN1_A"]
["ULC5_3_VFD1","IO1","ULC5_3_VFD1_IO1","ULC5_3_BCN1_R"]
["ULC5_3_VFD1","SI0","ULC5_3_VFD1_SI0","ULC5_3_EPC1"]
["ULC5_3_VFD1","SI1","ULC5_3_VFD1_SI1","ULC5_3_EPC1_2"]
["ULC5_3_VFD1","SI2","ULC5_3_VFD1_SI2","ULC5_3_EPC2"]
["ULC5_3_VFD1","SI3","ULC5_3_VFD1_SI3","ULC5_3_EPC2_2"]
["ULC5_3_VFD1","SO0","ULC5_3_VFD1_SO0"]
["ULC6_3_VFD1","I0","ULC6_3_VFD1_I0","ULC6_3_VFD1_DISC"]
["ULC6_3_VFD1","I1","ULC6_3_VFD1_I1","ULC6_3_ENC1"]
["ULC6_3_VFD1","I2","ULC6_3_VFD1_I2","ULC6_3_JPE1"]
["ULC6_3_VFD1","I3","ULC6_3_VFD1_I3","ULC6_3_JPE2"]
["ULC6_3_VFD1","IO0","ULC6_3_VFD1_IO0","ULC6_3_BCN1_A"]
["ULC6_3_VFD1","IO1","ULC6_3_VFD1_IO1","ULC6_3_BCN1_R"]
["ULC6_3_VFD1","SI0","ULC6_3_VFD1_SI0","ULC6_3_EPC1"]
["ULC6_3_VFD1","SI1","ULC6_3_VFD1_SI1","ULC6_3_EPC1_2"]
["ULC6_3_VFD1","SI2","ULC6_3_VFD1_SI2"]
["ULC6_3_VFD1","SI3","ULC6_3_VFD1_SI3"]
["ULC6_3_VFD1","SO0","ULC6_3_VFD1_SO0"]
["ULC7_3_VFD1","I0","ULC7_3_VFD1_I0","ULC7_3_VFD1_DISC"]
["ULC7_3_VFD1","I1","ULC7_3_VFD1_I1","ULC7_3_ENC1"]
["ULC7_3_VFD1","I2","ULC7_3_VFD1_I2","ULC7_3_JPE1"]
["ULC7_3_VFD1","I3","ULC7_3_VFD1_I3","ULC7_3_JPE2"]
["ULC7_3_VFD1","IO0","ULC7_3_VFD1_IO0"]
["ULC7_3_VFD1","IO1","ULC7_3_VFD1_IO1"]
["ULC7_3_VFD1","SI0","ULC7_3_VFD1_SI0","ULC7_3_EPC1"]
["ULC7_3_VFD1","SI1","ULC7_3_VFD1_SI1","ULC7_3_EPC1_2"]
["ULC7_3_VFD1","SI2","ULC7_3_VFD1_SI2","ULC7_3_EPC2"]
["ULC7_3_VFD1","SI3","ULC7_3_VFD1_SI3","ULC7_3_EPC2_2"]
["ULC7_3_VFD1","SO0","ULC7_3_VFD1_SO0"]
["ULC8_3_VFD1","I0","ULC8_3_VFD1_I0","ULC8_3_VFD1_DISC"]
["ULC8_3_VFD1","I1","ULC8_3_VFD1_I1","ULC8_3_ENC1"]
["ULC8_3_VFD1","I2","ULC8_3_VFD1_I2","ULC8_3_JPE1"]
["ULC8_3_VFD1","I3","ULC8_3_VFD1_I3","ULC8_3_JPE2"]
["ULC8_3_VFD1","IO0","ULC8_3_VFD1_IO0"]
["ULC8_3_VFD1","IO1","ULC8_3_VFD1_IO1"]
["ULC8_3_VFD1","SI0","ULC8_3_VFD1_SI0","ULC8_3_EPC1"]
["ULC8_3_VFD1","SI1","ULC8_3_VFD1_SI1","ULC8_3_EPC1_2"]
["ULC8_3_VFD1","SI2","ULC8_3_VFD1_SI2"]
["ULC8_3_VFD1","SI3","ULC8_3_VFD1_SI3"]
["ULC8_3_VFD1","SO0","ULC8_3_VFD1_SO0"]
["PRS3_2A_FIO1","IO00","PRS3_2A_FIOM1_IO00","PRS3_1ACH_BCN1_A"]
["PRS3_2A_FIO1","IO01","PRS3_2A_FIOM1_IO01","PRS3_1ACH_BCN1_B"]
["PRS3_2A_FIO1","IO02","PRS3_2A_FIOM1_IO02","PRS3_1ACH_FPE1"]
["PRS3_2A_FIO1","IO03","PRS3_2A_FIOM1_IO03"]
["PRS3_2A_FIO1","IO04","PRS3_2A_FIOM1_IO04","PRS3_1ACH_JR1_PB"]
["PRS3_2A_FIO1","IO05","PRS3_2A_FIOM1_IO05","PRS3_1ACH_JR1_PB_LT"]
["PRS3_2A_FIO1","IO06","PRS3_2A_FIOM1_IO06","PRS3_2A_JR1_PB"]
["PRS3_2A_FIO1","IO07","PRS3_2A_FIOM1_IO07","PRS3_2A_JR1_PB_LT"]
["PRS3_2A_FIO1","IO08","PRS3_2A_FIOM1_IO08","PRS3_2A_BCN1_A"]
["PRS3_2A_FIO1","IO09","PRS3_2A_FIOM1_IO09"]
["PRS3_2A_FIO1","IO10","PRS3_2A_FIOM1_IO10"]
["PRS3_2A_FIO1","IO11","PRS3_2A_FIOM1_IO11"]
["PRS3_2A_FIO1","IO12","PRS3_2A_FIOM1_IO12"]
["PRS3_2A_FIO1","IO13","PRS3_2A_FIOM1_IO13"]
["PRS3_2A_FIO1","IO14","PRS3_2A_FIOM1_IO14"]
["PRS3_2A_FIO1","IO15","PRS3_2A_FIOM1_IO15"]
["PRS3_2B_FIO1","IO00","PRS3_2B_FIO1_IO00","PRS3_1BCH_BCN1_A"]
["PRS3_2B_FIO1","IO01","PRS3_2B_FIO1_IO01","PRS3_1BCH_BCN1_B"]
["PRS3_2B_FIO1","IO02","PRS3_2B_FIO1_IO02","PRS3_1BCH_FPE1"]
["PRS3_2B_FIO1","IO03","PRS3_2B_FIO1_IO03"]
["PRS3_2B_FIO1","IO04","PRS3_2B_FIO1_IO04","PRS3_1BCH_JR1_PB"]
["PRS3_2B_FIO1","IO05","PRS3_2B_FIO1_IO05","PRS3_1BCH_JR1_PB_LT"]
["PRS3_2B_FIO1","IO06","PRS3_2B_FIO1_IO06","PRS3_3A_JR1_PB"]
["PRS3_2B_FIO1","IO07","PRS3_2B_FIO1_IO07","PRS3_3A_JR1_PB_LT"]
["PRS3_2B_FIO1","IO08","PRS3_2B_FIO1_IO08","PRS3_2B_BCN1_A"]
["PRS3_2B_FIO1","IO09","PRS3_2B_FIO1_IO09","PRS3_2B_JR1_PB"]
["PRS3_2B_FIO1","IO10","PRS3_2B_FIO1_IO10","PRS3_2B_JR1_PB_LT"]
["PRS3_2B_FIO1","IO11","PRS3_2B_FIO1_IO11","PRS3_3B_JR1_PB"]
["PRS3_2B_FIO1","IO12","PRS3_2B_FIO1_IO12","PRS3_3B_JR1_PB_LT"]
["PRS3_2B_FIO1","IO13","PRS3_2B_FIO1_IO13"]
["PRS3_2B_FIO1","IO14","PRS3_2B_FIO1_IO14","PRS3_4CH_FPE1"]
["PRS3_2B_FIO1","IO15","PRS3_2B_FIO1_IO15","PRS3_4CH_FPE2"]
["PRS3_4CH_FIO1","IO00","PRS3_4CH_FIO1_IO00","PRS3_5_BCN1_A"]
["PRS3_4CH_FIO1","IO01","PRS3_4CH_FIO1_IO01","PRS3_5_BCN1_R"]
["PRS3_4CH_FIO1","IO02","PRS3_4CH_FIO1_IO02","PRS3_5_BCN2_R"]
["PRS3_4CH_FIO1","IO03","PRS3_4CH_FIO1_IO03"]
["PRS3_4CH_FIO1","IO04","PRS3_4CH_FIO1_IO04","PRS3_5_BCN3_A"]
["PRS3_4CH_FIO1","IO05","PRS3_4CH_FIO1_IO05","PRS3_5_BCN3_B"]
["PRS3_4CH_FIO1","IO06","PRS3_4CH_FIO1_IO06","PRS3_5_S1_PB"]
["PRS3_4CH_FIO1","IO07","PRS3_4CH_FIO1_IO07","PRS3_5_S1_PB_LT"]
["PRS3_4CH_FIO1","IO08","PRS3_4CH_FIO1_IO08","PRS3_5_S2_PB"]
["PRS3_4CH_FIO1","IO09","PRS3_4CH_FIO1_IO09","PRS3_5_S2_PB_LT"]
["PRS3_4CH_FIO1","IO10","PRS3_4CH_FIO1_IO10"]
["PRS3_4CH_FIO1","IO11","PRS3_4CH_FIO1_IO11"]
["PRS3_4CH_FIO1","IO12","PRS3_4CH_FIO1_IO12"]
["PRS3_4CH_FIO1","IO13","PRS3_4CH_FIO1_IO13"]
["PRS3_4CH_FIO1","IO14","PRS3_4CH_FIO1_IO14"]
["PRS3_4CH_FIO1","IO15","PRS3_4CH_FIO1_IO15"]
["PRS4_2_FIO1","IO00","PRS4_2_FIO1_IO00","PRS4_1_BCN1_R"]
["PRS4_2_FIO1","IO01","PRS4_2_FIO1_IO01"]
["PRS4_2_FIO1","IO02","PRS4_2_FIO1_IO02","PRS4_1_BCN2_A"]
["PRS4_2_FIO1","IO03","PRS4_2_FIO1_IO03","PRS4_1_BCN2_R"]
["PRS4_2_FIO1","IO04","PRS4_2_FIO1_IO04","PRS4_1_S1_PB"]
["PRS4_2_FIO1","IO05","PRS4_2_FIO1_IO05","PRS4_1_S1_PB_LT"]
["PRS4_2_FIO1","IO06","PRS4_2_FIO1_IO06","PRS4_1_S2_PB"]
["PRS4_2_FIO1","IO07","PRS4_2_FIO1_IO07","PRS4_1_S2_PB_LT"]
["PRS4_2_FIO1","IO08","PRS4_2_FIO1_IO08","PRS4_2_BCN1_R"]
["PRS4_2_FIO1","IO09","PRS4_2_FIO1_IO09"]
["PRS4_2_FIO1","IO10","PRS4_2_FIO1_IO10","PRS4_2_JR1_PB"]
["PRS4_2_FIO1","IO11","PRS4_2_FIO1_IO11","PRS4_2_JR1_PB_LT"]
["PRS4_2_FIO1","IO12","PRS4_2_FIO1_IO12","PRS4_2_S1_PB"]
["PRS4_2_FIO1","IO13","PRS4_2_FIO1_IO13","PRS4_2_S1_PB_LT"]
["PRS4_2_FIO1","IO14","PRS4_2_FIO1_IO14","PRS4_2_S2_PB"]
["PRS4_2_FIO1","IO15","PRS4_2_FIO1_IO15","PRS4_2_S2_PB_LT"]
["PS10_1_FIO1","IO00","PS10_1_FIO1_IO00","PS10_1_JPE3"]
["PS10_1_FIO1","IO01","PS10_1_FIO1_IO01","PS10_1_JPE4"]
["PS10_1_FIO1","IO02","PS10_1_FIO1_IO02","PS10_1_JR1_PB"]
["PS10_1_FIO1","IO03","PS10_1_FIO1_IO03","PS10_1_JR1_PB_LT"]
["PS10_1_FIO1","IO04","PS10_1_FIO1_IO04","PS10_1_SS1_SPB"]
["PS10_1_FIO1","IO05","PS10_1_FIO1_IO05","PS10_1_SS1_STPB"]
["PS10_1_FIO1","IO06","PS10_1_FIO1_IO06","PS10_1_SS1_STPB_LT"]
["PS10_1_FIO1","IO07","PS10_1_FIO1_IO07"]
["PS10_1_FIO1","IO08","PS10_1_FIO1_IO08","PS10_2_ENC1"]
["PS10_1_FIO1","IO09","PS10_1_FIO1_IO09"]
["PS10_1_FIO1","IO10","PS10_1_FIO1_IO10","PS10_2_JPE1"]
["PS10_1_FIO1","IO11","PS10_1_FIO1_IO11"]
["PS10_1_FIO1","IO12","PS10_1_FIO1_IO12","PS10_1_FIOH1"]
["PS10_1_FIO1","IO13","PS10_1_FIO1_IO13"]
["PS10_1_FIO1","IO14","PS10_1_FIO1_IO14","PS10_1_FIOH2"]
["PS10_1_FIO1","IO15","PS10_1_FIO1_IO15"]
["PS10_1_FIOH1","IO00","PS10_1_FIOH1_IO00","ULC7_3_BCN1_A"]
["PS10_1_FIOH1","IO01","PS10_1_FIOH1_IO01","ULC7_3_BCN1_R"]
["PS10_1_FIOH1","IO02","PS10_1_FIOH1_IO02","ULC7_3_JR1_PB"]
["PS10_1_FIOH1","IO03","PS10_1_FIOH1_IO03","ULC7_3_JR1_PB_LT"]
["PS10_1_FIOH1","IO04","PS10_1_FIOH1_IO04","ULC7_3_SS1_SPB"]
["PS10_1_FIOH1","IO05","PS10_1_FIOH1_IO05","ULC7_3_SS1_STPB"]
["PS10_1_FIOH1","IO06","PS10_1_FIOH1_IO06","ULC7_3_SS1_STPB_LT"]
["PS10_1_FIOH1","IO07","PS10_1_FIOH1_IO07"]
["PS10_1_FIOH1","IO08","PS10_1_FIOH1_IO08","ULC7_3_SS2_SPB"]
["PS10_1_FIOH1","IO09","PS10_1_FIOH1_IO09","ULC7_3_SS2_STPB"]
["PS10_1_FIOH1","IO10","PS10_1_FIOH1_IO10","ULC7_3_SS2_STPB_LT"]
["PS10_1_FIOH1","IO11","PS10_1_FIOH1_IO11"]
["PS10_1_FIOH1","IO12","PS10_1_FIOH1_IO12"]
["PS10_1_FIOH1","IO13","PS10_1_FIOH1_IO13"]
["PS10_1_FIOH1","IO14","PS10_1_FIOH1_IO14"]
["PS10_1_FIOH1","IO15","PS10_1_FIOH1_IO15"]
["PS10_1_FIOH2","IO00","PS10_1_FIOH2_IO00","ULC8_3_BCN1_A"]
["PS10_1_FIOH2","IO01","PS10_1_FIOH2_IO01","ULC8_3_BCN1_R"]
["PS10_1_FIOH2","IO02","PS10_1_FIOH2_IO02","ULC8_3_JR1_PB"]
["PS10_1_FIOH2","IO03","PS10_1_FIOH2_IO03","ULC8_3_JR1_PB_LT"]
["PS10_1_FIOH2","IO04","PS10_1_FIOH2_IO04","ULC8_3_SS1_SPB"]
["PS10_1_FIOH2","IO05","PS10_1_FIOH2_IO05","ULC8_3_SS1_STPB"]
["PS10_1_FIOH2","IO06","PS10_1_FIOH2_IO06","ULC8_3_SS1_STPB_LT"]
["PS10_1_FIOH2","IO07","PS10_1_FIOH2_IO07"]
["PS10_1_FIOH2","IO08","PS10_1_FIOH2_IO08"]
["PS10_1_FIOH2","IO09","PS10_1_FIOH2_IO09"]
["PS10_1_FIOH2","IO10","PS10_1_FIOH2_IO10"]
["PS10_1_FIOH2","IO11","PS10_1_FIOH2_IO11"]
["PS10_1_FIOH2","IO12","PS10_1_FIOH2_IO12"]
["PS10_1_FIOH2","IO13","PS10_1_FIOH2_IO13"]
["PS10_1_FIOH2","IO14","PS10_1_FIOH2_IO14"]
["PS10_1_FIOH2","IO15","PS10_1_FIOH2_IO15"]
["PS10_5_FIO1","IO00","PS10_5_FIO1_IO00","PS10_5_JPE4"]
["PS10_5_FIO1","IO01","PS10_5_FIO1_IO01","PS10_5_JPE5"]
["PS10_5_FIO1","IO02","PS10_5_FIO1_IO02","PS10_5_JPE6"]
["PS10_5_FIO1","IO03","PS10_5_FIO1_IO03"]
["PS10_5_FIO1","IO04","PS10_5_FIO1_IO04","PS10_5_JR1_PB"]
["PS10_5_FIO1","IO05","PS10_5_FIO1_IO05","PS10_5_JR1_PB_LT"]
["PS10_5_FIO1","IO06","PS10_5_FIO1_IO06","PS10_5_JR2_PB"]
["PS10_5_FIO1","IO07","PS10_5_FIO1_IO07","PS10_5_JR2_PB_LT"]
["PS10_5_FIO1","IO08","PS10_5_FIO1_IO08","PS10_5_JPE1"]
["PS10_5_FIO1","IO09","PS10_5_FIO1_IO09","PS10_6CH_FPE1"]
["PS10_5_FIO1","IO10","PS10_5_FIO1_IO10","PS10_5_PS1"]
["PS10_5_FIO1","IO11","PS10_5_FIO1_IO11","PS10_5_BCN2_A"]
["PS10_5_FIO1","IO12","PS10_5_FIO1_IO12","PS10_5_BCN1_A"]
["PS10_5_FIO1","IO13","PS10_5_FIO1_IO13","PS10_5_BCN1_H"]
["PS10_5_FIO1","IO14","PS10_5_FIO1_IO14","PS10_5_FIOH1"]
["PS10_5_FIO1","IO15","PS10_5_FIO1_IO15","PS10_5DIV3_LS1"]
["PS10_5_FIO2","IO00","PS10_5_FIO2_IO00"]
["PS10_5_FIO2","IO01","PS10_5_FIO2_IO01","PS10_5DIV3_LS2"]
["PS10_5_FIO2","IO02","PS10_5_FIO2_IO02"]
["PS10_5_FIO2","IO03","PS10_5_FIO2_IO03","PS10_5DIV3_SOL1"]
["PS10_5_FIO2","IO04","PS10_5_FIO2_IO04"]
["PS10_5_FIO2","IO05","PS10_5_FIO2_IO05","PS10_5DIV3_SOL2"]
["PS10_5_FIO2","IO06","PS10_5_FIO2_IO06"]
["PS10_5_FIO2","IO07","PS10_5_FIO2_IO07","PS10_5DIV4_LS1"]
["PS10_5_FIO2","IO08","PS10_5_FIO2_IO08","PS10_5DIV4_LS2"]
["PS10_5_FIO2","IO09","PS10_5_FIO2_IO09","PS10_5DIV4_SOL1"]
["PS10_5_FIO2","IO10","PS10_5_FIO2_IO10","PS10_5DIV4_SOL2"]
["PS10_5_FIO2","IO11","PS10_5_FIO2_IO11"]
["PS10_5_FIO2","IO12","PS10_5_FIO2_IO12","PS10_5_FIOH3"]
["PS10_5_FIO2","IO13","PS10_5_FIO2_IO13"]
["PS10_5_FIO2","IO14","PS10_5_FIO2_IO14","PS10_5_FIOH4"]
["PS10_5_FIO2","IO15","PS10_5_FIO2_IO15"]
["PS10_5_FIOH1","IO00","PS10_5_FIOH1_IO00","PS10_5CH1_BCN1_A"]
["PS10_5_FIOH1","IO01","PS10_5_FIOH1_IO01","PS10_5CH1_BCN1_B"]
["PS10_5_FIOH1","IO02","PS10_5_FIOH1_IO02","PS10_5CH1_BCN1_G"]
["PS10_5_FIOH1","IO03","PS10_5_FIOH1_IO03","PS10_5CH1_FPE1"]
["PS10_5_FIOH1","IO04","PS10_5_FIOH1_IO04","PS10_5CH1_FPE2"]
["PS10_5_FIOH1","IO05","PS10_5_FIOH1_IO05","PS10_5CH1_JPE1"]
["PS10_5_FIOH1","IO06","PS10_5_FIOH1_IO06","PS10_5CH1_S1_PB"]
["PS10_5_FIOH1","IO07","PS10_5_FIOH1_IO07","PS10_5CH1_S1_PB_LT"]
["PS10_5_FIOH1","IO08","PS10_5_FIOH1_IO08","PS10_5CH2_BCN1_A"]
["PS10_5_FIOH1","IO09","PS10_5_FIOH1_IO09","PS10_5CH2_BCN1_B"]
["PS10_5_FIOH1","IO10","PS10_5_FIOH1_IO10","PS10_5CH2_BCN1_G"]
["PS10_5_FIOH1","IO11","PS10_5_FIOH1_IO11","PS10_5CH2_FPE1"]
["PS10_5_FIOH1","IO12","PS10_5_FIOH1_IO12","PS10_5CH2_FPE2"]
["PS10_5_FIOH1","IO13","PS10_5_FIOH1_IO13","PS10_5CH2_JPE1"]
["PS10_5_FIOH1","IO14","PS10_5_FIOH1_IO14","PS10_5CH2_S1_PB"]
["PS10_5_FIOH1","IO15","PS10_5_FIOH1_IO15","PS10_5CH2_S1_PB_LT"]
["PS10_5_FIOH2","IO00","PS10_5_FIOH2_IO00","PS10_5DIV1_LS1"]
["PS10_5_FIOH2","IO01","PS10_5_FIOH2_IO01","PS10_5DIV1_LS2"]
["PS10_5_FIOH2","IO02","PS10_5_FIOH2_IO02","PS10_5DIV1_SOL1"]
["PS10_5_FIOH2","IO03","PS10_5_FIOH2_IO03","PS10_5DIV1_SOL2"]
["PS10_5_FIOH2","IO04","PS10_5_FIOH2_IO04","PS10_5DIV2_LS1"]
["PS10_5_FIOH2","IO05","PS10_5_FIOH2_IO05","PS10_5DIV2_LS2"]
["PS10_5_FIOH2","IO06","PS10_5_FIOH2_IO06","PS10_5DIV2_SOL1"]
["PS10_5_FIOH2","IO07","PS10_5_FIOH2_IO07","PS10_5DIV2_SOL2"]
["PS10_5_FIOH2","IO08","PS10_5_FIOH2_IO08","PS10_5_ENC1"]
["PS10_5_FIOH2","IO09","PS10_5_FIOH2_IO09","PS10_5_JPE2"]
["PS10_5_FIOH2","IO10","PS10_5_FIOH2_IO10","PS10_5_JPE3"]
["PS10_5_FIOH2","IO11","PS10_5_FIOH2_IO11","PS10_3_JR1_PB"]
["PS10_5_FIOH2","IO12","PS10_5_FIOH2_IO12","PS10_3_JR1_PB_LT"]
["PS10_5_FIOH2","IO13","PS10_5_FIOH2_IO13"]
["PS10_5_FIOH2","IO14","PS10_5_FIOH2_IO14","PS10_3_BCN1_A"]
["PS10_5_FIOH2","IO15","PS10_5_FIOH2_IO15","PS10_3_BCN1_R"]
["PS10_5_FIOH3","IO00","PS10_5_FIOH3_IO00","PS10_5CH3_BCN1_A"]
["PS10_5_FIOH3","IO01","PS10_5_FIOH3_IO01"]
["PS10_5_FIOH3","IO02","PS10_5_FIOH3_IO02","PS10_5CH3_BCN1_B"]
["PS10_5_FIOH3","IO03","PS10_5_FIOH3_IO03"]
["PS10_5_FIOH3","IO04","PS10_5_FIOH3_IO04","PS10_5CH3_BCN1_G"]
["PS10_5_FIOH3","IO05","PS10_5_FIOH3_IO05"]
["PS10_5_FIOH3","IO06","PS10_5_FIOH3_IO06","PS10_5CH3_FPE1"]
["PS10_5_FIOH3","IO07","PS10_5_FIOH3_IO07"]
["PS10_5_FIOH3","IO08","PS10_5_FIOH3_IO08","PS10_5CH3_FPE2"]
["PS10_5_FIOH3","IO09","PS10_5_FIOH3_IO09"]
["PS10_5_FIOH3","IO10","PS10_5_FIOH3_IO10","PS10_5CH3_JPE1"]
["PS10_5_FIOH3","IO11","PS10_5_FIOH3_IO11"]
["PS10_5_FIOH3","IO12","PS10_5_FIOH3_IO12","PS10_5CH3_S1_PB"]
["PS10_5_FIOH3","IO13","PS10_5_FIOH3_IO13","PS10_5CH3_S1_PB_LT"]
["PS10_5_FIOH3","IO14","PS10_5_FIOH3_IO14"]
["PS10_5_FIOH3","IO15","PS10_5_FIOH3_IO15"]
["PS10_5_FIOH4","IO00","PS10_5_FIOH4_IO00","PS10_5CH4_BCN1_A"]
["PS10_5_FIOH4","IO01","PS10_5_FIOH4_IO01"]
["PS10_5_FIOH4","IO02","PS10_5_FIOH4_IO02","PS10_5CH4_BCN1_B"]
["PS10_5_FIOH4","IO03","PS10_5_FIOH4_IO03"]
["PS10_5_FIOH4","IO04","PS10_5_FIOH4_IO04","PS10_5CH4_BCN1_G"]
["PS10_5_FIOH4","IO05","PS10_5_FIOH4_IO05"]
["PS10_5_FIOH4","IO06","PS10_5_FIOH4_IO06","PS10_5CH4_FPE1"]
["PS10_5_FIOH4","IO07","PS10_5_FIOH4_IO07"]
["PS10_5_FIOH4","IO08","PS10_5_FIOH4_IO08","PS10_5CH4_FPE2"]
["PS10_5_FIOH4","IO09","PS10_5_FIOH4_IO09"]
["PS10_5_FIOH4","IO10","PS10_5_FIOH4_IO10","PS10_5CH4_JPE1"]
["PS10_5_FIOH4","IO11","PS10_5_FIOH4_IO11"]
["PS10_5_FIOH4","IO12","PS10_5_FIOH4_IO12","PS10_5CH4_S1_PB"]
["PS10_5_FIOH4","IO13","PS10_5_FIOH4_IO13","PS10_5CH4_S1_PB_LT"]
["PS10_5_FIOH4","IO14","PS10_5_FIOH4_IO14"]
["PS10_5_FIOH4","IO15","PS10_5_FIOH4_IO15"]
["PS11_1_FIO1","IO00","PS11_1_FIO1_IO00","PS11_1_BCN1_A"]
["PS11_1_FIO1","IO01","PS11_1_FIO1_IO01","PS11_1_BCN1_R"]
["PS11_1_FIO1","IO02","PS11_1_FIO1_IO02","PS11_1_JPE3"]
["PS11_1_FIO1","IO03","PS11_1_FIO1_IO03"]
["PS11_1_FIO1","IO04","PS11_1_FIO1_IO04","PS11_1_JPE4"]
["PS11_1_FIO1","IO05","PS11_1_FIO1_IO05"]
["PS11_1_FIO1","IO06","PS11_1_FIO1_IO06","PS11_1_JR1_PB"]
["PS11_1_FIO1","IO07","PS11_1_FIO1_IO07","PS11_1_JR1_PB_LT"]
["PS11_1_FIO1","IO08","PS11_1_FIO1_IO08","PS11_1_JR2_PB"]
["PS11_1_FIO1","IO09","PS11_1_FIO1_IO09","PS11_1_JR2_PB_LT"]
["PS11_1_FIO1","IO10","PS11_1_FIO1_IO10"]
["PS11_1_FIO1","IO11","PS11_1_FIO1_IO11"]
["PS11_1_FIO1","IO12","PS11_1_FIO1_IO12"]
["PS11_1_FIO1","IO13","PS11_1_FIO1_IO13"]
["PS11_1_FIO1","IO14","PS11_1_FIO1_IO14","PS11_1_FIOH1"]
["PS11_1_FIO1","IO15","PS11_1_FIO1_IO15"]
["PS11_1_FIOH1","IO00","PS11_1_FIOH1_IO00","ULC5_3_JR1_PB"]
["PS11_1_FIOH1","IO01","PS11_1_FIOH1_IO01","ULC5_3_JR1_PB_LT"]
["PS11_1_FIOH1","IO02","PS11_1_FIOH1_IO02","ULC5_3_SS1_SPB"]
["PS11_1_FIOH1","IO03","PS11_1_FIOH1_IO03","ULC5_3_SS1_STPB"]
["PS11_1_FIOH1","IO04","PS11_1_FIOH1_IO04","ULC5_3_SS1_STPB_LT"]
["PS11_1_FIOH1","IO05","PS11_1_FIOH1_IO05"]
["PS11_1_FIOH1","IO06","PS11_1_FIOH1_IO06","ULC5_3_SS2_SPB"]
["PS11_1_FIOH1","IO07","PS11_1_FIOH1_IO07","ULC5_3_SS2_STPB"]
["PS11_1_FIOH1","IO08","PS11_1_FIOH1_IO08","ULC5_3_SS2_STPB_LT"]
["PS11_1_FIOH1","IO09","PS11_1_FIOH1_IO09"]
["PS11_1_FIOH1","IO10","PS11_1_FIOH1_IO10","ULC6_3_JR1_PB"]
["PS11_1_FIOH1","IO11","PS11_1_FIOH1_IO11","ULC6_3_JR1_PB_LT"]
["PS11_1_FIOH1","IO12","PS11_1_FIOH1_IO12","ULC6_3_SS2_SPB"]
["PS11_1_FIOH1","IO13","PS11_1_FIOH1_IO13","ULC6_3_SS2_STPB"]
["PS11_1_FIOH1","IO14","PS11_1_FIOH1_IO14","ULC6_3_SS2_STPB_LT"]
["PS11_1_FIOH1","IO15","PS11_1_FIOH1_IO15"]
["PS11_11_FIO1","IO00","PS11_11_FIO1_IO00","PS11_11_BCN1_R"]
["PS11_11_FIO1","IO01","PS11_11_FIO1_IO01","PS11_11_BCN2_A"]
["PS11_11_FIO1","IO02","PS11_11_FIO1_IO02","PS11_11_BCN3_A"]
["PS11_11_FIO1","IO03","PS11_11_FIO1_IO03","PS11_11_BCN4_A"]
["PS11_11_FIO1","IO04","PS11_11_FIO1_IO04","PS11_11_JPE4"]
["PS11_11_FIO1","IO05","PS11_11_FIO1_IO05","PS11_11_JPE5"]
["PS11_11_FIO1","IO06","PS11_11_FIO1_IO06","PS11_11_JPE6"]
["PS11_11_FIO1","IO07","PS11_11_FIO1_IO07","PS11_11_JPE7"]
["PS11_11_FIO1","IO08","PS11_11_FIO1_IO08","PS11_11_JR1_PB"]
["PS11_11_FIO1","IO09","PS11_11_FIO1_IO09","PS11_11_JR1_PB_LT"]
["PS11_11_FIO1","IO10","PS11_11_FIO1_IO10","PS11_11_JR2_PB"]
["PS11_11_FIO1","IO11","PS11_11_FIO1_IO11","PS11_11_JR2_PB_LT"]
["PS11_11_FIO1","IO12","PS11_11_FIO1_IO12","PS11_11_FIOH1"]
["PS11_11_FIO1","IO13","PS11_11_FIO1_IO13"]
["PS11_11_FIO1","IO14","PS11_11_FIO1_IO14","PS11_11_FIOH2"]
["PS11_11_FIO1","IO15","PS11_11_FIO1_IO15"]
["PS11_11_FIO2","IO00","PS11_11_FIO2_IO00","PS11_11CH3_S1_PB"]
["PS11_11_FIO2","IO01","PS11_11_FIO2_IO01","PS11_11CH3_S1_PB_LT"]
["PS11_11_FIO2","IO02","PS11_11_FIO2_IO02","PS11_11DIV3_LS1"]
["PS11_11_FIO2","IO03","PS11_11_FIO2_IO03"]
["PS11_11_FIO2","IO04","PS11_11_FIO2_IO04","PS11_11DIV3_LS2"]
["PS11_11_FIO2","IO05","PS11_11_FIO2_IO05"]
["PS11_11_FIO2","IO06","PS11_11_FIO2_IO06","PS11_11DIV3_SOL1"]
["PS11_11_FIO2","IO07","PS11_11_FIO2_IO07"]
["PS11_11_FIO2","IO08","PS11_11_FIO2_IO08","PS11_11DIV3_SOL2"]
["PS11_11_FIO2","IO09","PS11_11_FIO2_IO09"]
["PS11_11_FIO2","IO10","PS11_11_FIO2_IO10","PS11_11_ENC1"]
["PS11_11_FIO2","IO11","PS11_11_FIO2_IO11"]
["PS11_11_FIO2","IO12","PS11_11_FIO2_IO12","PS11_11_JPE2"]
["PS11_11_FIO2","IO13","PS11_11_FIO2_IO13"]
["PS11_11_FIO2","IO14","PS11_11_FIO2_IO14","PS11_11_JPE3"]
["PS11_11_FIO2","IO15","PS11_11_FIO2_IO15"]
["PS11_11_FIO3","IO00","PS11_11_FIO3_IO00","PS11_11CH5_S1_PB"]
["PS11_11_FIO3","IO01","PS11_11_FIO3_IO01","PS11_11CH5_S1_PB_LT"]
["PS11_11_FIO3","IO02","PS11_11_FIO3_IO02","PS11_11DIV5_LS1"]
["PS11_11_FIO3","IO03","PS11_11_FIO3_IO03"]
["PS11_11_FIO3","IO04","PS11_11_FIO3_IO04","PS11_11DIV5_LS2"]
["PS11_11_FIO3","IO05","PS11_11_FIO3_IO05"]
["PS11_11_FIO3","IO06","PS11_11_FIO3_IO06","PS11_11DIV5_SOL1"]
["PS11_11_FIO3","IO07","PS11_11_FIO3_IO07"]
["PS11_11_FIO3","IO08","PS11_11_FIO3_IO08","PS11_11DIV5_SOL2"]
["PS11_11_FIO3","IO09","PS11_11_FIO3_IO09"]
["PS11_11_FIO3","IO10","PS11_11_FIO3_IO10"]
["PS11_11_FIO3","IO11","PS11_11_FIO3_IO11"]
["PS11_11_FIO3","IO12","PS11_11_FIO3_IO12","PS11_11_FIOH5"]
["PS11_11_FIO3","IO13","PS11_11_FIO3_IO13"]
["PS11_11_FIO3","IO14","PS11_11_FIO3_IO14","PS11_11_FIOH6"]
["PS11_11_FIO3","IO15","PS11_11_FIO3_IO15"]
["PS11_11_FIOH1","IO00","PS11_11_FIOH1_IO00","PS11_11_JR3_PB"]
["PS11_11_FIOH1","IO01","PS11_11_FIOH1_IO01","PS11_11_JR3_PB_LT"]
["PS11_11_FIOH1","IO02","PS11_11_FIOH1_IO02","PS11_11_PS1"]
["PS11_11_FIOH1","IO03","PS11_11_FIOH1_IO03"]
["PS11_11_FIOH1","IO04","PS11_11_FIOH1_IO04","PS11_11_S1_PB"]
["PS11_11_FIOH1","IO05","PS11_11_FIOH1_IO05","PS11_11_S1_PB_LT"]
["PS11_11_FIOH1","IO06","PS11_11_FIOH1_IO06","PS11_11_JPE1"]
["PS11_11_FIOH1","IO07","PS11_11_FIOH1_IO07","PS11_11CH1_BCN1_A"]
["PS11_11_FIOH1","IO08","PS11_11_FIOH1_IO08","PS11_11CH1_BCN1_B"]
["PS11_11_FIOH1","IO09","PS11_11_FIOH1_IO09","PS11_11CH1_BCN1_G"]
["PS11_11_FIOH1","IO10","PS11_11_FIOH1_IO10","PS11_11CH1_FPE1"]
["PS11_11_FIOH1","IO11","PS11_11_FIOH1_IO11","PS11_11CH1_FPE2"]
["PS11_11_FIOH1","IO12","PS11_11_FIOH1_IO12","PS11_11CH1_JPE1"]
["PS11_11_FIOH1","IO13","PS11_11_FIOH1_IO13","PS11_11CH1_S1_PB"]
["PS11_11_FIOH1","IO14","PS11_11_FIOH1_IO14","PS11_11CH1_S1_PB_LT"]
["PS11_11_FIOH1","IO15","PS11_11_FIOH1_IO15"]
["PS11_11_FIOH2","IO00","PS11_11_FIOH2_IO00","PS11_11CH2_BCN1_A"]
["PS11_11_FIOH2","IO01","PS11_11_FIOH2_IO01","PS11_11CH2_BCN1_B"]
["PS11_11_FIOH2","IO02","PS11_11_FIOH2_IO02","PS11_11CH2_BCN1_G"]
["PS11_11_FIOH2","IO03","PS11_11_FIOH2_IO03","PS11_11CH2_JPE1"]
["PS11_11_FIOH2","IO04","PS11_11_FIOH2_IO04","PS11_11CH2_FPE1"]
["PS11_11_FIOH2","IO05","PS11_11_FIOH2_IO05","PS11_11CH2_FPE2"]
["PS11_11_FIOH2","IO06","PS11_11_FIOH2_IO06","PS11_11CH2_S1_PB"]
["PS11_11_FIOH2","IO07","PS11_11_FIOH2_IO07","PS11_11CH2_S1_PB_LT"]
["PS11_11_FIOH2","IO08","PS11_11_FIOH2_IO08","PS11_11DIV1_LS1"]
["PS11_11_FIOH2","IO09","PS11_11_FIOH2_IO09","PS11_11DIV1_LS2"]
["PS11_11_FIOH2","IO10","PS11_11_FIOH2_IO10","PS11_11DIV1_SOL1"]
["PS11_11_FIOH2","IO11","PS11_11_FIOH2_IO11","PS11_11DIV1_SOL2"]
["PS11_11_FIOH2","IO12","PS11_11_FIOH2_IO12","PS11_11DIV2_LS1"]
["PS11_11_FIOH2","IO13","PS11_11_FIOH2_IO13","PS11_11DIV2_LS2"]
["PS11_11_FIOH2","IO14","PS11_11_FIOH2_IO14","PS11_11DIV2_SOL1"]
["PS11_11_FIOH2","IO15","PS11_11_FIOH2_IO15","PS11_11DIV2_SOL2"]
["PS11_11_FIOH3","IO00","PS11_11_FIOH3_IO00","PS11_11CH3_BCN1_G"]
["PS11_11_FIOH3","IO01","PS11_11_FIOH3_IO01"]
["PS11_11_FIOH3","IO02","PS11_11_FIOH3_IO02","PS11_11CH3_BCN2_A"]
["PS11_11_FIOH3","IO03","PS11_11_FIOH3_IO03"]
["PS11_11_FIOH3","IO04","PS11_11_FIOH3_IO04","PS11_11CH3_BCN3_B"]
["PS11_11_FIOH3","IO05","PS11_11_FIOH3_IO05"]
["PS11_11_FIOH3","IO06","PS11_11_FIOH3_IO06","PS11_11CH3_JPE1"]
["PS11_11_FIOH3","IO07","PS11_11_FIOH3_IO07"]
["PS11_11_FIOH3","IO08","PS11_11_FIOH3_IO08","PS11_11CH3_FPE1"]
["PS11_11_FIOH3","IO09","PS11_11_FIOH3_IO09"]
["PS11_11_FIOH3","IO10","PS11_11_FIOH3_IO10","PS11_11CH3_FPE2"]
["PS11_11_FIOH3","IO11","PS11_11_FIOH3_IO11"]
["PS11_11_FIOH3","IO12","PS11_11_FIOH3_IO12"]
["PS11_11_FIOH3","IO13","PS11_11_FIOH3_IO13"]
["PS11_11_FIOH3","IO14","PS11_11_FIOH3_IO14"]
["PS11_11_FIOH3","IO15","PS11_11_FIOH3_IO15"]
["PS11_11_FIOH4","IO00","PS11_11_FIOH4_IO00","PS11_11CH4_BCN1_A"]
["PS11_11_FIOH4","IO01","PS11_11_FIOH4_IO01"]
["PS11_11_FIOH4","IO02","PS11_11_FIOH4_IO02","PS11_11CH4_BCN1_B"]
["PS11_11_FIOH4","IO03","PS11_11_FIOH4_IO03"]
["PS11_11_FIOH4","IO04","PS11_11_FIOH4_IO04","PS11_11CH4_BCN1_G"]
["PS11_11_FIOH4","IO05","PS11_11_FIOH4_IO05"]
["PS11_11_FIOH4","IO06","PS11_11_FIOH4_IO06","PS11_11CH4_FPE1"]
["PS11_11_FIOH4","IO07","PS11_11_FIOH4_IO07","PS11_11CH4_FPE2"]
["PS11_11_FIOH4","IO08","PS11_11_FIOH4_IO08","PS11_11CH4_JPE1"]
["PS11_11_FIOH4","IO09","PS11_11_FIOH4_IO09"]
["PS11_11_FIOH4","IO10","PS11_11_FIOH4_IO10","PS11_11CH4_S1_PB"]
["PS11_11_FIOH4","IO11","PS11_11_FIOH4_IO11","PS11_11CH4_S1_PB_LT"]
["PS11_11_FIOH4","IO12","PS11_11_FIOH4_IO12","PS11_11DIV4_LS1"]
["PS11_11_FIOH4","IO13","PS11_11_FIOH4_IO13","PS11_11DIV4_LS2"]
["PS11_11_FIOH4","IO14","PS11_11_FIOH4_IO14","PS11_11DIV4_SOL1"]
["PS11_11_FIOH4","IO15","PS11_11_FIOH4_IO15","PS11_11DIV4_SOL2"]
["PS11_11_FIOH5","IO00","PS11_11_FIOH5_IO00","PS11_11CH5_BCN1_A"]
["PS11_11_FIOH5","IO01","PS11_11_FIOH5_IO01"]
["PS11_11_FIOH5","IO02","PS11_11_FIOH5_IO02","PS11_11CH5_BCN1_B"]
["PS11_11_FIOH5","IO03","PS11_11_FIOH5_IO03"]
["PS11_11_FIOH5","IO04","PS11_11_FIOH5_IO04","PS11_11CH5_BCN1_G"]
["PS11_11_FIOH5","IO05","PS11_11_FIOH5_IO05"]
["PS11_11_FIOH5","IO06","PS11_11_FIOH5_IO06","PS11_11CH5_JPE1"]
["PS11_11_FIOH5","IO07","PS11_11_FIOH5_IO07"]
["PS11_11_FIOH5","IO08","PS11_11_FIOH5_IO08","PS11_11CH5_FPE1"]
["PS11_11_FIOH5","IO09","PS11_11_FIOH5_IO09"]
["PS11_11_FIOH5","IO10","PS11_11_FIOH5_IO10","PS11_11CH5_FPE2"]
["PS11_11_FIOH5","IO11","PS11_11_FIOH5_IO11"]
["PS11_11_FIOH5","IO12","PS11_11_FIOH5_IO12"]
["PS11_11_FIOH5","IO13","PS11_11_FIOH5_IO13"]
["PS11_11_FIOH5","IO14","PS11_11_FIOH5_IO14"]
["PS11_11_FIOH5","IO15","PS11_11_FIOH5_IO15"]
["PS11_11_FIOH6","IO00","PS11_11_FIOH6_IO00","PS11_11CH6_BCN1_A"]
["PS11_11_FIOH6","IO01","PS11_11_FIOH6_IO01","PS11_11CH6_BCN1_B"]
["PS11_11_FIOH6","IO02","PS11_11_FIOH6_IO02","PS11_11CH6_BCN1_G"]
["PS11_11_FIOH6","IO03","PS11_11_FIOH6_IO03","PS11_11CH6_JPE1"]
["PS11_11_FIOH6","IO04","PS11_11_FIOH6_IO04","PS11_11CH6_FPE1"]
["PS11_11_FIOH6","IO05","PS11_11_FIOH6_IO05","PS11_11CH6_FPE2"]
["PS11_11_FIOH6","IO06","PS11_11_FIOH6_IO06","PS11_11CH6_S1_PB"]
["PS11_11_FIOH6","IO07","PS11_11_FIOH6_IO07","PS11_11CH6_S1_PB_LT"]
["PS11_11_FIOH6","IO08","PS11_11_FIOH6_IO08","PS11_11DIV6_LS1"]
["PS11_11_FIOH6","IO09","PS11_11_FIOH6_IO09"]
["PS11_11_FIOH6","IO10","PS11_11_FIOH6_IO10","PS11_11DIV6_LS2"]
["PS11_11_FIOH6","IO11","PS11_11_FIOH6_IO11"]
["PS11_11_FIOH6","IO12","PS11_11_FIOH6_IO12","PS11_11DIV6_SOL1"]
["PS11_11_FIOH6","IO13","PS11_11_FIOH6_IO13","PS11_11DIV6_SOL2"]
["PS11_11_FIOH6","IO14","PS11_11_FIOH6_IO14","PS11_12CH_FPE1"]
["PS11_11_FIOH6","IO15","PS11_11_FIOH6_IO15"]
["PS11_3_FIO1","IO00","PS11_3_FIO1_IO00","PS11_3_BCN2_R"]
["PS11_3_FIO1","IO01","PS11_3_FIO1_IO01"]
["PS11_3_FIO1","IO02","PS11_3_FIO1_IO02","PS11_3_S1_PB"]
["PS11_3_FIO1","IO03","PS11_3_FIO1_IO03","PS11_3_S1_PB_LT"]
["PS11_3_FIO1","IO04","PS11_3_FIO1_IO04","PS11_3_S2_PB"]
["PS11_3_FIO1","IO05","PS11_3_FIO1_IO05","PS11_3_S2_PB_LT"]
["PS11_3_FIO1","IO06","PS11_3_FIO1_IO06"]
["PS11_3_FIO1","IO07","PS11_3_FIO1_IO07"]
["PS11_3_FIO1","IO08","PS11_3_FIO1_IO08"]
["PS11_3_FIO1","IO09","PS11_3_FIO1_IO09"]
["PS11_3_FIO1","IO10","PS11_3_FIO1_IO10"]
["PS11_3_FIO1","IO11","PS11_3_FIO1_IO11"]
["PS11_3_FIO1","IO12","PS11_3_FIO1_IO12"]
["PS11_3_FIO1","IO13","PS11_3_FIO1_IO13"]
["PS11_3_FIO1","IO14","PS11_3_FIO1_IO14"]
["PS11_3_FIO1","IO15","PS11_3_FIO1_IO15"]
["PS11_4_FIO1","IO00","PS11_4_FIO1_IO00","PS11_4_BCN1_A"]
["PS11_4_FIO1","IO01","PS11_4_FIO1_IO01","PS11_4_BCN1_R"]
["PS11_4_FIO1","IO02","PS11_4_FIO1_IO02","PS11_4_BCN2_R"]
["PS11_4_FIO1","IO03","PS11_4_FIO1_IO03"]
["PS11_4_FIO1","IO04","PS11_4_FIO1_IO04","PS11_4_S1_PB"]
["PS11_4_FIO1","IO05","PS11_4_FIO1_IO05","PS11_4_S1_PB_LT"]
["PS11_4_FIO1","IO06","PS11_4_FIO1_IO06","PS11_4_S2_PB"]
["PS11_4_FIO1","IO07","PS11_4_FIO1_IO07","PS11_4_S2_PB_LT"]
["PS11_4_FIO1","IO08","PS11_4_FIO1_IO08"]
["PS11_4_FIO1","IO09","PS11_4_FIO1_IO09"]
["PS11_4_FIO1","IO10","PS11_4_FIO1_IO10"]
["PS11_4_FIO1","IO11","PS11_4_FIO1_IO11"]
["PS11_4_FIO1","IO12","PS11_4_FIO1_IO12"]
["PS11_4_FIO1","IO13","PS11_4_FIO1_IO13"]
["PS11_4_FIO1","IO14","PS11_4_FIO1_IO14"]
["PS11_4_FIO1","IO15","PS11_4_FIO1_IO15"]
["PS11_7_FIO1","IO00","PS11_7_FIO1_IO00","PS11_7_BCN1_R"]
["PS11_7_FIO1","IO01","PS11_7_FIO1_IO01","PS11_7_BCN1_H"]
["PS11_7_FIO1","IO02","PS11_7_FIO1_IO02","PS11_7_BCN2_R"]
["PS11_7_FIO1","IO03","PS11_7_FIO1_IO03"]
["PS11_7_FIO1","IO04","PS11_7_FIO1_IO04","PS11_7_S1_PB"]
["PS11_7_FIO1","IO05","PS11_7_FIO1_IO05","PS11_7_S1_PB_LT"]
["PS11_7_FIO1","IO06","PS11_7_FIO1_IO06","PS11_7_S2_PB"]
["PS11_7_FIO1","IO07","PS11_7_FIO1_IO07","PS11_7_S2_PB_LT"]
["PS11_7_FIO1","IO08","PS11_7_FIO1_IO08"]
["PS11_7_FIO1","IO09","PS11_7_FIO1_IO09"]
["PS11_7_FIO1","IO10","PS11_7_FIO1_IO10"]
["PS11_7_FIO1","IO11","PS11_7_FIO1_IO11"]
["PS11_7_FIO1","IO12","PS11_7_FIO1_IO12"]
["PS11_7_FIO1","IO13","PS11_7_FIO1_IO13"]
["PS11_7_FIO1","IO14","PS11_7_FIO1_IO14"]
["PS11_7_FIO1","IO15","PS11_7_FIO1_IO15"]
["FL1014_FIOH1","IO8",{"$f":"_xlfn.CONCAT(A676,\"_\",B676)","v":"FL1014_FIOH1_IO8"},"FL1014_2_BCN1_A"]
["FL1014_FIOH1","IO9","FL1014_FIOH1_IO9","FL1014_2_BCN1_B"]
["FL1014_FIOH1","IO10","FL1014_FIOH1_IO10","FL1014_2_JR1_PB"]
["FL1014_FIOH1","IO11","FL1014_FIOH1_IO11","FL1014_2_JR1_PB_LT"]
["FL1014_FIOH1","IO12","FL1014_FIOH1_IO12","FL1014_1CH_PE1"]
["FL1014_FIOH1","IO13","FL1014_FIOH1_IO13"]
["FL1014_FIOH1","IO14","FL1014_FIOH1_IO14"]
["FL1014_FIOH1","IO15","FL1014_FIOH1_IO15"]
["S011020_FIOH1","IO8","S011020_FIOH1_IO8","FL1018_2_BCN1_A"]
["S011020_FIOH1","IO9","S011020_FIOH1_IO9","FL1018_2_BCN1_B"]
["S011020_FIOH1","IO10","S011020_FIOH1_IO10","FL1018_2_JR1_PB"]
["S011020_FIOH1","IO11","S011020_FIOH1_IO11","FL1018_2_JR1_PB_LT"]
["S011020_FIOH1","IO12","S011020_FIOH1_IO12","FL1018_1CH_PE1"]
["S011020_FIOH1","IO13","S011020_FIOH1_IO13"]
["S011020_FIOH1","IO14","S011020_FIOH1_IO14"]
["S011020_FIOH1","IO15","S011020_FIOH1_IO15"]
["FL1022_FIOH1","IO8","FL1022_FIOH1_IO8","FL1022_2_BCN1_A"]
["FL1022_FIOH1","IO9","FL1022_FIOH1_IO9","FL1022_2_BCN1_B"]
["FL1022_FIOH1","IO10","FL1022_FIOH1_IO10","FL1022_2_JR1_PB"]
["FL1022_FIOH1","IO11","FL1022_FIOH1_IO11","FL1022_2_JR1_PB_LT"]
["FL1022_FIOH1","IO12","FL1022_FIOH1_IO12","FL1022_1CH_PE1"]
["FL1022_FIOH1","IO13","FL1022_FIOH1_IO13"]
["FL1022_FIOH1","IO14","FL1022_FIOH1_IO14"]
["FL1022_FIOH1","IO15","FL1022_FIOH1_IO15"]
["FL1026_FIOH1","IO8","FL1026_FIOH1_IO8","FL1026_2_BCN1_A"]
["FL1026_FIOH1","IO9","FL1026_FIOH1_IO9","FL1026_2_BCN1_B"]
["FL1026_FIOH1","IO10","FL1026_FIOH1_IO10","FL1026_2_JR1_PB"]
["FL1026_FIOH1","IO11","FL1026_FIOH1_IO11","FL1026_2_JR1_PB_LT"]
["FL1026_FIOH1","IO12","FL1026_FIOH1_IO12","FL1026_1CH_PE1"]
["FL1026_FIOH1","IO13","FL1026_FIOH1_IO13"]
["FL1026_FIOH1","IO14","FL1026_FIOH1_IO14"]
["FL1026_FIOH1","IO15","FL1026_FIOH1_IO15"]
["FL1034_FIOH1","IO8",{"$f":"_xlfn.CONCAT(A708,\"_\",B708)","v":"FL1034_FIOH1_IO8"},"FL1034_2_BCN1_A"]
["FL1034_FIOH1","IO9","FL1034_FIOH1_IO9","FL1034_2_BCN1_B"]
["FL1034_FIOH1","IO10","FL1034_FIOH1_IO10","FL1034_2_JR1_PB"]
["FL1034_FIOH1","IO11","FL1034_FIOH1_IO11","FL1034_2_JR1_PB_LT"]
["FL1034_FIOH1","IO12","FL1034_FIOH1_IO12","FL1034_1CH_PE1"]
["FL1034_FIOH1","IO13","FL1034_FIOH1_IO13"]
["FL1034_FIOH1","IO14","FL1034_FIOH1_IO14"]
["FL1034_FIOH1","IO15","FL1034_FIOH1_IO15"]
["S011040_FIOH1","IO8","S011040_FIOH1_IO8","FL1038_2_BCN1_A"]
["S011040_FIOH1","IO9","S011040_FIOH1_IO9","FL1038_2_BCN1_B"]
["S011040_FIOH1","IO10","S011040_FIOH1_IO10","FL1038_2_JR1_PB"]
["S011040_FIOH1","IO11","S011040_FIOH1_IO11","FL1038_2_JR1_PB_LT"]
["S011040_FIOH1","IO12","S011040_FIOH1_IO12","FL1038_1CH_PE1"]
["S011040_FIOH1","IO13","S011040_FIOH1_IO13"]
["S011040_FIOH1","IO14","S011040_FIOH1_IO14"]
["S011040_FIOH1","IO15","S011040_FIOH1_IO15"]
["S013010_FIOH1","IO8","S013010_FIOH1_IO8","FL3012_2_BCN1_A"]
["S013010_FIOH1","IO9","S013010_FIOH1_IO9","FL3012_2_BCN1_B"]
["S013010_FIOH1","IO10","S013010_FIOH1_IO10","FL3012_2_JR1_PB"]
["S013010_FIOH1","IO11","S013010_FIOH1_IO11","FL3012_2_JR1_PB_LT"]
["S013010_FIOH1","IO12","S013010_FIOH1_IO12","FL3012_1CH_PE1"]
["S013010_FIOH1","IO13","S013010_FIOH1_IO13"]
["S013010_FIOH1","IO14","S013010_FIOH1_IO14"]
["S013010_FIOH1","IO15","S013010_FIOH1_IO15"]
["FL3016_FIOH1","IO8","FL3016_FIOH1_IO8","FL3016_2_BCN1_A"]
["FL3016_FIOH1","IO9","FL3016_FIOH1_IO9","FL3016_2_BCN1_B"]
["FL3016_FIOH1","IO10","FL3016_FIOH1_IO10","FL3016_2_JR1_PB"]
["FL3016_FIOH1","IO11","FL3016_FIOH1_IO11","FL3016_2_JR1_PB_LT"]
["FL3016_FIOH1","IO12","FL3016_FIOH1_IO12","FL3016_1CH_PE1"]
["FL3016_FIOH1","IO13","FL3016_FIOH1_IO13"]
["FL3016_FIOH1","IO14","FL3016_FIOH1_IO14"]
["FL3016_FIOH1","IO15","FL3016_FIOH1_IO15"]
["S013018_FIOH1","IO8",{"$f":"_xlfn.CONCAT(A740,B740)","v":"S013018_FIOH1IO8"},"FL3020_2_BCN1_A"]
["S013018_FIOH1","IO9","S013018_FIOH1IO9","FL3020_2_BCN1_B"]
["S013018_FIOH1","IO10","S013018_FIOH1IO10","FL3020_2_JR1_PB"]
["S013018_FIOH1","IO11","S013018_FIOH1IO11","FL3020_2_JR1_PB_LT"]
["S013018_FIOH1","IO12","S013018_FIOH1IO12","FL3020_1CH_PE1"]
["S013018_FIOH1","IO13","S013018_FIOH1IO13"]
["S013018_FIOH1","IO14","S013018_FIOH1IO14"]
["S013018_FIOH1","IO15","S013018_FIOH1IO15"]
["FL3024_FIOH1","IO8","FL3024_FIOH1IO8","FL3024_2_BCN1_A"]
["FL3024_FIOH1","IO9","FL3024_FIOH1IO9","FL3024_2_BCN1_B"]
["FL3024_FIOH1","IO10","FL3024_FIOH1IO10","FL3024_2_JR1_PB"]
["FL3024_FIOH1","IO11","FL3024_FIOH1IO11","FL3024_2_JR1_PB_LT"]
["FL3024_FIOH1","IO12","FL3024_FIOH1IO12","FL3024_1CH_PE1"]
["FL3024_FIOH1","IO13","FL3024_FIOH1IO13"]
["FL3024_FIOH1","IO14","FL3024_FIOH1IO14"]
["FL3024_FIOH1","IO15","FL3024_FIOH1IO15"]

{"sheet":"NETWORK","index":4,"n_rows":199,"n_cols":18,"rows_kept":199,"cut":false,"hidden":false,"merged":[[109,9,113,9]]}
["DPM","DPM_IP","Name","PartNumber","IP"]
["PRS3_5_DPM1","11.200.1.2","PRS4_1_VFD1","35S-6D5-P111","11.200.1.30",null,null,null,"HP",null,null,null,null,"PRS3_5_DPM1",null,"LOOP","PORT 1","PORT 2"]
["PRS3_5_DPM1","11.200.1.2","PRS4_2_VFD1","35S-6D4-P111","11.200.1.31",null,null,null,{"$f":"VLOOKUP(D2,'Part number'!$A$1:$B$13,2,0)","v":7.5},null,null,null,null,"PS11_7_DPM1",null,"MCM04"]
["PRS3_5_DPM1","11.200.1.2","PRS3_2B_VFD1","35S-6D2-P101","11.200.1.32",null,null,null,{"$f":"VLOOKUP(D3,'Part number'!$A$1:$B$13,2,0)","v":5},null,null,null,null,"PS10_2_DPM1",null,"PS10_2_DPM1",{"$f":"_xlfn.CONCAT(\"FROM \",P3,\" TO \", P4)","v":"FROM MCM04 TO PS10_2_DPM1"},{"$f":"_xlfn.CONCAT(\"FROM \",P4,\" TO \", P5)","v":"FROM PS10_2_DPM1 TO VSA_DPM3"}]
["PRS3_5_DPM1","11.200.1.2","PRS3_3B_VFD1","35S-6D2-P101","11.200.1.33",null,null,null,{"$f":"VLOOKUP(D4,'Part number'!$A$1:$B$13,2,0)","v":2},null,null,null,null,"FL1034_2_DPM1",null,"VSA_DPM3",{"$f":"_xlfn.CONCAT(\"FROM \",P4,\" TO \", P5)","v":"FROM PS10_2_DPM1 TO VSA_DPM3"},{"$f":"_xlfn.CONCAT(\"FROM \",P5,\" TO \", P6)","v":"FROM VSA_DPM3 TO VSA_DPM2"}]
["PRS3_5_DPM1","11.200.1.2","PRS3_2A_VFD1","35S-6D3-P101","11.200.1.34",null,null,null,{"$f":"VLOOKUP(D5,'Part number'!$A$1:$B$13,2,0)","v":2},null,null,null,null,"FL3016_2_DPM1",null,"VSA_DPM2","FROM VSA_DPM3 TO VSA_DPM2","FROM VSA_DPM2 TO FL1034_2_DPM1"]
["PRS3_5_DPM1","11.200.1.2","PRS3_3A_VFD1","35S-6D2-P101","11.200.1.35",null,null,null,{"$f":"VLOOKUP(D6,'Part number'!$A$1:$B$13,2,0)","v":3},null,null,null,null,"VSA_DPM1",null,"FL1034_2_DPM1","FROM VSA_DPM2 TO FL1034_2_DPM1","FROM FL1034_2_DPM1 TO VSA_DPM1"]
["PRS3_5_DPM1","11.200.1.2","PRS3_5_VFD1","35S-6D2-P101","11.200.1.36",null,null,null,{"$f":"VLOOKUP(D7,'Part number'!$A$1:$B$13,2,0)","v":2},null,null,null,null,"VSA_DPM2",null,"VSA_DPM1","FROM FL1034_2_DPM1 TO VSA_DPM1","FROM VSA_DPM1 TO VSC_DPM1"]
["PRS3_5_DPM1","11.200.1.2","PRS3_6_MDR1","MDR","11.200.1.230",null,null,null,{"$f":"VLOOKUP(D8,'Part number'!$A$1:$B$13,2,0)","v":2},null,null,null,null,"VSA_DPM3",null,"VSC_DPM1","FROM VSA_DPM1 TO VSC_DPM1","FROM VSC_DPM1 TO FL3016_2_DPM1"]
["PRS3_5_DPM1","11.200.1.2","PS11_1_VFD1","35S-6D4-P111","11.200.1.37",null,null,null,"MDR",null,null,null,null,"VSC_DPM1",null,"FL3016_2_DPM1","FROM VSC_DPM1 TO FL3016_2_DPM1","FROM FL3016_2_DPM1 TO VSC_DPM2"]
["PRS3_5_DPM1","11.200.1.2","PS11_2_VFD1","35S-6D4-P111","11.200.1.38",null,null,null,{"$f":"VLOOKUP(D10,'Part number'!$A$1:$B$13,2,0)","v":5},null,null,null,null,"VSC_DPM2",null,"VSC_DPM2","FROM FL3016_2_DPM1 TO VSC_DPM2","FROM VSC_DPM2 TO VSC_DPM3"]
["PRS3_5_DPM1","11.200.1.2","PS11_3_VFD1","35S-6D6-P111","11.200.1.39",null,null,null,{"$f":"VLOOKUP(D11,'Part number'!$A$1:$B$13,2,0)","v":5},null,null,null,null,"VSC_DPM3",null,"VSC_DPM3","FROM VSC_DPM2 TO VSC_DPM3","FROM VSC_DPM3 TO PS11_7_DPM1"]
["PRS3_5_DPM1","11.200.1.2","PS11_4_VFD1","35S-6D6-P111","11.200.1.40",null,null,null,{"$f":"VLOOKUP(D12,'Part number'!$A$1:$B$13,2,0)","v":10},null,null,null,null,null,null,"PS11_7_DPM1","FROM VSC_DPM3 TO PS11_7_DPM1","FROM PS11_7_DPM1 TO PRS3_5_DPM1"]
["PRS3_5_DPM1","11.200.1.2","PRS3_2A_FIO1","5032-8IOLM12DR","11.200.1.41",null,null,null,{"$f":"VLOOKUP(D13,'Part number'!$A$1:$B$13,2,0)","v":10},null,null,null,null,null,null,"PRS3_5_DPM1","FROM PS11_7_DPM1 TO PRS3_5_DPM1","FROM PRS3_5_DPM1 TO MCM04"]
["PRS3_5_DPM1","11.200.1.2","PRS3_2B_FIO1","5032-8IOLM12DR","11.200.1.42",null,null,null,{"$f":"VLOOKUP(D15,'Part number'!$A$1:$B$13,2,0)","v":"FIO"},null,null,null,null,null,null,"MCM04"]
["PRS3_5_DPM1","11.200.1.2","PRS3_4CH_FIO1","5032-8IOLM12DR","11.200.1.43",null,null,null,{"$f":"VLOOKUP(D16,'Part number'!$A$1:$B$13,2,0)","v":"FIO"}]
["PRS3_5_DPM1","11.200.1.2","PRS4_2_FIO1","5032-8IOLM12DR","11.200.1.44",null,null,null,{"$f":"VLOOKUP(D17,'Part number'!$A$1:$B$13,2,0)","v":"FIO"}]
["PRS3_5_DPM1","11.200.1.2","PS11_1_FIO1","5032-8IOLM12DR","11.200.1.45",null,null,null,{"$f":"VLOOKUP(D18,'Part number'!$A$1:$B$13,2,0)","v":"FIO"},null,null,null,null,null,null,"MCM04"]
["PRS3_5_DPM1","11.200.1.2","PS11_3_FIO1","5032-8IOLM12DR","11.200.1.46",null,null,null,{"$f":"VLOOKUP(D19,'Part number'!$A$1:$B$13,2,0)","v":"FIO"},null,null,null,null,null,null,"PS10_2_DPM1","FROM MCM04 TO PS10_2_DPM1","FROM PS10_2_DPM1 TO VSA_DPM3"]
["PRS3_5_DPM1","11.200.1.2","PS11_4_FIO1","5032-8IOLM12DR","11.200.1.47",null,null,null,{"$f":"VLOOKUP(D20,'Part number'!$A$1:$B$13,2,0)","v":"FIO"},null,null,null,null,null,null,"VSA_DPM3","FROM PS10_2_DPM1 TO VSA_DPM3","FROM VSA_DPM3 TO VSA_DPM2"]
["PS11_7_DPM1","11.200.1.3","PS11_6_VFD1","35S-6D6-P111","11.200.1.48",null,null,null,"FIO",null,null,null,null,null,null,"VSA_DPM2","FROM VSA_DPM3 TO VSA_DPM2","FROM VSA_DPM2 TO FL1034_2_DPM1"]
["PS11_7_DPM1","11.200.1.3","PS11_7_VFD1","25B-D030N104","11.200.1.49",null,null,null,{"$f":"VLOOKUP(D21,'Part number'!$A$1:$B$13,2,0)","v":10},null,null,null,null,null,null,"FL1034_2_DPM1","FROM VSA_DPM2 TO FL1034_2_DPM1","FROM FL1034_2_DPM1 TO VSA_DPM1"]
["PS11_7_DPM1","11.200.1.3","PS11_8_VFD1","25B-D024N104","11.200.1.50",null,null,null,{"$f":"VLOOKUP(D22,'Part number'!$A$1:$B$13,2,0)","v":20},null,null,null,null,null,null,"VSA_DPM1","FROM FL1034_2_DPM1 TO VSA_DPM1","FROM VSA_DPM1 TO VSC_DPM1"]
["PS11_7_DPM1","11.200.1.3","PS11_9_VFD1","25B-D024N104","11.200.1.51",null,null,null,{"$f":"VLOOKUP(D23,'Part number'!$A$1:$B$13,2,0)","v":15},null,null,null,null,null,null,"VSC_DPM1","FROM VSA_DPM1 TO VSC_DPM1","FROM VSC_DPM1 TO FL3016_2_DPM1"]
["PS11_7_DPM1","11.200.1.3","PS11_11_VFD1","25B-D024N104","11.200.1.52",null,null,null,{"$f":"VLOOKUP(D24,'Part number'!$A$1:$B$13,2,0)","v":15},null,null,null,null,null,null,"FL3016_2_DPM1","FROM VSC_DPM1 TO FL3016_2_DPM1","FROM FL3016_2_DPM1 TO VSC_DPM2"]
["PS11_7_DPM1","11.200.1.3","PS11_7_FIO1","5032-8IOLM12DR","11.200.1.53",null,null,null,{"$f":"VLOOKUP(D25,'Part number'!$A$1:$B$13,2,0)","v":15},null,null,null,null,null,null,"VSC_DPM2","FROM FL3016_2_DPM1 TO VSC_DPM2","FROM VSC_DPM2 TO VSC_DPM3"]
["PS11_7_DPM1","11.200.1.3","PS11_8_SIO1","0980SSL3131-121-007D-202","11.200.1.54",null,null,null,{"$f":"VLOOKUP(D26,'Part number'!$A$1:$B$13,2,0)","v":"FIO"},null,null,null,null,null,null,"VSC_DPM3","FROM VSC_DPM2 TO VSC_DPM3","FROM VSC_DPM3 TO PS11_7_DPM1"]
["PS11_7_DPM1","11.200.1.3","PS11_11_FIO1","5032-8IOLM12DR","11.200.1.55",null,null,null,"SIO",null,null,null,null,null,null,"PS11_7_DPM1","FROM VSC_DPM3 TO PS11_7_DPM1","FROM PS11_7_DPM1 TO PRS3_5_DPM1"]
["PS11_7_DPM1","11.200.1.3","PS11_11_FIO2","5032-8IOLM12DR","11.200.1.93",null,null,null,{"$f":"VLOOKUP(D28,'Part number'!$A$1:$B$13,2,0)","v":"FIO"},null,null,null,null,null,null,"PRS3_5_DPM1","FROM PS11_7_DPM1 TO PRS3_5_DPM1","FROM PRS3_5_DPM1 TO MCM04"]
["PS11_7_DPM1","11.200.1.3","PS11_11_FIO3","5032-8IOLM12DR","11.200.1.94",null,null,null,{"$f":"VLOOKUP(D29,'Part number'!$A$1:$B$13,2,0)","v":"FIO"},"add","2025-05-19",null,null,null,null,"MCM04"]
["PS11_7_DPM1","11.200.1.3","PDP9_FIO1","5032-8IOLM12DR","11.200.1.220",null,null,null,{"$f":"VLOOKUP(D30,'Part number'!$A$1:$B$13,2,0)","v":"FIO"},"add","2025-05-19"]
["PS11_7_DPM1","11.200.1.3","PDP9_PMM1","1420-V2-ENT","11.200.1.221",null,null,null,{"$f":"VLOOKUP(D31,'Part number'!$A$1:$B$13,2,0)","v":"FIO"},"ADDED","2025-05-25"]
["PS11_7_DPM1","11.200.1.3","PDP10_FIO1","5032-8IOLM12DR","11.200.1.222",null,null,null,"PMM","ADDED","2025-05-26"]
["PS11_7_DPM1","11.200.1.3","PDP10_PMM1","1420-V2-ENT","11.200.1.223",null,null,null,"FIO","ADDED","2025-05-27"]
["PS10_2_DPM1","11.200.1.4","PS10_1_VFD1","35S-6D4-P111","11.200.1.56",null,null,null,"PMM","ADDED","2025-05-28"]
["PS10_2_DPM1","11.200.1.4","PS10_2_VFD1","25B-D024N104","11.200.1.57",null,null,null,{"$f":"VLOOKUP(D35,'Part number'!$A$1:$B$13,2,0)","v":5}]
["PS10_2_DPM1","11.200.1.4","PS10_3_VFD1","25B-D024N104","11.200.1.58",null,null,null,{"$f":"VLOOKUP(D36,'Part number'!$A$1:$B$13,2,0)","v":15}]
["PS10_2_DPM1","11.200.1.4","PS10_5_VFD1","25B-D024N104","11.200.1.59",null,null,null,{"$f":"VLOOKUP(D37,'Part number'!$A$1:$B$13,2,0)","v":15}]
["PS10_2_DPM1","11.200.1.4","ULC5_1_ST1","PIONEER","11.200.1.60",null,null,null,{"$f":"VLOOKUP(D38,'Part number'!$A$1:$B$13,2,0)","v":15}]
["PS10_2_DPM1","11.200.1.4","ULC5_3_VFD1","35S-6D2-P101","11.200.1.61",null,null,null,{"$f":"VLOOKUP(D39,'Part number'!$A$1:$B$13,2,0)","v":"TIPPER"}]
["PS10_2_DPM1","11.200.1.4","ULC6_1_ST1","PIONEER","11.200.1.62",null,null,null,{"$f":"VLOOKUP(D40,'Part number'!$A$1:$B$13,2,0)","v":2}]
["PS10_2_DPM1","11.200.1.4","ULC6_3_VFD1","35S-6D2-P101","11.200.1.63",null,null,null,{"$f":"VLOOKUP(D41,'Part number'!$A$1:$B$13,2,0)","v":"TIPPER"}]
["PS10_2_DPM1","11.200.1.4","ULC7_1_ST1","PIONEER","11.200.1.64",null,null,null,{"$f":"VLOOKUP(D42,'Part number'!$A$1:$B$13,2,0)","v":2}]
["PS10_2_DPM1","11.200.1.4","ULC7_3_VFD1","35S-6D2-P101","11.200.1.65",null,null,null,{"$f":"VLOOKUP(D43,'Part number'!$A$1:$B$13,2,0)","v":"TIPPER"}]
["PS10_2_DPM1","11.200.1.4","ULC8_1_ST1","PIONEER","11.200.1.66",null,null,null,{"$f":"VLOOKUP(D44,'Part number'!$A$1:$B$13,2,0)","v":2}]
["PS10_2_DPM1","11.200.1.4","ULC8_3_VFD1","35S-6D2-P101","11.200.1.67",null,null,null,{"$f":"VLOOKUP(D45,'Part number'!$A$1:$B$13,2,0)","v":"TIPPER"}]
["PS10_2_DPM1","11.200.1.4","PS10_1_FIO1","5032-8IOLM12DR","11.200.1.68",null,null,null,{"$f":"VLOOKUP(D46,'Part number'!$A$1:$B$13,2,0)","v":2}]
["PS10_2_DPM1","11.200.1.4","PS10_5_FIO1","5032-8IOLM12DR","11.200.1.69",null,null,null,{"$f":"VLOOKUP(D47,'Part number'!$A$1:$B$13,2,0)","v":"FIO"}]
["PS10_2_DPM1","11.200.1.4","PS10_5_FIO2","5032-8IOLM12DR","11.200.1.70",null,null,null,{"$f":"VLOOKUP(D48,'Part number'!$A$1:$B$13,2,0)","v":"FIO"}]
["PS10_2_DPM1","11.200.1.4","PS10_5_SIO1","0980SSL3131-121-007D-202","11.200.1.71",null,null,null,{"$f":"VLOOKUP(D49,'Part number'!$A$1:$B$13,2,0)","v":"FIO"}]
["FL1034_2_DPM1","11.200.1.5","FL1014_2_VFD1","35S-6D4-P111","11.200.1.72",null,null,null,"SIO"]
["FL1034_2_DPM1","11.200.1.5","FL1014_4_EX1","CALJAN","11.200.1.73",null,null,null,{"$f":"VLOOKUP(D51,'Part number'!$A$1:$B$13,2,0)","v":5}]
["FL1034_2_DPM1","11.200.1.5","FL1018_2_VFD1","35S-6D4-P111","11.200.1.74",null,null,null,{"$f":"VLOOKUP(D52,'Part number'!$A$1:$B$13,2,0)","v":"EXTENDO"}]
["FL1034_2_DPM1","11.200.1.5","FL1018_4_EX1","CALJAN","11.200.1.75",null,null,null,{"$f":"VLOOKUP(D53,'Part number'!$A$1:$B$13,2,0)","v":5}]
["FL1034_2_DPM1","11.200.1.5","FL1022_2_VFD1","35S-6D4-P111","11.200.1.76",null,null,null,{"$f":"VLOOKUP(D54,'Part number'!$A$1:$B$13,2,0)","v":"EXTENDO"}]
["FL1034_2_DPM1","11.200.1.5","FL1022_4_EX1","CALJAN","11.200.1.77",null,null,null,{"$f":"VLOOKUP(D55,'Part number'!$A$1:$B$13,2,0)","v":5}]
["FL1034_2_DPM1","11.200.1.5","FL1026_2_VFD1","35S-6D4-P111","11.200.1.78",null,null,null,{"$f":"VLOOKUP(D56,'Part number'!$A$1:$B$13,2,0)","v":"EXTENDO"}]
["FL1034_2_DPM1","11.200.1.5","FL1026_4_EX1","CALJAN","11.200.1.79",null,null,null,{"$f":"VLOOKUP(D57,'Part number'!$A$1:$B$13,2,0)","v":5}]
["FL1034_2_DPM1","11.200.1.5","FL1034_2_VFD1","35S-6D4-P111","11.200.1.80",null,null,null,{"$f":"VLOOKUP(D58,'Part number'!$A$1:$B$13,2,0)","v":"EXTENDO"}]
["FL1034_2_DPM1","11.200.1.5","FL1034_4_EX1","CALJAN","11.200.1.81",null,null,null,{"$f":"VLOOKUP(D59,'Part number'!$A$1:$B$13,2,0)","v":5}]
["FL1034_2_DPM1","11.200.1.5","FL1038_2_VFD1","35S-6D4-P111","11.200.1.82",null,null,null,{"$f":"VLOOKUP(D60,'Part number'!$A$1:$B$13,2,0)","v":"EXTENDO"}]
["FL1034_2_DPM1","11.200.1.5","FL1038_4_EX1","CALJAN","11.200.1.83",null,null,null,{"$f":"VLOOKUP(D61,'Part number'!$A$1:$B$13,2,0)","v":5}]
["FL3016_2_DPM1","11.200.1.6","FL3012_2_VFD1","35S-6D4-P111","11.200.1.84",null,null,null,{"$f":"VLOOKUP(D62,'Part number'!$A$1:$B$13,2,0)","v":"EXTENDO"}]
["FL3016_2_DPM1","11.200.1.6","FL3012_4_EX1","CALJAN","11.200.1.85",null,null,null,{"$f":"VLOOKUP(D63,'Part number'!$A$1:$B$13,2,0)","v":5}]
["FL3016_2_DPM1","11.200.1.6","FL3016_2_VFD1","35S-6D4-P111","11.200.1.86",null,null,null,{"$f":"VLOOKUP(D64,'Part number'!$A$1:$B$13,2,0)","v":"EXTENDO"}]
["FL3016_2_DPM1","11.200.1.6","FL3016_4_EX1","CALJAN","11.200.1.87",null,null,null,{"$f":"VLOOKUP(D65,'Part number'!$A$1:$B$13,2,0)","v":5}]
["FL3016_2_DPM1","11.200.1.6","FL3020_2_VFD1","35S-6D4-P111","11.200.1.88",null,null,null,{"$f":"VLOOKUP(D66,'Part number'!$A$1:$B$13,2,0)","v":"EXTENDO"}]
["FL3016_2_DPM1","11.200.1.6","FL3020_4_EX1","CALJAN","11.200.1.89",null,null,null,{"$f":"VLOOKUP(D67,'Part number'!$A$1:$B$13,2,0)","v":5}]
["FL3016_2_DPM1","11.200.1.6","FL3024_2_VFD1","35S-6D4-P111","11.200.1.90",null,null,null,{"$f":"VLOOKUP(D68,'Part number'!$A$1:$B$13,2,0)","v":"EXTENDO"}]
["FL3016_2_DPM1","11.200.1.6","FL3024_4_EX1","CALJAN","11.200.1.91",null,null,null,{"$f":"VLOOKUP(D69,'Part number'!$A$1:$B$13,2,0)","v":5}]
["VSA_DPM1","11.200.1.7","S011003_ZMX1","ZMX-3DE2500HF-Q7-AMZCHD","11.200.1.100",null,null,null,{"$f":"VLOOKUP(D70,'Part number'!$A$1:$B$13,2,0)","v":"EXTENDO"}]
["VSA_DPM1","11.200.1.7","S011005_ZMX1","ZMX-3DE2500HF-Q7-AMZCHD","11.200.1.101",null,null,null,{"$f":"VLOOKUP(D71,'Part number'!$A$1:$B$13,2,0)","v":"ZMX"}]
["VSA_DPM1","11.200.1.7","S011007_ZMX1","ZMX-3DE2500HF-Q7-AMZCHD","11.200.1.102",null,null,null,{"$f":"VLOOKUP(D72,'Part number'!$A$1:$B$13,2,0)","v":"ZMX"}]
["VSA_DPM1","11.200.1.7","S011009_ZMX1","ZMX-3DE2500HF-Q7-AMZCHD","11.200.1.103",null,null,null,{"$f":"VLOOKUP(D73,'Part number'!$A$1:$B$13,2,0)","v":"ZMX"}]
["VSA_DPM1","11.200.1.7","S011011_ZMX1","ZMX-3DE2500HF-Q7-AMZCHD","11.200.1.104",null,null,null,{"$f":"VLOOKUP(D74,'Part number'!$A$1:$B$13,2,0)","v":"ZMX"}]
["VSA_DPM1","11.200.1.7","S011013_ZMX1","ZMX-3DE2500HF-Q7-AMZCHD","11.200.1.105",null,null,null,{"$f":"VLOOKUP(D75,'Part number'!$A$1:$B$13,2,0)","v":"ZMX"}]
["VSA_DPM1","11.200.1.7","S011017_ZMX1","ZMX-3DE2500HF-Q7-AMZCHD","11.200.1.106",null,null,null,{"$f":"VLOOKUP(D76,'Part number'!$A$1:$B$13,2,0)","v":"ZMX"}]
["VSA_DPM1","11.200.1.7","S011019_ZMX1","ZMX-3DE2500HF-Q7-AMZCHD","11.200.1.107",null,null,null,{"$f":"VLOOKUP(D77,'Part number'!$A$1:$B$13,2,0)","v":"ZMX"}]
["VSA_DPM1","11.200.1.7","S011021_ZMX1","ZMX-3DE2500HF-Q7-AMZCHD","11.200.1.108",null,null,null,{"$f":"VLOOKUP(D78,'Part number'!$A$1:$B$13,2,0)","v":"ZMX"}]
["VSA_DPM1","11.200.1.7","S011023_ZMX1","ZMX-3DE2500HF-Q7-AMZCHD","11.200.1.109",null,null,null,{"$f":"VLOOKUP(D79,'Part number'!$A$1:$B$13,2,0)","v":"ZMX"}]
["VSA_DPM1","11.200.1.7","S011025_ZMX1","ZMX-3DE2500HF-Q7-AMZCHD","11.200.1.110",null,null,null,{"$f":"VLOOKUP(D80,'Part number'!$A$1:$B$13,2,0)","v":"ZMX"}]
["VSA_DPM1","11.200.1.7","VSA_DPM1_FIO1","5032-8IOLM12DR","11.200.1.111",null,null,null,{"$f":"VLOOKUP(D81,'Part number'!$A$1:$B$13,2,0)","v":"ZMX"}]
["VSA_DPM1","11.200.1.7","VSA_DPM1_FIO2","5032-8IOLM12DR","11.200.1.112",null,null,null,{"$f":"VLOOKUP(D82,'Part number'!$A$1:$B$13,2,0)","v":"FIO"}]
["VSA_DPM1","11.200.1.7","VSA_DPM1_FIO3","5032-8IOLM12DR","11.200.1.113",null,null,null,{"$f":"VLOOKUP(D83,'Part number'!$A$1:$B$13,2,0)","v":"FIO"}]
["VSA_DPM1","11.200.1.7","VSA_DPM1_FIO4","5032-8IOLM12DR","11.200.1.114",null,null,null,{"$f":"VLOOKUP(D84,'Part number'!$A$1:$B$13,2,0)","v":"FIO"}]
["VSA_DPM1","11.200.1.7","VSA_DPM1_FIO5","5032-8IOLM12DR","11.200.1.115",null,null,null,{"$f":"VLOOKUP(D85,'Part number'!$A$1:$B$13,2,0)","v":"FIO"}]
["VSA_DPM1","11.200.1.7","VSA_DPM1_FIO6","5032-8IOLM12DR","11.200.1.116",null,null,null,{"$f":"VLOOKUP(D86,'Part number'!$A$1:$B$13,2,0)","v":"FIO"}]
["VSA_DPM1","11.200.1.7","VSA_DPM1_FIO7","5032-8IOLM12DR","11.200.1.117",null,null,null,{"$f":"VLOOKUP(D87,'Part number'!$A$1:$B$13,2,0)","v":"FIO"}]
["VSA_DPM1","11.200.1.7","VSA_DPM1_FIO8","5032-8IOLM12DR","11.200.1.118",null,null,null,{"$f":"VLOOKUP(D88,'Part number'!$A$1:$B$13,2,0)","v":"FIO"}]
["VSA_DPM2","11.200.1.8","S011033_ZMX1","ZMX-3DE2500HF-Q7-AMZCHD","11.200.1.119",null,null,null,{"$f":"VLOOKUP(D89,'Part number'!$A$1:$B$13,2,0)","v":"FIO"}]
["VSA_DPM2","11.200.1.8","S011035_ZMX1","ZMX-3DE2500HF-Q7-AMZCHD","11.200.1.120",null,null,null,{"$f":"VLOOKUP(D90,'Part number'!$A$1:$B$13,2,0)","v":"ZMX"}]
["VSA_DPM2","11.200.1.8","S011037_ZMX1","ZMX-3DE2500HF-Q7-AMZCHD","11.200.1.121",null,null,null,{"$f":"VLOOKUP(D91,'Part number'!$A$1:$B$13,2,0)","v":"ZMX"}]
["VSA_DPM2","11.200.1.8","S011039_ZMX1","ZMX-3DE2500HF-Q7-AMZCHD","11.200.1.122",null,null,null,{"$f":"VLOOKUP(D92,'Part number'!$A$1:$B$13,2,0)","v":"ZMX"}]
["VSA_DPM2","11.200.1.8","S011041_ZMX1","ZMX-3DE2500HF-Q7-AMZCHD","11.200.1.123",null,null,null,{"$f":"VLOOKUP(D93,'Part number'!$A$1:$B$13,2,0)","v":"ZMX"}]
["VSA_DPM2","11.200.1.8","S011043_ZMX1","ZMX-3DE2500HF-Q7-AMZCHD","11.200.1.124",null,null,null,{"$f":"VLOOKUP(D94,'Part number'!$A$1:$B$13,2,0)","v":"ZMX"}]
["VSA_DPM2","11.200.1.8","S011047_ZMX1","ZMX-3DE2500HF-Q7-AMZCHD","11.200.1.125",null,null,null,{"$f":"VLOOKUP(D95,'Part number'!$A$1:$B$13,2,0)","v":"ZMX"}]
["VSA_DPM2","11.200.1.8","S011049_ZMX1","ZMX-3DE2500HF-Q7-AMZCHD","11.200.1.126",null,null,null,{"$f":"VLOOKUP(D96,'Part number'!$A$1:$B$13,2,0)","v":"ZMX"}]
["VSA_DPM2","11.200.1.8","S011051_ZMX1","ZMX-3DE2500HF-Q7-AMZCHD","11.200.1.127",null,null,null,{"$f":"VLOOKUP(D97,'Part number'!$A$1:$B$13,2,0)","v":"ZMX"}]
["VSA_DPM2","11.200.1.8","S011053_ZMX1","ZMX-3DE2500HF-Q7-AMZCHD","11.200.1.128",null,null,null,{"$f":"VLOOKUP(D98,'Part number'!$A$1:$B$13,2,0)","v":"ZMX"}]
["VSA_DPM2","11.200.1.8","S011055_ZMX1","ZMX-3DE2500HF-Q7-AMZCHD","11.200.1.129",null,null,null,{"$f":"VLOOKUP(D99,'Part number'!$A$1:$B$13,2,0)","v":"ZMX"}]
["VSA_DPM2","11.200.1.8","S011057_ZMX1","ZMX-3DE2500HF-Q7-AMZCHD","11.200.1.130",null,null,null,{"$f":"VLOOKUP(D100,'Part number'!$A$1:$B$13,2,0)","v":"ZMX"}]
["VSA_DPM2","11.200.1.8","VSA_DPM2_FIO1","5032-8IOLM12DR","11.200.1.131",null,null,null,{"$f":"VLOOKUP(D101,'Part number'!$A$1:$B$13,2,0)","v":"ZMX"}]
["VSA_DPM2","11.200.1.8","VSA_DPM2_FIO2","5032-8IOLM12DR","11.200.1.132",null,null,null,{"$f":"VLOOKUP(D102,'Part number'!$A$1:$B$13,2,0)","v":"FIO"}]
["VSA_DPM2","11.200.1.8","VSA_DPM2_FIO3","5032-8IOLM12DR","11.200.1.133",null,null,null,{"$f":"VLOOKUP(D103,'Part number'!$A$1:$B$13,2,0)","v":"FIO"}]
["VSA_DPM2","11.200.1.8","VSA_DPM2_FIO4","5032-8IOLM12DR","11.200.1.134",null,null,null,{"$f":"VLOOKUP(D104,'Part number'!$A$1:$B$13,2,0)","v":"FIO"}]
["VSA_DPM2","11.200.1.8","VSA_DPM2_FIO5","5032-8IOLM12DR","11.200.1.135",null,null,null,{"$f":"VLOOKUP(D105,'Part number'!$A$1:$B$13,2,0)","v":"FIO"}]
["VSA_DPM2","11.200.1.8","VSA_DPM2_FIO6","5032-8IOLM12DR","11.200.1.136",null,null,null,{"$f":"VLOOKUP(D106,'Part number'!$A$1:$B$13,2,0)","v":"FIO"}]
["VSA_DPM2","11.200.1.8","VSA_DPM2_FIO7","5032-8IOLM12DR","11.200.1.137",null,null,null,{"$f":"VLOOKUP(D107,'Part number'!$A$1:$B$13,2,0)","v":"FIO"}]
["VSA_DPM2","11.200.1.8","S011078_ZMX1","ZMX-3DE2500HF-Q7-AMZCHD","11.200.1.227",null,null,null,"FIO"]
["VSA_DPM2","11.200.1.8","S011080_ZMX1","ZMX-3DE2500HF-Q7-AMZCHD","11.200.1.228",null,null,null,{"$f":"VLOOKUP(D109,'Part number'!$A$1:$B$13,2,0)","v":"ZMX"},"2025-07-16"]
["VSA_DPM2","11.200.1.8","S011082_ZMX1","ZMX-3DE2500HF-Q7-AMZCHD","11.200.1.229",null,null,null,{"$f":"VLOOKUP(D110,'Part number'!$A$1:$B$13,2,0)","v":"ZMX"}]
["VSA_DPM2","11.200.1.8","S011084_ZMX1","ZMX-3DE2500HF-Q7-AMZCHD","11.200.1.230",null,null,null,{"$f":"VLOOKUP(D111,'Part number'!$A$1:$B$13,2,0)","v":"ZMX"}]
["VSA_DPM2","11.200.1.8","S011086_ZMX1","ZMX-3DE2500HF-Q7-AMZCHD","11.200.1.231",null,null,null,{"$f":"VLOOKUP(D112,'Part number'!$A$1:$B$13,2,0)","v":"ZMX"}]
["VSA_DPM3","11.200.1.9","S011067_ZMX1","ZMX-3DE2500HF-Q7-AMZCHD","11.200.1.138",null,null,null,{"$f":"VLOOKUP(D113,'Part number'!$A$1:$B$13,2,0)","v":"ZMX"}]
["VSA_DPM3","11.200.1.9","S011069_ZMX1","ZMX-3DE2500HF-Q7-AMZCHD","11.200.1.139",null,null,null,{"$f":"VLOOKUP(D114,'Part number'!$A$1:$B$13,2,0)","v":"ZMX"}]
["VSA_DPM3","11.200.1.9","S011071_ZMX1","ZMX-3DE2500HF-Q7-AMZCHD","11.200.1.140",null,null,null,{"$f":"VLOOKUP(D115,'Part number'!$A$1:$B$13,2,0)","v":"ZMX"}]
["VSA_DPM3","11.200.1.9","S011073_ZMX1","ZMX-3DE2500HF-Q7-AMZCHD","11.200.1.141",null,null,null,{"$f":"VLOOKUP(D116,'Part number'!$A$1:$B$13,2,0)","v":"ZMX"}]
["VSA_DPM3","11.200.1.9","S011075_ZMX1","ZMX-3DE2500HF-Q7-AMZCHD","11.200.1.142",null,null,null,{"$f":"VLOOKUP(D117,'Part number'!$A$1:$B$13,2,0)","v":"ZMX"}]
["VSA_DPM3","11.200.1.9","S011077_ZMX1","ZMX-3DE2500HF-Q7-AMZCHD","11.200.1.143",null,null,null,{"$f":"VLOOKUP(D118,'Part number'!$A$1:$B$13,2,0)","v":"ZMX"}]
["VSA_DPM3","11.200.1.9","S011079_ZMX1","ZMX-3DE2500HF-Q7-AMZCHD","11.200.1.144",null,null,null,{"$f":"VLOOKUP(D119,'Part number'!$A$1:$B$13,2,0)","v":"ZMX"}]
["VSA_DPM3","11.200.1.9","S011081_ZMX1","ZMX-3DE2500HF-Q7-AMZCHD","11.200.1.145",null,null,null,{"$f":"VLOOKUP(D120,'Part number'!$A$1:$B$13,2,0)","v":"ZMX"}]
["VSA_DPM3","11.200.1.9","S011083_ZMX1","ZMX-3DE2500HF-Q7-AMZCHD","11.200.1.146",null,null,null,{"$f":"VLOOKUP(D121,'Part number'!$A$1:$B$13,2,0)","v":"ZMX"}]
["VSA_DPM3","11.200.1.9","S011085_ZMX1","ZMX-3DE2500HF-Q7-AMZCHD","11.200.1.147",null,null,null,{"$f":"VLOOKUP(D122,'Part number'!$A$1:$B$13,2,0)","v":"ZMX"}]
["VSA_DPM3","11.200.1.9","S011087_ZMX1","ZMX-3DE2500HF-Q7-AMZCHD","11.200.1.148",null,null,null,{"$f":"VLOOKUP(D123,'Part number'!$A$1:$B$13,2,0)","v":"ZMX"}]
["VSA_DPM3","11.200.1.9","S011089_ZMX1","ZMX-3DE2500HF-Q7-AMZCHD","11.200.1.149",null,null,null,{"$f":"VLOOKUP(D124,'Part number'!$A$1:$B$13,2,0)","v":"ZMX"}]
["VSA_DPM3","11.200.1.9","S011091_ZMX1","ZMX-3DE2500HF-Q7-AMZCHD","11.200.1.150",null,null,null,{"$f":"VLOOKUP(D125,'Part number'!$A$1:$B$13,2,0)","v":"ZMX"}]
["VSA_DPM3","11.200.1.9","S011095_ZMX1","ZMX-3DE2500HF-Q7-AMZCHD","11.200.1.151",null,null,null,{"$f":"VLOOKUP(D126,'Part number'!$A$1:$B$13,2,0)","v":"ZMX"}]
["VSA_DPM3","11.200.1.9","S011097_ZMX1","ZMX-3DE2500HF-Q7-AMZCHD","11.200.1.152",null,null,null,{"$f":"VLOOKUP(D127,'Part number'!$A$1:$B$13,2,0)","v":"ZMX"}]
["VSA_DPM3","11.200.1.9","S011099_ZMX1","ZMX-3DE2500HF-Q7-AMZCHD","11.200.1.153",null,null,null,{"$f":"VLOOKUP(D128,'Part number'!$A$1:$B$13,2,0)","v":"ZMX"}]
["VSA_DPM3","11.200.1.9","S011101_ZMX1","ZMX-3DE2500HF-Q7-AMZCHD","11.200.1.154",null,null,null,{"$f":"VLOOKUP(D129,'Part number'!$A$1:$B$13,2,0)","v":"ZMX"}]
["VSA_DPM3","11.200.1.9","VSA_DPM3_FIO1","5032-8IOLM12DR","11.200.1.155",null,null,null,{"$f":"VLOOKUP(D130,'Part number'!$A$1:$B$13,2,0)","v":"ZMX"}]
["VSA_DPM3","11.200.1.9","VSA_DPM3_FIO2","5032-8IOLM12DR","11.200.1.156",null,null,null,{"$f":"VLOOKUP(D131,'Part number'!$A$1:$B$13,2,0)","v":"FIO"}]
["VSA_DPM3","11.200.1.9","VSA_DPM3_FIO3","5032-8IOLM12DR","11.200.1.157",null,null,null,{"$f":"VLOOKUP(D132,'Part number'!$A$1:$B$13,2,0)","v":"FIO"}]
["VSA_DPM3","11.200.1.9","VSA_DPM3_FIO4","5032-8IOLM12DR","11.200.1.158",null,null,null,{"$f":"VLOOKUP(D133,'Part number'!$A$1:$B$13,2,0)","v":"FIO"}]
["VSA_DPM3","11.200.1.9","VSA_DPM3_FIO5","5032-8IOLM12DR","11.200.1.159",null,null,null,{"$f":"VLOOKUP(D134,'Part number'!$A$1:$B$13,2,0)","v":"FIO"}]
["VSA_DPM3","11.200.1.9","VSA_DPM3_FIO6","5032-8IOLM12DR","11.200.1.224",null,null,null,{"$f":"VLOOKUP(D135,'Part number'!$A$1:$B$13,2,0)","v":"FIO"}]
["VSA_DPM3","11.200.1.9","VSA_DPM3_FIO7","5032-8IOLM12DR","11.200.1.226",null,null,null,{"$f":"VLOOKUP(D136,'Part number'!$A$1:$B$13,2,0)","v":"FIO"},"2025-06-05"]
["VSC_DPM1","11.200.1.10","S013005_ZMX1","ZMX-3DE2500HF-Q7-AMZCHD","11.200.1.160",null,null,null,{"$f":"VLOOKUP(D137,'Part number'!$A$1:$B$13,2,0)","v":"FIO"},"2025-07-16"]
["VSC_DPM1","11.200.1.10","S013007_ZMX1","ZMX-3DE2500HF-Q7-AMZCHD","11.200.1.161",null,null,null,{"$f":"VLOOKUP(D138,'Part number'!$A$1:$B$13,2,0)","v":"ZMX"}]
["VSC_DPM1","11.200.1.10","S013009_ZMX1","ZMX-3DE2500HF-Q7-AMZCHD","11.200.1.162",null,null,null,{"$f":"VLOOKUP(D139,'Part number'!$A$1:$B$13,2,0)","v":"ZMX"}]
["VSC_DPM1","11.200.1.10","S013011_ZMX1","ZMX-3DE2500HF-Q7-AMZCHD","11.200.1.163",null,null,null,{"$f":"VLOOKUP(D140,'Part number'!$A$1:$B$13,2,0)","v":"ZMX"}]
["VSC_DPM1","11.200.1.10","S013013_ZMX1","ZMX-3DE2500HF-Q7-AMZCHD","11.200.1.164",null,null,null,{"$f":"VLOOKUP(D141,'Part number'!$A$1:$B$13,2,0)","v":"ZMX"}]
["VSC_DPM1","11.200.1.10","S013015_ZMX1","ZMX-3DE2500HF-Q7-AMZCHD","11.200.1.165",null,null,null,{"$f":"VLOOKUP(D142,'Part number'!$A$1:$B$13,2,0)","v":"ZMX"}]
["VSC_DPM1","11.200.1.10","S013017_ZMX1","ZMX-3DE2500HF-Q7-AMZCHD","11.200.1.166",null,null,null,{"$f":"VLOOKUP(D143,'Part number'!$A$1:$B$13,2,0)","v":"ZMX"}]
["VSC_DPM1","11.200.1.10","S013021_ZMX1","ZMX-3DE2500HF-Q7-AMZCHD","11.200.1.167",null,null,null,{"$f":"VLOOKUP(D144,'Part number'!$A$1:$B$13,2,0)","v":"ZMX"}]
["VSC_DPM1","11.200.1.10","S013023_ZMX1","ZMX-3DE2500HF-Q7-AMZCHD","11.200.1.168",null,null,null,{"$f":"VLOOKUP(D145,'Part number'!$A$1:$B$13,2,0)","v":"ZMX"}]
["VSC_DPM1","11.200.1.10","S013025_ZMX1","ZMX-3DE2500HF-Q7-AMZCHD","11.200.1.169",null,null,null,{"$f":"VLOOKUP(D146,'Part number'!$A$1:$B$13,2,0)","v":"ZMX"}]
["VSC_DPM1","11.200.1.10","S013027_ZMX1","ZMX-3DE2500HF-Q7-AMZCHD","11.200.1.170",null,null,null,{"$f":"VLOOKUP(D147,'Part number'!$A$1:$B$13,2,0)","v":"ZMX"}]
["VSC_DPM1","11.200.1.10","S013031_ZMX1","ZMX-3DE2500HF-Q7-AMZCHD","11.200.1.171",null,null,null,{"$f":"VLOOKUP(D148,'Part number'!$A$1:$B$13,2,0)","v":"ZMX"}]
["VSC_DPM1","11.200.1.10","VSC_DPM1_FIO1","5032-8IOLM12DR","11.200.1.172",null,null,null,{"$f":"VLOOKUP(D149,'Part number'!$A$1:$B$13,2,0)","v":"ZMX"}]
["VSC_DPM1","11.200.1.10","VSC_DPM1_FIO3","5032-8IOLM12DR","11.200.1.173",null,null,null,{"$f":"VLOOKUP(D150,'Part number'!$A$1:$B$13,2,0)","v":"FIO"}]
["VSC_DPM1","11.200.1.10","VSC_DPM1_FIO4","5032-8IOLM12DR","11.200.1.174",null,null,null,{"$f":"VLOOKUP(D151,'Part number'!$A$1:$B$13,2,0)","v":"FIO"}]
["VSC_DPM1","11.200.1.10","VSC_DPM1_FIO5","5032-8IOLM12DR","11.200.1.175",null,null,null,{"$f":"VLOOKUP(D152,'Part number'!$A$1:$B$13,2,0)","v":"FIO"}]
["VSC_DPM1","11.200.1.10","VSC_DPM1_FIO6","5032-8IOLM12DR","11.200.1.176",null,null,null,{"$f":"VLOOKUP(D153,'Part number'!$A$1:$B$13,2,0)","v":"FIO"}]
["VSC_DPM1","11.200.1.10","VSC_DPM1_FIO7","5032-8IOLM12DR","11.200.1.177",null,null,null,{"$f":"VLOOKUP(D154,'Part number'!$A$1:$B$13,2,0)","v":"FIO"}]
["VSC_DPM1","11.200.1.10","VSC_DPM1_FIO8","5032-8IOLM12DR","11.200.1.178",null,null,null,{"$f":"VLOOKUP(D155,'Part number'!$A$1:$B$13,2,0)","v":"FIO"}]
["VSC_DPM1","11.200.1.10","VSC_DPM1_FIO2","5032-8IOLM12DR","11.200.1.225",null,null,null,{"$f":"VLOOKUP(D156,'Part number'!$A$1:$B$13,2,0)","v":"FIO"}]
["VSC_DPM2","11.200.1.11","S013037_ZMX1","ZMX-3DE2500HF-Q7-AMZCHD","11.200.1.179",null,null,null,"FIO","2025-06-13"]
["VSC_DPM2","11.200.1.11","S013039_ZMX1","ZMX-3DE2500HF-Q7-AMZCHD","11.200.1.180",null,null,null,{"$f":"VLOOKUP(D158,'Part number'!$A$1:$B$13,2,0)","v":"ZMX"}]
["VSC_DPM2","11.200.1.11","S013041_ZMX1","ZMX-3DE2500HF-Q7-AMZCHD","11.200.1.181",null,null,null,{"$f":"VLOOKUP(D159,'Part number'!$A$1:$B$13,2,0)","v":"ZMX"}]
["VSC_DPM2","11.200.1.11","S013043_ZMX1","ZMX-3DE2500HF-Q7-AMZCHD","11.200.1.182",null,null,null,{"$f":"VLOOKUP(D160,'Part number'!$A$1:$B$13,2,0)","v":"ZMX"}]
["VSC_DPM2","11.200.1.11","S013045_ZMX1","ZMX-3DE2500HF-Q7-AMZCHD","11.200.1.183",null,null,null,{"$f":"VLOOKUP(D161,'Part number'!$A$1:$B$13,2,0)","v":"ZMX"}]
["VSC_DPM2","11.200.1.11","S013047_ZMX1","ZMX-3DE2500HF-Q7-AMZCHD","11.200.1.184",null,null,null,{"$f":"VLOOKUP(D162,'Part number'!$A$1:$B$13,2,0)","v":"ZMX"}]
["VSC_DPM2","11.200.1.11","S013049_ZMX1","ZMX-3DE2500HF-Q7-AMZCHD","11.200.1.185",null,null,null,{"$f":"VLOOKUP(D163,'Part number'!$A$1:$B$13,2,0)","v":"ZMX"}]
["VSC_DPM2","11.200.1.11","S013053_ZMX1","ZMX-3DE2500HF-Q7-AMZCHD","11.200.1.186",null,null,null,{"$f":"VLOOKUP(D164,'Part number'!$A$1:$B$13,2,0)","v":"ZMX"}]
["VSC_DPM2","11.200.1.11","S013055_ZMX1","ZMX-3DE2500HF-Q7-AMZCHD","11.200.1.187",null,null,null,{"$f":"VLOOKUP(D165,'Part number'!$A$1:$B$13,2,0)","v":"ZMX"}]
["VSC_DPM2","11.200.1.11","S013057_ZMX1","ZMX-3DE2500HF-Q7-AMZCHD","11.200.1.188",null,null,null,{"$f":"VLOOKUP(D166,'Part number'!$A$1:$B$13,2,0)","v":"ZMX"}]
["VSC_DPM2","11.200.1.11","S013059_ZMX1","ZMX-3DE2500HF-Q7-AMZCHD","11.200.1.189",null,null,null,{"$f":"VLOOKUP(D167,'Part number'!$A$1:$B$13,2,0)","v":"ZMX"}]
["VSC_DPM2","11.200.1.11","S013063_ZMX1","ZMX-3DE2500HF-Q7-AMZCHD","11.200.1.190",null,null,null,{"$f":"VLOOKUP(D168,'Part number'!$A$1:$B$13,2,0)","v":"ZMX"}]
["VSC_DPM2","11.200.1.11","VSC_DPM2_FIO1","5032-8IOLM12DR","11.200.1.191",null,null,null,{"$f":"VLOOKUP(D169,'Part number'!$A$1:$B$13,2,0)","v":"ZMX"}]
["VSC_DPM2","11.200.1.11","VSC_DPM2_FIO2","5032-8IOLM12DR","11.200.1.192",null,null,null,{"$f":"VLOOKUP(D170,'Part number'!$A$1:$B$13,2,0)","v":"FIO"}]
["VSC_DPM2","11.200.1.11","VSC_DPM2_FIO3","5032-8IOLM12DR","11.200.1.193",null,null,null,{"$f":"VLOOKUP(D171,'Part number'!$A$1:$B$13,2,0)","v":"FIO"}]
["VSC_DPM2","11.200.1.11","VSC_DPM2_FIO4","5032-8IOLM12DR","11.200.1.194",null,null,null,{"$f":"VLOOKUP(D172,'Part number'!$A$1:$B$13,2,0)","v":"FIO"}]
["VSC_DPM2","11.200.1.11","VSC_DPM2_FIO5","5032-8IOLM12DR","11.200.1.195",null,null,null,{"$f":"VLOOKUP(D173,'Part number'!$A$1:$B$13,2,0)","v":"FIO"}]
["VSC_DPM2","11.200.1.11","VSC_DPM2_FIO6","5032-8IOLM12DR","11.200.1.196",null,null,null,{"$f":"VLOOKUP(D174,'Part number'!$A$1:$B$13,2,0)","v":"FIO"}]
["VSC_DPM2","11.200.1.11","VSC_DPM2_FIO7","5032-8IOLM12DR","11.200.1.197",null,null,null,{"$f":"VLOOKUP(D175,'Part number'!$A$1:$B$13,2,0)","v":"FIO"}]
["VSC_DPM2","11.200.1.11","VSC_DPM2_FIO8","5032-8IOLM12DR","11.200.1.198",null,null,null,{"$f":"VLOOKUP(D176,'Part number'!$A$1:$B$13,2,0)","v":"FIO"}]
["VSC_DPM3","11.200.1.12","S013065_ZMX1","ZMX-3DE2500HF-Q7-AMZCHD","11.200.1.199",null,null,null,{"$f":"VLOOKUP(D177,'Part number'!$A$1:$B$13,2,0)","v":"FIO"}]
["VSC_DPM3","11.200.1.12","S013067_ZMX1","ZMX-3DE2500HF-Q7-AMZCHD","11.200.1.200",null,null,null,{"$f":"VLOOKUP(D178,'Part number'!$A$1:$B$13,2,0)","v":"ZMX"}]
["VSC_DPM3","11.200.1.12","S013071_ZMX1","ZMX-3DE2500HF-Q7-AMZCHD","11.200.1.201",null,null,null,{"$f":"VLOOKUP(D179,'Part number'!$A$1:$B$13,2,0)","v":"ZMX"}]
["VSC_DPM3","11.200.1.12","S013073_ZMX1","ZMX-3DE2500HF-Q7-AMZCHD","11.200.1.202",null,null,null,{"$f":"VLOOKUP(D180,'Part number'!$A$1:$B$13,2,0)","v":"ZMX"}]
["VSC_DPM3","11.200.1.12","S013075_ZMX1","ZMX-3DE2500HF-Q7-AMZCHD","11.200.1.203",null,null,null,{"$f":"VLOOKUP(D181,'Part number'!$A$1:$B$13,2,0)","v":"ZMX"}]
["VSC_DPM3","11.200.1.12","S013077_ZMX1","ZMX-3DE2500HF-Q7-AMZCHD","11.200.1.204",null,null,null,{"$f":"VLOOKUP(D182,'Part number'!$A$1:$B$13,2,0)","v":"ZMX"}]
["VSC_DPM3","11.200.1.12","S013079_ZMX1","ZMX-3DE2500HF-Q7-AMZCHD","11.200.1.205",null,null,null,{"$f":"VLOOKUP(D183,'Part number'!$A$1:$B$13,2,0)","v":"ZMX"}]
["VSC_DPM3","11.200.1.12","S013081_ZMX1","ZMX-3DE2500HF-Q7-AMZCHD","11.200.1.206",null,null,null,{"$f":"VLOOKUP(D184,'Part number'!$A$1:$B$13,2,0)","v":"ZMX"}]
["VSC_DPM3","11.200.1.12","S013083_ZMX1","ZMX-3DE2500HF-Q7-AMZCHD","11.200.1.207",null,null,null,{"$f":"VLOOKUP(D185,'Part number'!$A$1:$B$13,2,0)","v":"ZMX"}]
["VSC_DPM3","11.200.1.12","S013087_ZMX1","ZMX-3DE2500HF-Q7-AMZCHD","11.200.1.208",null,null,null,{"$f":"VLOOKUP(D186,'Part number'!$A$1:$B$13,2,0)","v":"ZMX"}]
["VSC_DPM3","11.200.1.12","S013089_ZMX1","ZMX-3DE2500HF-Q7-AMZCHD","11.200.1.209",null,null,null,{"$f":"VLOOKUP(D187,'Part number'!$A$1:$B$13,2,0)","v":"ZMX"}]
["VSC_DPM3","11.200.1.12","S013091_ZMX1","ZMX-3DE2500HF-Q7-AMZCHD","11.200.1.210",null,null,null,{"$f":"VLOOKUP(D188,'Part number'!$A$1:$B$13,2,0)","v":"ZMX"}]
["VSC_DPM3","11.200.1.12","S013093_ZMX1","ZMX-3DE2500HF-Q7-AMZCHD","11.200.1.211",null,null,null,{"$f":"VLOOKUP(D189,'Part number'!$A$1:$B$13,2,0)","v":"ZMX"}]
["VSC_DPM3","11.200.1.12","VSC_DPM3_FIO1","5032-8IOLM12DR","11.200.1.212",null,null,null,{"$f":"VLOOKUP(D190,'Part number'!$A$1:$B$13,2,0)","v":"ZMX"}]
["VSC_DPM3","11.200.1.12","VSC_DPM3_FIO2","5032-8IOLM12DR","11.200.1.213",null,null,null,{"$f":"VLOOKUP(D191,'Part number'!$A$1:$B$13,2,0)","v":"FIO"}]
["VSC_DPM3","11.200.1.12","VSC_DPM3_FIO3","5032-8IOLM12DR","11.200.1.214",null,null,null,{"$f":"VLOOKUP(D192,'Part number'!$A$1:$B$13,2,0)","v":"FIO"}]
["VSC_DPM3","11.200.1.12","VSC_DPM3_FIO4","5032-8IOLM12DR","11.200.1.215",null,null,null,{"$f":"VLOOKUP(D193,'Part number'!$A$1:$B$13,2,0)","v":"FIO"}]
["VSC_DPM3","11.200.1.12","VSC_DPM3_FIO5","5032-8IOLM12DR","11.200.1.216",null,null,null,{"$f":"VLOOKUP(D194,'Part number'!$A$1:$B$13,2,0)","v":"FIO"}]
["VSC_DPM3","11.200.1.12","VSC_DPM3_FIO6","5032-8IOLM12DR","11.200.1.217",null,null,null,{"$f":"VLOOKUP(D195,'Part number'!$A$1:$B$13,2,0)","v":"FIO"}]
["VSC_DPM3","11.200.1.12","VSC_DPM3_FIO7","5032-8IOLM12DR","11.200.1.218",null,null,null,{"$f":"VLOOKUP(D196,'Part number'!$A$1:$B$13,2,0)","v":"FIO"}]
["VSC_DPM3","11.200.1.12","VSC_DPM3_FIO8","5032-8IOLM12DR","11.200.1.219",null,null,null,{"$f":"VLOOKUP(D197,'Part number'!$A$1:$B$13,2,0)","v":"FIO"}]
[null,null,null,null,null,null,null,null,{"$f":"VLOOKUP(D198,'Part number'!$A$1:$B$13,2,0)","v":"FIO"}]

{"sheet":"Part number","index":5,"n_rows":13,"n_cols":2,"rows_kept":13,"cut":false,"hidden":false,"merged":[]}
["PART NUMBER","HP"]
["35S-6D2-P101",2]
["35S-6D3-P101",3]
["35S-6D4-P111",5]
["35S-6D5-P111",7.5]
["35S-6D6-P111",10]
["25B-D024N104",15]
["25B-D030N104",20]
["25B-D043N114 ",30]
["CALJAN","EXTENDO"]
["PIONEER","TIPPER"]
["ZMX-3DE2500HF-Q7-AMZCHD","ZMX"]
["5032-8IOLM12DR","FIO"]

{"sheet":"MCM04_DESC","index":6,"n_rows":755,"n_cols":9,"rows_kept":755,"cut":false,"hidden":false,"merged":[[26,8,30,8],[1,8,5,8],[6,8,10,8],[11,8,15,8],[16,8,20,8],[21,8,25,8],[86,8,90,8],[31,8,35,8],[36,8,40,8],[41,8,45,8],[46,8,50,8],[51,8,55,8],[56,8,60,8],[61,8,65,8],[66,8,70,8],[71,8,75,8],[76,8,80,8],[81,8,85,8]]}
["TAGNAME","ADDR","TERM","TERMDESC","DESCA","DESCB",null,"CONTROLLERS"]
["PRS3_2A_VFD1","PRS3_2A_VFD1_I0","I0",null,"PRS3_2A_VFD1_DISC","DISCONNECT AUX",null,"PRS3_2A_VFD1",600]
["PRS3_2A_VFD1","PRS3_2A_VFD1_I1","I1",null,"SPARE",null,null,"PRS3_2B_VFD1"]
["PRS3_2A_VFD1","PRS3_2A_VFD1_I2","I2",null,"PRS3_2A_JPE1","JAM PHOTOEYE",null,"PRS3_3A_VFD1"]
["PRS3_2A_VFD1","PRS3_2A_VFD1_I3","I3",null,"SPARE",null,null,"PRS3_3B_VFD1"]
["PRS3_2A_VFD1","PRS3_2A_VFD1_IO0","IO0",null,"SPARE"]
["PRS3_2A_VFD1","PRS3_2A_VFD1_IO1","IO1",null,"SPARE",null,null,"PRS3_5_VFD1",601]
["PRS3_2A_VFD1","PRS3_2A_VFD1_SI0","SI0",null,"SPARE",null,null,"PRS4_1_VFD1"]
["PRS3_2A_VFD1","PRS3_2A_VFD1_SI1","SI1",null,"SPARE",null,null,"PRS4_2_VFD1"]
["PRS3_2A_VFD1","PRS3_2A_VFD1_SI2","SI2",null,"SPARE",null,null,"PS10_1_VFD1"]
["PRS3_2A_VFD1","PRS3_2A_VFD1_SI3","SI3",null,"SPARE"]
["PRS3_2A_VFD1","PRS3_2A_VFD1_SO0","SO0",null,"SPARE",null,null,"PS10_2_VFD1",602]
["PRS3_2B_VFD1","PRS3_2B_VFD1_I0","I0",null,"PRS3_2B_VFD1_DISC","DISCONNECT AUX",null,"PS10_3_VFD1"]
["PRS3_2B_VFD1","PRS3_2B_VFD1_I1","I1",null,"SPARE",null,null,"PS10_5_VFD1"]
["PRS3_2B_VFD1","PRS3_2B_VFD1_I2","I2",null,"PRS3_2B_JPE1","JAM PHOTOEYE",null,"PS10_5_SIO1"]
["PRS3_2B_VFD1","PRS3_2B_VFD1_I3","I3",null,"SPARE"]
["PRS3_2B_VFD1","PRS3_2B_VFD1_IO0","IO0",null,"SPARE",null,null,"PS11_1_VFD1",603]
["PRS3_2B_VFD1","PRS3_2B_VFD1_IO1","IO1",null,"SPARE",null,null,"PS11_2_VFD1"]
["PRS3_2B_VFD1","PRS3_2B_VFD1_SI0","SI0",null,"SPARE",null,null,"PS11_3_VFD1"]
["PRS3_2B_VFD1","PRS3_2B_VFD1_SI1","SI1",null,"SPARE",null,null,"PS11_4_VFD1"]
["PRS3_2B_VFD1","PRS3_2B_VFD1_SI2","SI2",null,"SPARE"]
["PRS3_2B_VFD1","PRS3_2B_VFD1_SI3","SI3",null,"SPARE",null,null,"PS11_6_VFD1",604]
["PRS3_2B_VFD1","PRS3_2B_VFD1_SO0","SO0",null,"SPARE",null,null,"PS11_7_VFD1"]
["PRS3_3A_VFD1","PRS3_3A_VFD1_I0","I0",null,"PRS3_3A_VFD1_DISC","DISCONNECT AUX",null,"PS11_8_VFD1"]
["PRS3_3A_VFD1","PRS3_3A_VFD1_I1","I1",null,"SPARE",null,null,"PS11_9_VFD1"]
["PRS3_3A_VFD1","PRS3_3A_VFD1_I2","I2",null,"PRS3_3A_JPE1","JAM PHOTOEYE"]
["PRS3_3A_VFD1","PRS3_3A_VFD1_I3","I3",null,"PRS3_3A_JPE2","JAM PHOTOEYE",null,"PS11_11_VFD1",605]
["PRS3_3A_VFD1","PRS3_3A_VFD1_IO0","IO0",null,"PRS3_3A_BCN1_A","AMBER BEACON LIGHT",null,"PS11_8_SIO1"]
["PRS3_3A_VFD1","PRS3_3A_VFD1_IO1","IO1",null,"PRS3_3A_BCN1_B","BLUE BEACON LIGHT",null,"PS11_8_FIOH1"]
["PRS3_3A_VFD1","PRS3_3A_VFD1_SI0","SI0",null,"SPARE",null,null,"ULC5_3_VFD1"]
["PRS3_3A_VFD1","PRS3_3A_VFD1_SI1","SI1",null,"SPARE"]
["PRS3_3A_VFD1","PRS3_3A_VFD1_SI2","SI2",null,"SPARE",null,null,"ULC6_3_VFD1",606]
["PRS3_3A_VFD1","PRS3_3A_VFD1_SI3","SI3",null,"SPARE",null,null,"ULC7_3_VFD1"]
["PRS3_3A_VFD1","PRS3_3A_VFD1_SO0","SO0",null,"SPARE",null,null,"ULC8_3_VFD1"]
["PRS3_3B_VFD1","PRS3_3B_VFD1_I0","I0",null,"PRS3_3B_VFD1_DISC","DISCONNECT AUX",null,"PRS3_2A_FIO1"]
["PRS3_3B_VFD1","PRS3_3B_VFD1_I1","I1",null,"SPARE"]
["PRS3_3B_VFD1","PRS3_3B_VFD1_I2","I2",null,"PRS3_3B_JPE1","JAM PHOTOEYE",null,"PRS3_2B_FIO1",607]
["PRS3_3B_VFD1","PRS3_3B_VFD1_I3","I3",null,"PRS3_3B_JPE2","JAM PHOTOEYE",null,"PRS3_4CH_FIO1"]
["PRS3_3B_VFD1","PRS3_3B_VFD1_IO0","IO0",null,"PRS3_3B_BCN1_A","AMBER BEACON LIGHT",null,"PRS4_2_FIO1"]
["PRS3_3B_VFD1","PRS3_3B_VFD1_IO1","IO1",null,"PRS3_3B_BCN1_B","BLUE BEACON LIGHT",null,"PS10_1_FIO1"]
["PRS3_3B_VFD1","PRS3_3B_VFD1_SI0","SI0",null,"SPARE"]
["PRS3_3B_VFD1","PRS3_3B_VFD1_SI1","SI1",null,"SPARE",null,null,"PS10_1_FIOH1",608]
["PRS3_3B_VFD1","PRS3_3B_VFD1_SI2","SI2",null,"SPARE",null,null,"PS10_1_FIOH2"]
["PRS3_3B_VFD1","PRS3_3B_VFD1_SI3","SI3",null,"SPARE",null,null,"PS10_5_FIO1"]
["PRS3_3B_VFD1","PRS3_3B_VFD1_SO0","SO0",null,"SPARE",null,null,"PS10_5_FIO2"]
["PRS3_5_VFD1","PRS3_5_VFD1_I0","I0",null,"PRS3_5_VFD1_DISC","DISCONNECT AUX"]
["PRS3_5_VFD1","PRS3_5_VFD1_I1","I1",null,"SPARE",null,null,"PS10_5_FIOH1",609]
["PRS3_5_VFD1","PRS3_5_VFD1_I2","I2",null,"PRS3_5_JPE1","JAM PHOTOEYE",null,"PS10_5_FIOH2"]
["PRS3_5_VFD1","PRS3_5_VFD1_I3","I3",null,"PRS3_5_JPE2","JAM PHOTOEYE",null,"PS10_5_FIOH3"]
["PRS3_5_VFD1","PRS3_5_VFD1_IO0","IO0",null,"SPARE",null,null,"PS10_5_FIOH4"]
["PRS3_5_VFD1","PRS3_5_VFD1_IO1","IO1",null,"SPARE"]
["PRS3_5_VFD1","PRS3_5_VFD1_SI0","SI0",null,"PRS3_5_EPC1","E-STOP PULLCORD",null,"PS11_1_FIO1",610]
["PRS3_5_VFD1","PRS3_5_VFD1_SI1","SI1",null,"PRS3_5_EPC1_2","E-STOP PULLCORD",null,"PS11_1_FIOH1"]
["PRS3_5_VFD1","PRS3_5_VFD1_SI2","SI2",null,"PRS3_5_EPC2","E-STOP PULLCORD",null,"PS11_11_FIO1"]
["PRS3_5_VFD1","PRS3_5_VFD1_SI3","SI3",null,"PRS3_5_EPC2_2","E-STOP PULLCORD",null,"PS11_11_FIO2"]
["PRS3_5_VFD1","PRS3_5_VFD1_SO0","SO0",null,"SPARE"]
["PRS4_1_VFD1","PRS4_1_VFD1_I0","I0",null,"PRS4_1_VFD1_DISC","DISCONNECT AUX",null,"PS11_11_FIO3",611]
["PRS4_1_VFD1","PRS4_1_VFD1_I1","I1",null,"PRS4_1_ENC1","ENCODER",null,"PS11_11_FIOH1"]
["PRS4_1_VFD1","PRS4_1_VFD1_I2","I2",null,"PRS4_1_JPE1","JAM PHOTOEYE",null,"PS11_11_FIOH2"]
["PRS4_1_VFD1","PRS4_1_VFD1_I3","I3",null,"SPARE",null,null,"PS11_11_FIOH3"]
["PRS4_1_VFD1","PRS4_1_VFD1_IO0","IO0",null,"SPARE"]
["PRS4_1_VFD1","PRS4_1_VFD1_IO1","IO1",null,"SPARE",null,null,"PS11_11_FIOH4",612]
["PRS4_1_VFD1","PRS4_1_VFD1_SI0","SI0",null,"PRS4_1_EPC1","E-STOP PULLCORD",null,"PS11_11_FIOH5"]
["PRS4_1_VFD1","PRS4_1_VFD1_SI1","SI1",null,"PRS4_1_EPC1_2","E-STOP PULLCORD",null,"PS11_11_FIOH6"]
["PRS4_1_VFD1","PRS4_1_VFD1_SI2","SI2",null,"PRS4_1_EPC2","E-STOP PULLCORD",null,"PS11_3_FIO1"]
["PRS4_1_VFD1","PRS4_1_VFD1_SI3","SI3",null,"PRS4_1_EPC2_2","E-STOP PULLCORD"]
["PRS4_1_VFD1","PRS4_1_VFD1_SO0","SO0",null,"SPARE",null,null,"PS11_4_FIO1",613]
["PRS4_2_VFD1","PRS4_2_VFD1_I0","I0",null,"PRS4_2_VFD1_DISC","DISCONNECT AUX",null,"PS11_7_FIO1"]
["PRS4_2_VFD1","PRS4_2_VFD1_I1","I1",null,"PRS4_2_ENC1","ENCODER",null,"FL1014_FIOH1"]
["PRS4_2_VFD1","PRS4_2_VFD1_I2","I2",null,"PRS4_2_JPE1","JAM PHOTOEYE",null,"S011020_FIOH1"]
["PRS4_2_VFD1","PRS4_2_VFD1_I3","I3",null,"PRS4_2_JPE2","JAM PHOTOEYE"]
["PRS4_2_VFD1","PRS4_2_VFD1_IO0","IO0",null,"SPARE",null,null,"S011020_FIOH2",614]
["PRS4_2_VFD1","PRS4_2_VFD1_IO1","IO1",null,"SPARE",null,null,"S011020_FIOH3"]
["PRS4_2_VFD1","PRS4_2_VFD1_SI0","SI0",null,"PRS4_2_EPC1","E-STOP PULLCORD",null,"S011020_FIOH4"]
["PRS4_2_VFD1","PRS4_2_VFD1_SI1","SI1",null,"PRS4_2_EPC1_2","E-STOP PULLCORD",null,"S011020_FIOH5"]
["PRS4_2_VFD1","PRS4_2_VFD1_SI2","SI2",null,"PRS4_2_EPC2","E-STOP PULLCORD"]
["PRS4_2_VFD1","PRS4_2_VFD1_SI3","SI3",null,"PRS4_2_EPC2_2","E-STOP PULLCORD",null,"S011020_FIOH6",615]
["PRS4_2_VFD1","PRS4_2_VFD1_SO0","SO0",null,"SPARE",null,null,"S011020_FIOH7"]
["PS10_1_VFD1","PS10_1_VFD1_I0","I0",null,"PS10_1_VFD1_DISC","DISCONNECT AUX",null,"S011020_FIOH8"]
["PS10_1_VFD1","PS10_1_VFD1_I1","I1",null,"PS10_1_ENC1","ENCODER",null,"FL1022_FIOH1"]
["PS10_1_VFD1","PS10_1_VFD1_I2","I2",null,"PS10_1_JPE1","JAM PHOTOEYE"]
["PS10_1_VFD1","PS10_1_VFD1_I3","I3",null,"PS10_1_JPE2","JAM PHOTOEYE",null,"FL1026_FIOH1",616]
["PS10_1_VFD1","PS10_1_VFD1_IO0","IO0",null,"PS10_1_BCN1_A","AMBER BEACON LIGHT",null,"FL1034_FIOH1"]
["PS10_1_VFD1","PS10_1_VFD1_IO1","IO1",null,"PS10_1_BCN1_R","RED BEACON LIGHT",null,"S011040_FIOH1"]
["PS10_1_VFD1","PS10_1_VFD1_SI0","SI0",null,"PS10_1_EPC1","E-STOP PULLCORD",null,"S013010_FIOH1"]
["PS10_1_VFD1","PS10_1_VFD1_SI1","SI1",null,"PS10_1_EPC1_2","E-STOP PULLCORD"]
["PS10_1_VFD1","PS10_1_VFD1_SI2","SI2",null,"SPARE",null,null,"FL3016_FIOH1",617]
["PS10_1_VFD1","PS10_1_VFD1_SI3","SI3",null,"SPARE",null,null,"S013018_FIOH1"]
["PS10_1_VFD1","PS10_1_VFD1_SO0","SO0",null,"SPARE",null,null,"FL3024_FIOH1"]
["PS10_2_VFD1","PS10_2_VFD1_I0","I0",null,"PS10_2_VFD1_DISC","DISCONNECT AUX"]
["PS10_3_VFD1","PS10_3_VFD1_I0","I0",null,"PS10_3_VFD1_DISC","DISCONNECT AUX"]
["PS10_5_VFD1","PS10_5_VFD1_I0","I0",null,"PS10_5_VFD1_DISC","DISCONNECT AUX"]
["PS10_5_SIO1","PS10_5_SIO1_SI0","SI0",null,"PS10_5_EPC1","E-STOP PULLCORD"]
["PS10_5_SIO1","PS10_5_SIO1_SI1","SI1",null,"PS10_5_EPC1_2","E-STOP PULLCORD"]
["PS10_5_SIO1","PS10_5_SIO1_SI2","SI2",null,"SPARE"]
["PS10_5_SIO1","PS10_5_SIO1_SI3","SI3",null,"SPARE"]
["PS10_5_SIO1","PS10_5_SIO1_SI4","SI4",null,"SPARE"]
["PS10_5_SIO1","PS10_5_SIO1_SI5","SI5",null,"SPARE"]
["PS10_5_SIO1","PS10_5_SIO1_SI6","SI6",null,"SPARE"]
["PS10_5_SIO1","PS10_5_SIO1_SI7","SI7",null,"SPARE"]
["PS10_5_SIO1","PS10_5_SIO1_SO0","SO0",null,"PS10_5_VFD1_STO","VFD SAFETY ACTIVE"]
["PS10_5_SIO1","PS10_5_SIO1_SO1","SO1",null,"PS10_3_VFD1_STO","VFD SAFETY ACTIVE"]
["PS10_5_SIO1","PS10_5_SIO1_SO2","SO2",null,"PS10_2_VFD1_STO","VFD SAFETY ACTIVE"]
["PS10_5_SIO1","PS10_5_SIO1_SO3","SO3",null,"SPARE"]
["PS10_5_SIO1","PS10_5_SIO1_IO0","IO0",null,"PS10_3_ENC1","ENCODER"]
["PS10_5_SIO1","PS10_5_SIO1_IO1","IO1",null,"SPARE"]
["PS10_5_SIO1","PS10_5_SIO1_IO2","IO2",null,"PS10_3_JPE1","JAM PHOTOEYE"]
["PS10_5_SIO1","PS10_5_SIO1_IO3","IO3",null,"SPARE"]
["PS11_1_VFD1","PS11_1_VFD1_I0","I0",null,"PS11_1_VFD1_DISC","DISCONNECT AUX"]
["PS11_1_VFD1","PS11_1_VFD1_I1","I1",null,"PS11_1_ENC1","ENCODER"]
["PS11_1_VFD1","PS11_1_VFD1_I2","I2",null,"PS11_1_JPE1","JAM PHOTOEYE"]
["PS11_1_VFD1","PS11_1_VFD1_I3","I3",null,"PS11_1_JPE2","JAM PHOTOEYE"]
["PS11_1_VFD1","PS11_1_VFD1_IO0","IO0",null,"SPARE"]
["PS11_1_VFD1","PS11_1_VFD1_IO1","IO1",null,"SPARE"]
["PS11_1_VFD1","PS11_1_VFD1_SI0","SI0",null,"PS11_1_EPC1","E-STOP PULLCORD"]
["PS11_1_VFD1","PS11_1_VFD1_SI1","SI1",null,"PS11_1_EPC1_2","E-STOP PULLCORD"]
["PS11_1_VFD1","PS11_1_VFD1_SI2","SI2",null,"SPARE"]
["PS11_1_VFD1","PS11_1_VFD1_SI3","SI3",null,"SPARE"]
["PS11_1_VFD1","PS11_1_VFD1_SO0","SO0",null,"SPARE"]
["PS11_2_VFD1","PS11_2_VFD1_I0","I0",null,"PS11_2_VFD1_DISC","DISCONNECT AUX"]
["PS11_2_VFD1","PS11_2_VFD1_I1","I1",null,"PS11_2_ENC1","ENCODER"]
["PS11_2_VFD1","PS11_2_VFD1_I2","I2",null,"PS11_2_JPE1","JAM PHOTOEYE"]
["PS11_2_VFD1","PS11_2_VFD1_I3","I3",null,"SPARE"]
["PS11_2_VFD1","PS11_2_VFD1_IO0","IO0",null,"PS11_2_BCN1_A","AMBER BEACON LIGHT"]
["PS11_2_VFD1","PS11_2_VFD1_IO1","IO1",null,"SPARE"]
["PS11_2_VFD1","PS11_2_VFD1_SI0","SI0",null,"SPARE"]
["PS11_2_VFD1","PS11_2_VFD1_SI1","SI1",null,"SPARE"]
["PS11_2_VFD1","PS11_2_VFD1_SI2","SI2",null,"SPARE"]
["PS11_2_VFD1","PS11_2_VFD1_SI3","SI3",null,"SPARE"]
["PS11_2_VFD1","PS11_2_VFD1_SO0","SO0",null,"SPARE"]
["PS11_3_VFD1","PS11_3_VFD1_I0","I0",null,"PS11_3_VFD1_DISC","DISCONNECT AUX"]
["PS11_3_VFD1","PS11_3_VFD1_I1","I1",null,"PS11_3_ENC1","ENCODER"]
["PS11_3_VFD1","PS11_3_VFD1_I2","I2",null,"PS11_3_JPE1","JAM PHOTOEYE"]
["PS11_3_VFD1","PS11_3_VFD1_I3","I3",null,"PS11_3_JPE2","JAM PHOTOEYE"]
["PS11_3_VFD1","PS11_3_VFD1_IO0","IO0",null,"PS11_3_BCN1_A","AMBER BEACON LIGHT"]
["PS11_3_VFD1","PS11_3_VFD1_IO1","IO1",null,"PS11_3_BCN1_R","RED BEACON LIGHT"]
["PS11_3_VFD1","PS11_3_VFD1_SI0","SI0",null,"PS11_3_EPC1","E-STOP PULLCORD"]
["PS11_3_VFD1","PS11_3_VFD1_SI1","SI1",null,"PS11_3_EPC1_2","E-STOP PULLCORD"]
["PS11_3_VFD1","PS11_3_VFD1_SI2","SI2",null,"PS11_3_EPC2","E-STOP PULLCORD"]
["PS11_3_VFD1","PS11_3_VFD1_SI3","SI3",null,"PS11_3_EPC2_2","E-STOP PULLCORD"]
["PS11_3_VFD1","PS11_3_VFD1_SO0","SO0",null,"SPARE"]
["PS11_4_VFD1","PS11_4_VFD1_I0","I0",null,"PS11_4_VFD1_DISC","DISCONNECT AUX"]
["PS11_4_VFD1","PS11_4_VFD1_I1","I1",null,"PS11_4_ENC1","ENCODER"]
["PS11_4_VFD1","PS11_4_VFD1_I2","I2",null,"PS11_4_JPE1","JAM PHOTOEYE"]
["PS11_4_VFD1","PS11_4_VFD1_I3","I3",null,"SPARE"]
["PS11_4_VFD1","PS11_4_VFD1_IO0","IO0",null,"SPARE"]
["PS11_4_VFD1","PS11_4_VFD1_IO1","IO1",null,"SPARE"]
["PS11_4_VFD1","PS11_4_VFD1_SI0","SI0",null,"PS11_4_EPC1","E-STOP PULLCORD"]
["PS11_4_VFD1","PS11_4_VFD1_SI1","SI1",null,"PS11_4_EPC1_2","E-STOP PULLCORD"]
["PS11_4_VFD1","PS11_4_VFD1_SI2","SI2",null,"PS11_4_EPC2","E-STOP PULLCORD"]
["PS11_4_VFD1","PS11_4_VFD1_SI3","SI3",null,"PS11_4_EPC2_2","E-STOP PULLCORD"]
["PS11_4_VFD1","PS11_4_VFD1_SO0","SO0",null,"SPARE"]
["PS11_6_VFD1","PS11_6_VFD1_I0","I0",null,"PS11_6_VFD1_DISC","DISCONNECT AUX"]
["PS11_6_VFD1","PS11_6_VFD1_I1","I1",null,"PS11_6_ENC1","ENCODER"]
["PS11_6_VFD1","PS11_6_VFD1_I2","I2",null,"PS11_6_JPE1","JAM PHOTOEYE"]
["PS11_6_VFD1","PS11_6_VFD1_I3","I3",null,"PS11_6_JPE2","JAM PHOTOEYE"]
["PS11_6_VFD1","PS11_6_VFD1_IO0","IO0",null,"PS11_7_ENC1","ENCODER"]
["PS11_6_VFD1","PS11_6_VFD1_IO1","IO1",null,"PS11_7_JPE1","JAM PHOTOEYE"]
["PS11_6_VFD1","PS11_6_VFD1_SI0","SI0",null,"PS11_7_EPC1","E-STOP PULLCORD"]
["PS11_6_VFD1","PS11_6_VFD1_SI1","SI1",null,"PS11_7_EPC1_2","E-STOP PULLCORD"]
["PS11_6_VFD1","PS11_6_VFD1_SI2","SI2",null,"PS11_7_EPC2","E-STOP PULLCORD"]
["PS11_6_VFD1","PS11_6_VFD1_SI3","SI3",null,"PS11_7_EPC2_2","E-STOP PULLCORD"]
["PS11_6_VFD1","PS11_6_VFD1_SO0","SO0",null,"SPARE"]
["PS11_7_VFD1","PS11_7_VFD1_I0","I0",null,"PS11_7_VFD1_DISC","DISCONNECT AUX"]
["PS11_8_VFD1","PS11_8_VFD1_I0","I0",null,"PS11_8_VFD1_DISC","DISCONNECT AUX"]
["PS11_9_VFD1","PS11_9_VFD1_I0","I0",null,"PS11_9_VFD1_DISC","DISCONNECT AUX"]
["PS11_11_VFD1","PS11_11_VFD1_I0","I0",null,"PS11_11_VFD1_DISC","DISCONNECT AUX"]
["PS11_8_SIO1","PS11_8_SIO1_SI0","SI0",null,"PS11_11_EPC1","E-STOP PULLCORD"]
["PS11_8_SIO1","PS11_8_SIO1_SI1","SI1",null,"PS11_11_EPC1_2","E-STOP PULLCORD"]
["PS11_8_SIO1","PS11_8_SIO1_SI2","SI2",null,"PS11_8_EPC1","E-STOP PULLCORD"]
["PS11_8_SIO1","PS11_8_SIO1_SI3","SI3",null,"PS11_8_EPC1_2","E-STOP PULLCORD"]
["PS11_8_SIO1","PS11_8_SIO1_SI4","SI4",null,"SPARE"]
["PS11_8_SIO1","PS11_8_SIO1_SI5","SI5",null,"SPARE"]
["PS11_8_SIO1","PS11_8_SIO1_SI6","SI6",null,"SPARE"]
["PS11_8_SIO1","PS11_8_SIO1_SI7","SI7",null,"SPARE"]
["PS11_8_SIO1","PS11_8_SIO1_SO0","SO0",null,"PS11_7_VFD1_STO","VFD SAFETY ACTIVE"]
["PS11_8_SIO1","PS11_8_SIO1_SO1","SO1",null,"PS11_8_VFD1_STO","VFD SAFETY ACTIVE"]
["PS11_8_SIO1","PS11_8_SIO1_SO2","SO2",null,"PS11_9_VFD1_STO","VFD SAFETY ACTIVE"]
["PS11_8_SIO1","PS11_8_SIO1_SO3","SO3",null,"PS11_11_VFD1_STO","VFD SAFETY ACTIVE"]
["PS11_8_SIO1","PS11_8_SIO1_IO0","IO0",null,"PS11_8_ENC1","ENCODER"]
["PS11_8_SIO1","PS11_8_SIO1_IO1","IO1",null,"PS11_8_JPE1","JAM PHOTOEYE"]
["PS11_8_SIO1","PS11_8_SIO1_IO2","IO2",null,"PS11_8_FIOH1","HUB ARMOR BLOCK"]
["PS11_8_SIO1","PS11_8_SIO1_IO3","IO3",null,"SPARE"]
["PS11_8_FIOH1","PS11_8_FIOH1_IO0","IO0",null,"PS11_8_BCN1_R","RED BEACON LIGHT"]
["PS11_8_FIOH1","PS11_8_FIOH1_IO1","IO1",null,"SPARE"]
["PS11_8_FIOH1","PS11_8_FIOH1_IO2","IO2",null,"PS11_9_ENC1","ENCODER"]
["PS11_8_FIOH1","PS11_8_FIOH1_IO3","IO3",null,"SPARE"]
["PS11_8_FIOH1","PS11_8_FIOH1_IO4","IO4",null,"PS11_9_BCN1_A","AMBER BEACON LIGHT"]
["PS11_8_FIOH1","PS11_8_FIOH1_IO5","IO5",null,"SPARE"]
["PS11_8_FIOH1","PS11_8_FIOH1_IO6","IO6",null,"PS11_8_S1_PB","START PUSHBUTTON"]
["PS11_8_FIOH1","PS11_8_FIOH1_IO7","IO7",null,"PS11_8_S1_PB_LT","START PUSHBUTTON LIGHT"]
["PS11_8_FIOH1","PS11_8_FIOH1_IO8","IO8",null,"SPARE"]
["PS11_8_FIOH1","PS11_8_FIOH1_IO9","IO9",null,"SPARE"]
["PS11_8_FIOH1","PS11_8_FIOH1_IO10","IO10",null,"SPARE"]
["PS11_8_FIOH1","PS11_8_FIOH1_IO11","IO11",null,"SPARE"]
["PS11_8_FIOH1","PS11_8_FIOH1_IO12","IO12",null,"SPARE"]
["PS11_8_FIOH1","PS11_8_FIOH1_IO13","IO13",null,"SPARE"]
["PS11_8_FIOH1","PS11_8_FIOH1_IO14","IO14",null,"SPARE"]
["PS11_8_FIOH1","PS11_8_FIOH1_IO15","IO15",null,"SPARE"]
["ULC5_3_VFD1","ULC5_3_VFD1_I0","I0",null,"ULC5_3_VFD1_DISC","DISCONNECT AUX"]
["ULC5_3_VFD1","ULC5_3_VFD1_I1","I1",null,"ULC5_3_ENC1","ENCODER"]
["ULC5_3_VFD1","ULC5_3_VFD1_I2","I2",null,"ULC5_3_JPE1","JAM PHOTOEYE"]
["ULC5_3_VFD1","ULC5_3_VFD1_I3","I3",null,"ULC5_3_JPE2","JAM PHOTOEYE"]
["ULC5_3_VFD1","ULC5_3_VFD1_IO0","IO0",null,"ULC5_3_BCN1_A","AMBER BEACON LIGHT"]
["ULC5_3_VFD1","ULC5_3_VFD1_IO1","IO1",null,"ULC5_3_BCN1_R","RED BEACON LIGHT"]
["ULC5_3_VFD1","ULC5_3_VFD1_SI0","SI0",null,"ULC5_3_EPC1","E-STOP PULLCORD"]
["ULC5_3_VFD1","ULC5_3_VFD1_SI1","SI1",null,"ULC5_3_EPC1_2","E-STOP PULLCORD"]
["ULC5_3_VFD1","ULC5_3_VFD1_SI2","SI2",null,"ULC5_3_EPC2","E-STOP PULLCORD"]
["ULC5_3_VFD1","ULC5_3_VFD1_SI3","SI3",null,"ULC5_3_EPC2_2","E-STOP PULLCORD"]
["ULC5_3_VFD1","ULC5_3_VFD1_SO0","SO0",null,"SPARE"]
["ULC6_3_VFD1","ULC6_3_VFD1_I0","I0",null,"ULC6_3_VFD1_DISC","DISCONNECT AUX"]
["ULC6_3_VFD1","ULC6_3_VFD1_I1","I1",null,"ULC6_3_ENC1","ENCODER"]
["ULC6_3_VFD1","ULC6_3_VFD1_I2","I2",null,"ULC6_3_JPE1","JAM PHOTOEYE"]
["ULC6_3_VFD1","ULC6_3_VFD1_I3","I3",null,"ULC6_3_JPE2","JAM PHOTOEYE"]
["ULC6_3_VFD1","ULC6_3_VFD1_IO0","IO0",null,"ULC6_3_BCN1_A","AMBER BEACON LIGHT"]
["ULC6_3_VFD1","ULC6_3_VFD1_IO1","IO1",null,"ULC6_3_BCN1_R","RED BEACON LIGHT"]
["ULC6_3_VFD1","ULC6_3_VFD1_SI0","SI0",null,"ULC6_3_EPC1","E-STOP PULLCORD"]
["ULC6_3_VFD1","ULC6_3_VFD1_SI1","SI1",null,"ULC6_3_EPC1_2","E-STOP PULLCORD"]
["ULC6_3_VFD1","ULC6_3_VFD1_SI2","SI2",null,"SPARE"]
["ULC6_3_VFD1","ULC6_3_VFD1_SI3","SI3",null,"SPARE"]
["ULC6_3_VFD1","ULC6_3_VFD1_SO0","SO0",null,"SPARE"]
["ULC7_3_VFD1","ULC7_3_VFD1_I0","I0",null,"ULC7_3_VFD1_DISC","DISCONNECT AUX"]
["ULC7_3_VFD1","ULC7_3_VFD1_I1","I1",null,"ULC7_3_ENC1","ENCODER"]
["ULC7_3_VFD1","ULC7_3_VFD1_I2","I2",null,"ULC7_3_JPE1","JAM PHOTOEYE"]
["ULC7_3_VFD1","ULC7_3_VFD1_I3","I3",null,"ULC7_3_JPE2","JAM PHOTOEYE"]
["ULC7_3_VFD1","ULC7_3_VFD1_IO0","IO0",null,"SPARE"]
["ULC7_3_VFD1","ULC7_3_VFD1_IO1","IO1",null,"SPARE"]
["ULC7_3_VFD1","ULC7_3_VFD1_SI0","SI0",null,"ULC7_3_EPC1","E-STOP PULLCORD"]
["ULC7_3_VFD1","ULC7_3_VFD1_SI1","SI1",null,"ULC7_3_EPC1_2","E-STOP PULLCORD"]
["ULC7_3_VFD1","ULC7_3_VFD1_SI2","SI2",null,"ULC7_3_EPC2","E-STOP PULLCORD"]
["ULC7_3_VFD1","ULC7_3_VFD1_SI3","SI3",null,"ULC7_3_EPC2_2","E-STOP PULLCORD"]
["ULC7_3_VFD1","ULC7_3_VFD1_SO0","SO0",null,"SPARE"]
["ULC8_3_VFD1","ULC8_3_VFD1_I0","I0",null,"ULC8_3_VFD1_DISC","DISCONNECT AUX"]
["ULC8_3_VFD1","ULC8_3_VFD1_I1","I1",null,"ULC8_3_ENC1","ENCODER"]
["ULC8_3_VFD1","ULC8_3_VFD1_I2","I2",null,"ULC8_3_JPE1","JAM PHOTOEYE"]
["ULC8_3_VFD1","ULC8_3_VFD1_I3","I3",null,"ULC8_3_JPE2","JAM PHOTOEYE"]
["ULC8_3_VFD1","ULC8_3_VFD1_IO0","IO0",null,"SPARE"]
["ULC8_3_VFD1","ULC8_3_VFD1_IO1","IO1",null,"SPARE"]
["ULC8_3_VFD1","ULC8_3_VFD1_SI0","SI0",null,"ULC8_3_EPC1","E-STOP PULLCORD"]
["ULC8_3_VFD1","ULC8_3_VFD1_SI1","SI1",null,"ULC8_3_EPC1_2","E-STOP PULLCORD"]
["ULC8_3_VFD1","ULC8_3_VFD1_SI2","SI2",null,"SPARE"]
["ULC8_3_VFD1","ULC8_3_VFD1_SI3","SI3",null,"SPARE"]
["ULC8_3_VFD1","ULC8_3_VFD1_SO0","SO0",null,"SPARE"]
["PRS3_2A_FIO1","PRS3_2A_FIOM1_IO00","IO00",null,"PRS3_1ACH_BCN1_A","AMBER BEACON LIGHT"]
["PRS3_2A_FIO1","PRS3_2A_FIOM1_IO01","IO01",null,"PRS3_1ACH_BCN1_B","BLUE BEACON LIGHT"]
["PRS3_2A_FIO1","PRS3_2A_FIOM1_IO02","IO02",null,"PRS3_1ACH_FPE1","FULL PHOTOEYE"]
["PRS3_2A_FIO1","PRS3_2A_FIOM1_IO03","IO03",null,"SPARE"]
["PRS3_2A_FIO1","PRS3_2A_FIOM1_IO04","IO04",null,"PRS3_1ACH_JR1_PB","JAM RESET PUSHBUTTON"]
["PRS3_2A_FIO1","PRS3_2A_FIOM1_IO05","IO05",null,"PRS3_1ACH_JR1_PB_LT","JAM RESET PUSHBUTTON LIGHT"]
["PRS3_2A_FIO1","PRS3_2A_FIOM1_IO06","IO06",null,"PRS3_2A_JR1_PB","JAM RESET PUSHBUTTON"]
["PRS3_2A_FIO1","PRS3_2A_FIOM1_IO07","IO07",null,"PRS3_2A_JR1_PB_LT","JAM RESET PUSHBUTTON LIGHT"]
["PRS3_2A_FIO1","PRS3_2A_FIOM1_IO08","IO08",null,"PRS3_2A_BCN1_A","AMBER BEACON LIGHT"]
["PRS3_2A_FIO1","PRS3_2A_FIOM1_IO09","IO09",null,"SPARE"]
["PRS3_2A_FIO1","PRS3_2A_FIOM1_IO10","IO10",null,"SPARE"]
["PRS3_2A_FIO1","PRS3_2A_FIOM1_IO11","IO11",null,"SPARE"]
["PRS3_2A_FIO1","PRS3_2A_FIOM1_IO12","IO12",null,"SPARE"]
["PRS3_2A_FIO1","PRS3_2A_FIOM1_IO13","IO13",null,"SPARE"]
["PRS3_2A_FIO1","PRS3_2A_FIOM1_IO14","IO14",null,"SPARE"]
["PRS3_2A_FIO1","PRS3_2A_FIOM1_IO15","IO15",null,"SPARE"]
["PRS3_2B_FIO1","PRS3_2B_FIO1_IO00","IO00",null,"PRS3_1BCH_BCN1_A","AMBER BEACON LIGHT"]
["PRS3_2B_FIO1","PRS3_2B_FIO1_IO01","IO01",null,"PRS3_1BCH_BCN1_B","BLUE BEACON LIGHT"]
["PRS3_2B_FIO1","PRS3_2B_FIO1_IO02","IO02",null,"PRS3_1BCH_FPE1","FULL PHOTOEYE"]
["PRS3_2B_FIO1","PRS3_2B_FIO1_IO03","IO03",null,"SPARE"]
["PRS3_2B_FIO1","PRS3_2B_FIO1_IO04","IO04",null,"PRS3_1BCH_JR1_PB","JAM RESET PUSHBUTTON"]
["PRS3_2B_FIO1","PRS3_2B_FIO1_IO05","IO05",null,"PRS3_1BCH_JR1_PB_LT","JAM RESET PUSHBUTTON LIGHT"]
["PRS3_2B_FIO1","PRS3_2B_FIO1_IO06","IO06",null,"PRS3_3A_JR1_PB","JAM RESET PUSHBUTTON"]
["PRS3_2B_FIO1","PRS3_2B_FIO1_IO07","IO07",null,"PRS3_3A_JR1_PB_LT","JAM RESET PUSHBUTTON LIGHT"]
["PRS3_2B_FIO1","PRS3_2B_FIO1_IO08","IO08",null,"PRS3_2B_BCN1_A","AMBER BEACON LIGHT"]
["PRS3_2B_FIO1","PRS3_2B_FIO1_IO09","IO09",null,"PRS3_2B_JR1_PB","JAM RESET PUSHBUTTON"]
["PRS3_2B_FIO1","PRS3_2B_FIO1_IO10","IO10",null,"PRS3_2B_JR1_PB_LT","JAM RESET PUSHBUTTON LIGHT"]
["PRS3_2B_FIO1","PRS3_2B_FIO1_IO11","IO11",null,"PRS3_3B_JR1_PB","JAM RESET PUSHBUTTON"]
["PRS3_2B_FIO1","PRS3_2B_FIO1_IO12","IO12",null,"PRS3_3B_JR1_PB_LT","JAM RESET PUSHBUTTON LIGHT"]
["PRS3_2B_FIO1","PRS3_2B_FIO1_IO13","IO13",null,"SPARE"]
["PRS3_2B_FIO1","PRS3_2B_FIO1_IO14","IO14",null,"PRS3_4CH_FPE1","FULL PHOTOEYE"]
["PRS3_2B_FIO1","PRS3_2B_FIO1_IO15","IO15",null,"PRS3_4CH_FPE2","FULL PHOTOEYE"]
["PRS3_4CH_FIO1","PRS3_4CH_FIO1_IO00","IO00",null,"PRS3_5_BCN1_A","AMBER BEACON LIGHT"]
["PRS3_4CH_FIO1","PRS3_4CH_FIO1_IO01","IO01",null,"PRS3_5_BCN1_R","RED BEACON LIGHT"]
["PRS3_4CH_FIO1","PRS3_4CH_FIO1_IO02","IO02",null,"PRS3_5_BCN2_R","RED BEACON LIGHT"]
["PRS3_4CH_FIO1","PRS3_4CH_FIO1_IO03","IO03",null,"SPARE"]
["PRS3_4CH_FIO1","PRS3_4CH_FIO1_IO04","IO04",null,"PRS3_5_BCN3_A","AMBER BEACON LIGHT"]
["PRS3_4CH_FIO1","PRS3_4CH_FIO1_IO05","IO05",null,"PRS3_5_BCN3_B","BLUE BEACON LIGHT"]
["PRS3_4CH_FIO1","PRS3_4CH_FIO1_IO06","IO06",null,"PRS3_5_S1_PB","START PUSHBUTTON"]
["PRS3_4CH_FIO1","PRS3_4CH_FIO1_IO07","IO07",null,"PRS3_5_S1_PB_LT","START PUSHBUTTON LIGHT"]
["PRS3_4CH_FIO1","PRS3_4CH_FIO1_IO08","IO08",null,"PRS3_5_S2_PB","START PUSHBUTTON"]
["PRS3_4CH_FIO1","PRS3_4CH_FIO1_IO09","IO09",null,"PRS3_5_S2_PB_LT","START PUSHBUTTON LIGHT"]
["PRS3_4CH_FIO1","PRS3_4CH_FIO1_IO10","IO10",null,"SPARE"]
["PRS3_4CH_FIO1","PRS3_4CH_FIO1_IO11","IO11",null,"SPARE"]
["PRS3_4CH_FIO1","PRS3_4CH_FIO1_IO12","IO12",null,"SPARE"]
["PRS3_4CH_FIO1","PRS3_4CH_FIO1_IO13","IO13",null,"SPARE"]
["PRS3_4CH_FIO1","PRS3_4CH_FIO1_IO14","IO14",null,"SPARE"]
["PRS3_4CH_FIO1","PRS3_4CH_FIO1_IO15","IO15",null,"SPARE"]
["PRS4_2_FIO1","PRS4_2_FIO1_IO00","IO00",null,"PRS4_1_BCN1_R","RED BEACON LIGHT"]
["PRS4_2_FIO1","PRS4_2_FIO1_IO01","IO01",null,"SPARE"]
["PRS4_2_FIO1","PRS4_2_FIO1_IO02","IO02",null,"PRS4_1_BCN2_A","AMBER BEACON LIGHT"]
["PRS4_2_FIO1","PRS4_2_FIO1_IO03","IO03",null,"PRS4_1_BCN2_R","RED BEACON LIGHT"]
["PRS4_2_FIO1","PRS4_2_FIO1_IO04","IO04",null,"PRS4_1_S1_PB","START PUSHBUTTON"]
["PRS4_2_FIO1","PRS4_2_FIO1_IO05","IO05",null,"PRS4_1_S1_PB_LT","START PUSHBUTTON LIGHT"]
["PRS4_2_FIO1","PRS4_2_FIO1_IO06","IO06",null,"PRS4_1_S2_PB","START PUSHBUTTON"]
["PRS4_2_FIO1","PRS4_2_FIO1_IO07","IO07",null,"PRS4_1_S2_PB_LT","START PUSHBUTTON LIGHT"]
["PRS4_2_FIO1","PRS4_2_FIO1_IO08","IO08",null,"PRS4_2_BCN1_R","RED BEACON LIGHT"]
["PRS4_2_FIO1","PRS4_2_FIO1_IO09","IO09",null,"SPARE"]
["PRS4_2_FIO1","PRS4_2_FIO1_IO10","IO10",null,"PRS4_2_JR1_PB","JAM RESET PUSHBUTTON"]
["PRS4_2_FIO1","PRS4_2_FIO1_IO11","IO11",null,"PRS4_2_JR1_PB_LT","JAM RESET PUSHBUTTON LIGHT"]
["PRS4_2_FIO1","PRS4_2_FIO1_IO12","IO12",null,"PRS4_2_S1_PB","START PUSHBUTTON"]
["PRS4_2_FIO1","PRS4_2_FIO1_IO13","IO13",null,"PRS4_2_S1_PB_LT","START PUSHBUTTON LIGHT"]
["PRS4_2_FIO1","PRS4_2_FIO1_IO14","IO14",null,"PRS4_2_S2_PB","START PUSHBUTTON"]
["PRS4_2_FIO1","PRS4_2_FIO1_IO15","IO15",null,"PRS4_2_S2_PB_LT","START PUSHBUTTON LIGHT"]
["PS10_1_FIO1","PS10_1_FIO1_IO00","IO00",null,"PS10_1_JPE3","JAM PHOTOEYE"]
["PS10_1_FIO1","PS10_1_FIO1_IO01","IO01",null,"PS10_1_JPE4","JAM PHOTOEYE"]
["PS10_1_FIO1","PS10_1_FIO1_IO02","IO02",null,"PS10_1_JR1_PB","JAM RESET PUSHBUTTON"]
["PS10_1_FIO1","PS10_1_FIO1_IO03","IO03",null,"PS10_1_JR1_PB_LT","JAM RESET PUSHBUTTON LIGHT"]
["PS10_1_FIO1","PS10_1_FIO1_IO04","IO04",null,"PS10_1_SS1_SPB","SS STATION START PUSHBUTTON"]
["PS10_1_FIO1","PS10_1_FIO1_IO05","IO05",null,"PS10_1_SS1_STPB","SS STATION STOP PUSHBUTTON"]
["PS10_1_FIO1","PS10_1_FIO1_IO06","IO06",null,"PS10_1_SS1_STPB_LT","SS STATION STOP PUSHBUTTON LIGHT"]
["PS10_1_FIO1","PS10_1_FIO1_IO07","IO07",null,"SPARE"]
["PS10_1_FIO1","PS10_1_FIO1_IO08","IO08",null,"PS10_2_ENC1","ENCODER"]
["PS10_1_FIO1","PS10_1_FIO1_IO09","IO09",null,"SPARE"]
["PS10_1_FIO1","PS10_1_FIO1_IO10","IO10",null,"PS10_2_JPE1","JAM PHOTOEYE"]
["PS10_1_FIO1","PS10_1_FIO1_IO11","IO11",null,"SPARE"]
["PS10_1_FIO1","PS10_1_FIO1_IO12","IO12",null,"PS10_1_FIOH1","HUB ARMOR BLOCK"]
["PS10_1_FIO1","PS10_1_FIO1_IO13","IO13",null,"SPARE"]
["PS10_1_FIO1","PS10_1_FIO1_IO14","IO14",null,"PS10_1_FIOH2","HUB ARMOR BLOCK"]
["PS10_1_FIO1","PS10_1_FIO1_IO15","IO15",null,"SPARE"]
["PS10_1_FIOH1","PS10_1_FIOH1_IO00","IO00",null,"ULC7_3_BCN1_A","AMBER BEACON LIGHT"]
["PS10_1_FIOH1","PS10_1_FIOH1_IO01","IO01",null,"ULC7_3_BCN1_R","RED BEACON LIGHT"]
["PS10_1_FIOH1","PS10_1_FIOH1_IO02","IO02",null,"ULC7_3_JR1_PB","JAM RESET PUSHBUTTON"]
["PS10_1_FIOH1","PS10_1_FIOH1_IO03","IO03",null,"ULC7_3_JR1_PB_LT","JAM RESET PUSHBUTTON LIGHT"]
["PS10_1_FIOH1","PS10_1_FIOH1_IO04","IO04",null,"ULC7_3_SS1_SPB","SS STATION START PUSHBUTTON"]
["PS10_1_FIOH1","PS10_1_FIOH1_IO05","IO05",null,"ULC7_3_SS1_STPB","SS STATION STOP PUSHBUTTON"]
["PS10_1_FIOH1","PS10_1_FIOH1_IO06","IO06",null,"ULC7_3_SS1_STPB_LT","SS STATION STOP PUSHBUTTON LIGHT"]
["PS10_1_FIOH1","PS10_1_FIOH1_IO07","IO07",null,"SPARE"]
["PS10_1_FIOH1","PS10_1_FIOH1_IO08","IO08",null,"ULC7_3_SS2_SPB","SS STATION START PUSHBUTTON"]
["PS10_1_FIOH1","PS10_1_FIOH1_IO09","IO09",null,"ULC7_3_SS2_STPB","SS STATION STOP PUSHBUTTON"]
["PS10_1_FIOH1","PS10_1_FIOH1_IO10","IO10",null,"ULC7_3_SS2_STPB_LT","SS STATION STOP PUSHBUTTON LIGHT"]
["PS10_1_FIOH1","PS10_1_FIOH1_IO11","IO11",null,"SPARE"]
["PS10_1_FIOH1","PS10_1_FIOH1_IO12","IO12",null,"SPARE"]
["PS10_1_FIOH1","PS10_1_FIOH1_IO13","IO13",null,"SPARE"]
["PS10_1_FIOH1","PS10_1_FIOH1_IO14","IO14",null,"SPARE"]
["PS10_1_FIOH1","PS10_1_FIOH1_IO15","IO15",null,"SPARE"]
["PS10_1_FIOH2","PS10_1_FIOH2_IO00","IO00",null,"ULC8_3_BCN1_A","AMBER BEACON LIGHT"]
["PS10_1_FIOH2","PS10_1_FIOH2_IO01","IO01",null,"ULC8_3_BCN1_R","RED BEACON LIGHT"]
["PS10_1_FIOH2","PS10_1_FIOH2_IO02","IO02",null,"ULC8_3_JR1_PB","JAM RESET PUSHBUTTON"]
["PS10_1_FIOH2","PS10_1_FIOH2_IO03","IO03",null,"ULC8_3_JR1_PB_LT","JAM RESET PUSHBUTTON LIGHT"]
["PS10_1_FIOH2","PS10_1_FIOH2_IO04","IO04",null,"ULC8_3_SS1_SPB","SS STATION START PUSHBUTTON"]
["PS10_1_FIOH2","PS10_1_FIOH2_IO05","IO05",null,"ULC8_3_SS1_STPB","SS STATION STOP PUSHBUTTON"]
["PS10_1_FIOH2","PS10_1_FIOH2_IO06","IO06",null,"ULC8_3_SS1_STPB_LT","SS STATION STOP PUSHBUTTON LIGHT"]
["PS10_1_FIOH2","PS10_1_FIOH2_IO07","IO07",null,"SPARE"]
["PS10_1_FIOH2","PS10_1_FIOH2_IO08","IO08",null,"SPARE"]
["PS10_1_FIOH2","PS10_1_FIOH2_IO09","IO09",null,"SPARE"]
["PS10_1_FIOH2","PS10_1_FIOH2_IO10","IO10",null,"SPARE"]
["PS10_1_FIOH2","PS10_1_FIOH2_IO11","IO11",null,"SPARE"]
["PS10_1_FIOH2","PS10_1_FIOH2_IO12","IO12",null,"SPARE"]
["PS10_1_FIOH2","PS10_1_FIOH2_IO13","IO13",null,"SPARE"]
["PS10_1_FIOH2","PS10_1_FIOH2_IO14","IO14",null,"SPARE"]
["PS10_1_FIOH2","PS10_1_FIOH2_IO15","IO15",null,"SPARE"]
["PS10_5_FIO1","PS10_5_FIO1_IO00","IO00",null,"PS10_5_JPE4","JAM PHOTOEYE"]
["PS10_5_FIO1","PS10_5_FIO1_IO01","IO01",null,"PS10_5_JPE5","JAM PHOTOEYE"]
["PS10_5_FIO1","PS10_5_FIO1_IO02","IO02",null,"PS10_5_JPE6","JAM PHOTOEYE"]
["PS10_5_FIO1","PS10_5_FIO1_IO03","IO03",null,"SPARE"]
["PS10_5_FIO1","PS10_5_FIO1_IO04","IO04",null,"PS10_5_JR1_PB","JAM RESET PUSHBUTTON"]
["PS10_5_FIO1","PS10_5_FIO1_IO05","IO05",null,"PS10_5_JR1_PB_LT","JAM RESET PUSHBUTTON LIGHT"]
["PS10_5_FIO1","PS10_5_FIO1_IO06","IO06",null,"PS10_5_JR2_PB","JAM RESET PUSHBUTTON"]
["PS10_5_FIO1","PS10_5_FIO1_IO07","IO07",null,"PS10_5_JR2_PB_LT","JAM RESET PUSHBUTTON LIGHT"]
["PS10_5_FIO1","PS10_5_FIO1_IO08","IO08",null,"PS10_5_JPE1","JAM PHOTOEYE"]
["PS10_5_FIO1","PS10_5_FIO1_IO09","IO09",null,"PS10_6CH_FPE1","FULL PHOTOEYE"]
["PS10_5_FIO1","PS10_5_FIO1_IO10","IO10",null,"PS10_5_PS1"]
["PS10_5_FIO1","PS10_5_FIO1_IO11","IO11",null,"SPARE"]
["PS10_5_FIO1","PS10_5_FIO1_IO12","IO12",null,"PS10_5_BCN1_A","AMBER BEACON LIGHT"]
["PS10_5_FIO1","PS10_5_FIO1_IO13","IO13",null,"PS10_5_BCN2_A","AMBER BEACON LIGHT"]
["PS10_5_FIO1","PS10_5_FIO1_IO14","IO14",null,"PS10_5_FIOH1","HUB ARMOR BLOCK"]
["PS10_5_FIO1","PS10_5_FIO1_IO15","IO15",null,"SPARE"]
["PS10_5_FIO2","PS10_5_FIO2_IO00","IO00",null,"PS10_5DIV3_PX1","LIMIT SWITCH"]
["PS10_5_FIO2","PS10_5_FIO2_IO01","IO01",null,"PS10_5DIV3_PX2","LIMIT SWITCH"]
["PS10_5_FIO2","PS10_5_FIO2_IO02","IO02",null,"SPARE"]
["PS10_5_FIO2","PS10_5_FIO2_IO03","IO03",null,"PS10_5DIV3_SOL1","SOLENOID VALVE"]
["PS10_5_FIO2","PS10_5_FIO2_IO04","IO04",null,"SPARE"]
["PS10_5_FIO2","PS10_5_FIO2_IO05","IO05",null,"PS10_5DIV3_SOL2","SOLENOID VALVE"]
["PS10_5_FIO2","PS10_5_FIO2_IO06","IO06",null,"SPARE"]
["PS10_5_FIO2","PS10_5_FIO2_IO07","IO07",null,"PS10_5DIV4_PX1","LIMIT SWITCH"]
["PS10_5_FIO2","PS10_5_FIO2_IO08","IO08",null,"PS10_5DIV4_PX2","LIMIT SWITCH"]
["PS10_5_FIO2","PS10_5_FIO2_IO09","IO09",null,"PS10_5DIV4_SOL1","SOLENOID VALVE"]
["PS10_5_FIO2","PS10_5_FIO2_IO10","IO10",null,"PS10_5DIV4_SOL2","SOLENOID VALVE"]
["PS10_5_FIO2","PS10_5_FIO2_IO11","IO11",null,"SPARE"]
["PS10_5_FIO2","PS10_5_FIO2_IO12","IO12",null,"PS10_5_FIOH3","HUB ARMOR BLOCK"]
["PS10_5_FIO2","PS10_5_FIO2_IO13","IO13",null,"SPARE"]
["PS10_5_FIO2","PS10_5_FIO2_IO14","IO14",null,"PS10_5_FIOH4","HUB ARMOR BLOCK"]
["PS10_5_FIO2","PS10_5_FIO2_IO15","IO15",null,"SPARE"]
["PS10_5_FIOH1","PS10_5_FIOH1_IO00","IO00",null,"PS10_5CH1_BCN1_A","AMBER BEACON LIGHT"]
["PS10_5_FIOH1","PS10_5_FIOH1_IO01","IO01",null,"PS10_5CH1_BCN1_B","BLUE BEACON LIGHT"]
["PS10_5_FIOH1","PS10_5_FIOH1_IO02","IO02",null,"PS10_5CH1_BCN1_G","GREEN BEACON LIGHT"]
["PS10_5_FIOH1","PS10_5_FIOH1_IO03","IO03",null,"PS10_5CH1_FPE1","FULL PHOTOEYE"]
["PS10_5_FIOH1","PS10_5_FIOH1_IO04","IO04",null,"PS10_5CH1_FPE2","FULL PHOTOEYE"]
["PS10_5_FIOH1","PS10_5_FIOH1_IO05","IO05",null,"PS10_5CH1_JPE1","JAM PHOTOEYE"]
["PS10_5_FIOH1","PS10_5_FIOH1_IO06","IO06",null,"PS10_5CH1_S1_PB","START PUSHBUTTON"]
["PS10_5_FIOH1","PS10_5_FIOH1_IO07","IO07",null,"PS10_5CH1_S1_PB_LT","START PUSHBUTTON LIGHT"]
["PS10_5_FIOH1","PS10_5_FIOH1_IO08","IO08",null,"PS10_5CH2_BCN1_A","AMBER BEACON LIGHT"]
["PS10_5_FIOH1","PS10_5_FIOH1_IO09","IO09",null,"PS10_5CH2_BCN1_B","BLUE BEACON LIGHT"]
["PS10_5_FIOH1","PS10_5_FIOH1_IO10","IO10",null,"PS10_5CH2_BCN1_G","GREEN BEACON LIGHT"]
["PS10_5_FIOH1","PS10_5_FIOH1_IO11","IO11",null,"PS10_5CH2_FPE1","FULL PHOTOEYE"]
["PS10_5_FIOH1","PS10_5_FIOH1_IO12","IO12",null,"PS10_5CH2_FPE2","FULL PHOTOEYE"]
["PS10_5_FIOH1","PS10_5_FIOH1_IO13","IO13",null,"PS10_5CH2_JPE1","JAM PHOTOEYE"]
["PS10_5_FIOH1","PS10_5_FIOH1_IO14","IO14",null,"PS10_5CH2_S1_PB","START PUSHBUTTON"]
["PS10_5_FIOH1","PS10_5_FIOH1_IO15","IO15",null,"PS10_5CH2_S1_PB_LT","START PUSHBUTTON LIGHT"]
["PS10_5_FIOH2","PS10_5_FIOH2_IO00","IO00",null,"PS10_5DIV1_PX1","LIMIT SWITCH"]
["PS10_5_FIOH2","PS10_5_FIOH2_IO01","IO01",null,"PS10_5DIV1_PX2","LIMIT SWITCH"]
["PS10_5_FIOH2","PS10_5_FIOH2_IO02","IO02",null,"PS10_5DIV1_SOL1","SOLENOID VALVE"]
["PS10_5_FIOH2","PS10_5_FIOH2_IO03","IO03",null,"PS10_5DIV1_SOL2","SOLENOID VALVE"]
["PS10_5_FIOH2","PS10_5_FIOH2_IO04","IO04",null,"PS10_5DIV2_PX1","LIMIT SWITCH"]
["PS10_5_FIOH2","PS10_5_FIOH2_IO05","IO05",null,"PS10_5DIV2_PX2","LIMIT SWITCH"]
["PS10_5_FIOH2","PS10_5_FIOH2_IO06","IO06",null,"PS10_5DIV2_SOL1","SOLENOID VALVE"]
["PS10_5_FIOH2","PS10_5_FIOH2_IO07","IO07",null,"PS10_5DIV2_SOL2","SOLENOID VALVE"]
["PS10_5_FIOH2","PS10_5_FIOH2_IO08","IO08",null,"PS10_5_ENC1","ENCODER"]
["PS10_5_FIOH2","PS10_5_FIOH2_IO09","IO09",null,"PS10_5_JPE2","JAM PHOTOEYE"]
["PS10_5_FIOH2","PS10_5_FIOH2_IO10","IO10",null,"PS10_5_JPE3","JAM PHOTOEYE"]
["PS10_5_FIOH2","PS10_5_FIOH2_IO11","IO11",null,"PS10_3_JR1_PB","JAM RESET PUSHBUTTON"]
["PS10_5_FIOH2","PS10_5_FIOH2_IO12","IO12",null,"PS10_3_JR1_PB_LT","JAM RESET PUSHBUTTON LIGHT"]
["PS10_5_FIOH2","PS10_5_FIOH2_IO13","IO13",null,"SPARE"]
["PS10_5_FIOH2","PS10_5_FIOH2_IO14","IO14",null,"PS10_3_BCN1_A","AMBER BEACON LIGHT"]
["PS10_5_FIOH2","PS10_5_FIOH2_IO15","IO15",null,"PS10_3_BCN1_R","RED BEACON LIGHT"]
["PS10_5_FIOH3","PS10_5_FIOH3_IO00","IO00",null,"PS10_5CH3_BCN1_A","AMBER BEACON LIGHT"]
["PS10_5_FIOH3","PS10_5_FIOH3_IO01","IO01",null,"SPARE"]
["PS10_5_FIOH3","PS10_5_FIOH3_IO02","IO02",null,"PS10_5CH3_BCN1_B","BLUE BEACON LIGHT"]
["PS10_5_FIOH3","PS10_5_FIOH3_IO03","IO03",null,"SPARE"]
["PS10_5_FIOH3","PS10_5_FIOH3_IO04","IO04",null,"PS10_5CH3_BCN1_G","GREEN BEACON LIGHT"]
["PS10_5_FIOH3","PS10_5_FIOH3_IO05","IO05",null,"SPARE"]
["PS10_5_FIOH3","PS10_5_FIOH3_IO06","IO06",null,"PS10_5CH3_FPE1","FULL PHOTOEYE"]
["PS10_5_FIOH3","PS10_5_FIOH3_IO07","IO07",null,"SPARE"]
["PS10_5_FIOH3","PS10_5_FIOH3_IO08","IO08",null,"PS10_5CH3_FPE2","FULL PHOTOEYE"]
["PS10_5_FIOH3","PS10_5_FIOH3_IO09","IO09",null,"SPARE"]
["PS10_5_FIOH3","PS10_5_FIOH3_IO10","IO10",null,"PS10_5CH3_JPE1","JAM PHOTOEYE"]
["PS10_5_FIOH3","PS10_5_FIOH3_IO11","IO11",null,"SPARE"]
["PS10_5_FIOH3","PS10_5_FIOH3_IO12","IO12",null,"PS10_5CH3_S1_PB","START PUSHBUTTON"]
["PS10_5_FIOH3","PS10_5_FIOH3_IO13","IO13",null,"PS10_5CH3_S1_PB_LT","START PUSHBUTTON LIGHT"]
["PS10_5_FIOH3","PS10_5_FIOH3_IO14","IO14",null,"SPARE"]
["PS10_5_FIOH3","PS10_5_FIOH3_IO15","IO15",null,"SPARE"]
["PS10_5_FIOH4","PS10_5_FIOH4_IO00","IO00",null,"PS10_5CH4_BCN1_A","AMBER BEACON LIGHT"]
["PS10_5_FIOH4","PS10_5_FIOH4_IO01","IO01",null,"SPARE"]
["PS10_5_FIOH4","PS10_5_FIOH4_IO02","IO02",null,"PS10_5CH4_BCN1_B","BLUE BEACON LIGHT"]
["PS10_5_FIOH4","PS10_5_FIOH4_IO03","IO03",null,"SPARE"]
["PS10_5_FIOH4","PS10_5_FIOH4_IO04","IO04",null,"PS10_5CH4_BCN1_G","GREEN BEACON LIGHT"]
["PS10_5_FIOH4","PS10_5_FIOH4_IO05","IO05",null,"SPARE"]
["PS10_5_FIOH4","PS10_5_FIOH4_IO06","IO06",null,"PS10_5CH4_FPE1","FULL PHOTOEYE"]
["PS10_5_FIOH4","PS10_5_FIOH4_IO07","IO07",null,"SPARE"]
["PS10_5_FIOH4","PS10_5_FIOH4_IO08","IO08",null,"PS10_5CH4_FPE2","FULL PHOTOEYE"]
["PS10_5_FIOH4","PS10_5_FIOH4_IO09","IO09",null,"SPARE"]
["PS10_5_FIOH4","PS10_5_FIOH4_IO10","IO10",null,"PS10_5CH4_JPE1","JAM PHOTOEYE"]
["PS10_5_FIOH4","PS10_5_FIOH4_IO11","IO11",null,"SPARE"]
["PS10_5_FIOH4","PS10_5_FIOH4_IO12","IO12",null,"PS10_5CH4_S1_PB","START PUSHBUTTON"]
["PS10_5_FIOH4","PS10_5_FIOH4_IO13","IO13",null,"PS10_5CH4_S1_PB_LT","START PUSHBUTTON LIGHT"]
["PS10_5_FIOH4","PS10_5_FIOH4_IO14","IO14",null,"SPARE"]
["PS10_5_FIOH4","PS10_5_FIOH4_IO15","IO15",null,"SPARE"]
["PS11_1_FIO1","PS11_1_FIO1_IO00","IO00",null,"PS11_1_BCN1_A","AMBER BEACON LIGHT"]
["PS11_1_FIO1","PS11_1_FIO1_IO01","IO01",null,"PS11_1_BCN1_R","RED BEACON LIGHT"]
["PS11_1_FIO1","PS11_1_FIO1_IO02","IO02",null,"PS11_1_JPE3","JAM PHOTOEYE"]
["PS11_1_FIO1","PS11_1_FIO1_IO03","IO03",null,"SPARE"]
["PS11_1_FIO1","PS11_1_FIO1_IO04","IO04",null,"PS11_1_JPE4","JAM PHOTOEYE"]
["PS11_1_FIO1","PS11_1_FIO1_IO05","IO05",null,"SPARE"]
["PS11_1_FIO1","PS11_1_FIO1_IO06","IO06",null,"PS11_1_JR1_PB","JAM RESET PUSHBUTTON"]
["PS11_1_FIO1","PS11_1_FIO1_IO07","IO07",null,"PS11_1_JR1_PB_LT","JAM RESET PUSHBUTTON LIGHT"]
["PS11_1_FIO1","PS11_1_FIO1_IO08","IO08",null,"PS11_1_JR2_PB","JAM RESET PUSHBUTTON"]
["PS11_1_FIO1","PS11_1_FIO1_IO09","IO09",null,"PS11_1_JR2_PB_LT","JAM RESET PUSHBUTTON LIGHT"]
["PS11_1_FIO1","PS11_1_FIO1_IO10","IO10",null,"SPARE"]
["PS11_1_FIO1","PS11_1_FIO1_IO11","IO11",null,"SPARE"]
["PS11_1_FIO1","PS11_1_FIO1_IO12","IO12",null,"SPARE"]
["PS11_1_FIO1","PS11_1_FIO1_IO13","IO13",null,"SPARE"]
["PS11_1_FIO1","PS11_1_FIO1_IO14","IO14",null,"PS11_1_FIOH1","HUB ARMOR BLOCK"]
["PS11_1_FIO1","PS11_1_FIO1_IO15","IO15",null,"SPARE"]
["PS11_1_FIOH1","PS11_1_FIOH1_IO00","IO00",null,"ULC5_3_JR1_PB","JAM RESET PUSHBUTTON"]
["PS11_1_FIOH1","PS11_1_FIOH1_IO01","IO01",null,"ULC5_3_JR1_PB_LT","JAM RESET PUSHBUTTON LIGHT"]
["PS11_1_FIOH1","PS11_1_FIOH1_IO02","IO02",null,"ULC5_3_SS1_SPB","SS STATION START PUSHBUTTON"]
["PS11_1_FIOH1","PS11_1_FIOH1_IO03","IO03",null,"ULC5_3_SS1_STPB","SS STATION STOP PUSHBUTTON"]
["PS11_1_FIOH1","PS11_1_FIOH1_IO04","IO04",null,"ULC5_3_SS1_STPB_LT","SS STATION STOP PUSHBUTTON LIGHT"]
["PS11_1_FIOH1","PS11_1_FIOH1_IO05","IO05",null,"SPARE"]
["PS11_1_FIOH1","PS11_1_FIOH1_IO06","IO06",null,"ULC5_3_SS2_SPB","SS STATION START PUSHBUTTON"]
["PS11_1_FIOH1","PS11_1_FIOH1_IO07","IO07",null,"ULC5_3_SS2_STPB","SS STATION STOP PUSHBUTTON"]
["PS11_1_FIOH1","PS11_1_FIOH1_IO08","IO08",null,"ULC5_3_SS2_STPB_LT","SS STATION STOP PUSHBUTTON LIGHT"]
["PS11_1_FIOH1","PS11_1_FIOH1_IO09","IO09",null,"SPARE"]
["PS11_1_FIOH1","PS11_1_FIOH1_IO10","IO10",null,"ULC6_3_JR1_PB","JAM RESET PUSHBUTTON"]
["PS11_1_FIOH1","PS11_1_FIOH1_IO11","IO11",null,"ULC6_3_JR1_PB_LT","JAM RESET PUSHBUTTON LIGHT"]
["PS11_1_FIOH1","PS11_1_FIOH1_IO12","IO12",null,"ULC6_3_SS2_SPB","SS STATION START PUSHBUTTON"]
["PS11_1_FIOH1","PS11_1_FIOH1_IO13","IO13",null,"ULC6_3_SS2_STPB","SS STATION STOP PUSHBUTTON"]
["PS11_1_FIOH1","PS11_1_FIOH1_IO14","IO14",null,"ULC6_3_SS2_STPB_LT","SS STATION STOP PUSHBUTTON LIGHT"]
["PS11_1_FIOH1","PS11_1_FIOH1_IO15","IO15",null,"SPARE"]
["PS11_11_FIO1","PS11_11_FIO1_IO00","IO00",null,"PS11_11_BCN1_R","RED BEACON LIGHT"]
["PS11_11_FIO1","PS11_11_FIO1_IO01","IO01",null,"PS11_11_BCN2_A","AMBER BEACON LIGHT"]
["PS11_11_FIO1","PS11_11_FIO1_IO02","IO02",null,"PS11_11_BCN3_A","AMBER BEACON LIGHT"]
["PS11_11_FIO1","PS11_11_FIO1_IO03","IO03",null,"PS11_11_BCN4_A","AMBER BEACON LIGHT"]
["PS11_11_FIO1","PS11_11_FIO1_IO04","IO04",null,"PS11_11_JPE4","JAM PHOTOEYE"]
["PS11_11_FIO1","PS11_11_FIO1_IO05","IO05",null,"PS11_11_JPE5","JAM PHOTOEYE"]
["PS11_11_FIO1","PS11_11_FIO1_IO06","IO06",null,"PS11_11_JPE6","JAM PHOTOEYE"]
["PS11_11_FIO1","PS11_11_FIO1_IO07","IO07",null,"PS11_11_JPE7","JAM PHOTOEYE"]
["PS11_11_FIO1","PS11_11_FIO1_IO08","IO08",null,"PS11_11_JR1_PB","JAM RESET PUSHBUTTON"]
["PS11_11_FIO1","PS11_11_FIO1_IO09","IO09",null,"PS11_11_JR1_PB_LT","JAM RESET PUSHBUTTON LIGHT"]
["PS11_11_FIO1","PS11_11_FIO1_IO10","IO10",null,"PS11_11_JR2_PB","JAM RESET PUSHBUTTON"]
["PS11_11_FIO1","PS11_11_FIO1_IO11","IO11",null,"PS11_11_JR2_PB_LT","JAM RESET PUSHBUTTON LIGHT"]
["PS11_11_FIO1","PS11_11_FIO1_IO12","IO12",null,"PS11_11_FIOH1","HUB ARMOR BLOCK"]
["PS11_11_FIO1","PS11_11_FIO1_IO13","IO13",null,"SPARE"]
["PS11_11_FIO1","PS11_11_FIO1_IO14","IO14",null,"PS11_11_FIOH2","HUB ARMOR BLOCK"]
["PS11_11_FIO1","PS11_11_FIO1_IO15","IO15",null,"SPARE"]
["PS11_11_FIO2","PS11_11_FIO2_IO00","IO00",null,"PS11_11CH3_S1_PB","START PUSHBUTTON"]
["PS11_11_FIO2","PS11_11_FIO2_IO01","IO01",null,"PS11_11CH3_S1_PB_LT","START PUSHBUTTON LIGHT"]
["PS11_11_FIO2","PS11_11_FIO2_IO02","IO02",null,"PS11_11DIV3_PX1","LIMIT SWITCH"]
["PS11_11_FIO2","PS11_11_FIO2_IO03","IO03",null,"SPARE"]
["PS11_11_FIO2","PS11_11_FIO2_IO04","IO04",null,"PS11_11DIV3_PX2","LIMIT SWITCH"]
["PS11_11_FIO2","PS11_11_FIO2_IO05","IO05",null,"SPARE"]
["PS11_11_FIO2","PS11_11_FIO2_IO06","IO06",null,"PS11_11DIV3_SOL1","SOLENOID VALVE"]
["PS11_11_FIO2","PS11_11_FIO2_IO07","IO07",null,"SPARE"]
["PS11_11_FIO2","PS11_11_FIO2_IO08","IO08",null,"PS11_11DIV3_SOL2","SOLENOID VALVE"]
["PS11_11_FIO2","PS11_11_FIO2_IO09","IO09",null,"SPARE"]
["PS11_11_FIO2","PS11_11_FIO2_IO10","IO10",null,"PS11_11_ENC1","ENCODER"]
["PS11_11_FIO2","PS11_11_FIO2_IO11","IO11",null,"SPARE"]
["PS11_11_FIO2","PS11_11_FIO2_IO12","IO12",null,"PS11_11_JPE2","JAM PHOTOEYE"]
["PS11_11_FIO2","PS11_11_FIO2_IO13","IO13",null,"SPARE"]
["PS11_11_FIO2","PS11_11_FIO2_IO14","IO14",null,"PS11_11_JPE3","JAM PHOTOEYE"]
["PS11_11_FIO2","PS11_11_FIO2_IO15","IO15",null,"SPARE"]
["PS11_11_FIO3","PS11_11_FIO3_IO00","IO00",null,"PS11_11CH5_S1_PB","START PUSHBUTTON"]
["PS11_11_FIO3","PS11_11_FIO3_IO01","IO01",null,"PS11_11CH5_S1_PB_LT","START PUSHBUTTON LIGHT"]
["PS11_11_FIO3","PS11_11_FIO3_IO02","IO02",null,"PS11_11DIV5_PX1","LIMIT SWITCH"]
["PS11_11_FIO3","PS11_11_FIO3_IO03","IO03",null,"SPARE"]
["PS11_11_FIO3","PS11_11_FIO3_IO04","IO04",null,"PS11_11DIV5_PX2","LIMIT SWITCH"]
["PS11_11_FIO3","PS11_11_FIO3_IO05","IO05",null,"SPARE"]
["PS11_11_FIO3","PS11_11_FIO3_IO06","IO06",null,"PS11_11DIV5_SOL1","SOLENOID VALVE"]
["PS11_11_FIO3","PS11_11_FIO3_IO07","IO07",null,"SPARE"]
["PS11_11_FIO3","PS11_11_FIO3_IO08","IO08",null,"PS11_11DIV5_SOL2","SOLENOID VALVE"]
["PS11_11_FIO3","PS11_11_FIO3_IO09","IO09",null,"SPARE"]
["PS11_11_FIO3","PS11_11_FIO3_IO10","IO10",null,"SPARE"]
["PS11_11_FIO3","PS11_11_FIO3_IO11","IO11",null,"SPARE"]
["PS11_11_FIO3","PS11_11_FIO3_IO12","IO12",null,"PS11_11_FIOH5","HUB ARMOR BLOCK"]
["PS11_11_FIO3","PS11_11_FIO3_IO13","IO13",null,"SPARE"]
["PS11_11_FIO3","PS11_11_FIO3_IO14","IO14",null,"PS11_11_FIOH6","HUB ARMOR BLOCK"]
["PS11_11_FIO3","PS11_11_FIO3_IO15","IO15",null,"SPARE"]
["PS11_11_FIOH1","PS11_11_FIOH1_IO00","IO00",null,"PS11_11_JR3_PB","JAM RESET PUSHBUTTON"]
["PS11_11_FIOH1","PS11_11_FIOH1_IO01","IO01",null,"PS11_11_JR3_PB_LT","JAM RESET PUSHBUTTON LIGHT"]
["PS11_11_FIOH1","PS11_11_FIOH1_IO02","IO02",null,"PS11_11_PS1"]
["PS11_11_FIOH1","PS11_11_FIOH1_IO03","IO03",null,"SPARE"]
["PS11_11_FIOH1","PS11_11_FIOH1_IO04","IO04",null,"PS11_11_S1_PB","START PUSHBUTTON"]
["PS11_11_FIOH1","PS11_11_FIOH1_IO05","IO05",null,"PS11_11_S1_PB_LT","START PUSHBUTTON LIGHT"]
["PS11_11_FIOH1","PS11_11_FIOH1_IO06","IO06",null,"PS11_11_JPE1","JAM PHOTOEYE"]
["PS11_11_FIOH1","PS11_11_FIOH1_IO07","IO07",null,"PS11_11CH1_BCN1_A","AMBER BEACON LIGHT"]
["PS11_11_FIOH1","PS11_11_FIOH1_IO08","IO08",null,"PS11_11CH1_BCN1_B","BLUE BEACON LIGHT"]
["PS11_11_FIOH1","PS11_11_FIOH1_IO09","IO09",null,"PS11_11CH1_BCN1_G","GREEN BEACON LIGHT"]
["PS11_11_FIOH1","PS11_11_FIOH1_IO10","IO10",null,"PS11_11CH1_FPE1","FULL PHOTOEYE"]
["PS11_11_FIOH1","PS11_11_FIOH1_IO11","IO11",null,"PS11_11CH1_FPE2","FULL PHOTOEYE"]
["PS11_11_FIOH1","PS11_11_FIOH1_IO12","IO12",null,"PS11_11CH1_JPE1","JAM PHOTOEYE"]
["PS11_11_FIOH1","PS11_11_FIOH1_IO13","IO13",null,"PS11_11CH1_S1_PB","START PUSHBUTTON"]
["PS11_11_FIOH1","PS11_11_FIOH1_IO14","IO14",null,"PS11_11CH1_S1_PB_LT","START PUSHBUTTON LIGHT"]
["PS11_11_FIOH1","PS11_11_FIOH1_IO15","IO15",null,"SPARE"]
["PS11_11_FIOH2","PS11_11_FIOH2_IO00","IO00",null,"PS11_11CH2_BCN1_A","AMBER BEACON LIGHT"]
["PS11_11_FIOH2","PS11_11_FIOH2_IO01","IO01",null,"PS11_11CH2_BCN1_B","BLUE BEACON LIGHT"]
["PS11_11_FIOH2","PS11_11_FIOH2_IO02","IO02",null,"PS11_11CH2_BCN1_G","GREEN BEACON LIGHT"]
["PS11_11_FIOH2","PS11_11_FIOH2_IO03","IO03",null,"PS11_11CH2_JPE1","JAM PHOTOEYE"]
["PS11_11_FIOH2","PS11_11_FIOH2_IO04","IO04",null,"PS11_11CH2_FPE1","FULL PHOTOEYE"]
["PS11_11_FIOH2","PS11_11_FIOH2_IO05","IO05",null,"PS11_11CH2_FPE2","FULL PHOTOEYE"]
["PS11_11_FIOH2","PS11_11_FIOH2_IO06","IO06",null,"PS11_11CH2_S1_PB","START PUSHBUTTON"]
["PS11_11_FIOH2","PS11_11_FIOH2_IO07","IO07",null,"PS11_11CH2_S1_PB_LT","START PUSHBUTTON LIGHT"]
["PS11_11_FIOH2","PS11_11_FIOH2_IO08","IO08",null,"PS11_11DIV1_PX1","LIMIT SWITCH"]
["PS11_11_FIOH2","PS11_11_FIOH2_IO09","IO09",null,"PS11_11DIV1_PX2","LIMIT SWITCH"]
["PS11_11_FIOH2","PS11_11_FIOH2_IO10","IO10",null,"PS11_11DIV1_SOL1","SOLENOID VALVE"]
["PS11_11_FIOH2","PS11_11_FIOH2_IO11","IO11",null,"PS11_11DIV1_SOL2","SOLENOID VALVE"]
["PS11_11_FIOH2","PS11_11_FIOH2_IO12","IO12",null,"PS11_11DIV2_PX1","LIMIT SWITCH"]
["PS11_11_FIOH2","PS11_11_FIOH2_IO13","IO13",null,"PS11_11DIV2_PX2","LIMIT SWITCH"]
["PS11_11_FIOH2","PS11_11_FIOH2_IO14","IO14",null,"PS11_11DIV2_SOL1","SOLENOID VALVE"]
["PS11_11_FIOH2","PS11_11_FIOH2_IO15","IO15",null,"PS11_11DIV2_SOL2","SOLENOID VALVE"]
["PS11_11_FIOH3","PS11_11_FIOH3_IO00","IO00",null,"PS11_11CH3_BCN1_G","GREEN BEACON LIGHT"]
["PS11_11_FIOH3","PS11_11_FIOH3_IO01","IO01",null,"SPARE"]
["PS11_11_FIOH3","PS11_11_FIOH3_IO02","IO02",null,"PS11_11CH3_BCN2_A","AMBER BEACON LIGHT"]
["PS11_11_FIOH3","PS11_11_FIOH3_IO03","IO03",null,"SPARE"]
["PS11_11_FIOH3","PS11_11_FIOH3_IO04","IO04",null,"PS11_11CH3_BCN3_B","BLUE BEACON LIGHT"]
["PS11_11_FIOH3","PS11_11_FIOH3_IO05","IO05",null,"SPARE"]
["PS11_11_FIOH3","PS11_11_FIOH3_IO06","IO06",null,"PS11_11CH3_JPE1","JAM PHOTOEYE"]
["PS11_11_FIOH3","PS11_11_FIOH3_IO07","IO07",null,"SPARE"]
["PS11_11_FIOH3","PS11_11_FIOH3_IO08","IO08",null,"PS11_11CH3_FPE1","FULL PHOTOEYE"]
["PS11_11_FIOH3","PS11_11_FIOH3_IO09","IO09",null,"SPARE"]
["PS11_11_FIOH3","PS11_11_FIOH3_IO10","IO10",null,"PS11_11CH3_FPE2","FULL PHOTOEYE"]
["PS11_11_FIOH3","PS11_11_FIOH3_IO11","IO11",null,"SPARE"]
["PS11_11_FIOH3","PS11_11_FIOH3_IO12","IO12",null,"SPARE"]
["PS11_11_FIOH3","PS11_11_FIOH3_IO13","IO13",null,"SPARE"]
["PS11_11_FIOH3","PS11_11_FIOH3_IO14","IO14",null,"SPARE"]
["PS11_11_FIOH3","PS11_11_FIOH3_IO15","IO15",null,"SPARE"]
["PS11_11_FIOH4","PS11_11_FIOH4_IO00","IO00",null,"PS11_11CH4_BCN1_A","AMBER BEACON LIGHT"]
["PS11_11_FIOH4","PS11_11_FIOH4_IO01","IO01",null,"SPARE"]
["PS11_11_FIOH4","PS11_11_FIOH4_IO02","IO02",null,"PS11_11CH4_BCN1_B","BLUE BEACON LIGHT"]
["PS11_11_FIOH4","PS11_11_FIOH4_IO03","IO03",null,"SPARE"]
["PS11_11_FIOH4","PS11_11_FIOH4_IO04","IO04",null,"PS11_11CH4_BCN1_G","GREEN BEACON LIGHT"]
["PS11_11_FIOH4","PS11_11_FIOH4_IO05","IO05",null,"SPARE"]
["PS11_11_FIOH4","PS11_11_FIOH4_IO06","IO06",null,"PS11_11CH4_FPE1","FULL PHOTOEYE"]
["PS11_11_FIOH4","PS11_11_FIOH4_IO07","IO07",null,"PS11_11CH4_FPE2","FULL PHOTOEYE"]
["PS11_11_FIOH4","PS11_11_FIOH4_IO08","IO08",null,"PS11_11CH4_JPE1","JAM PHOTOEYE"]
["PS11_11_FIOH4","PS11_11_FIOH4_IO09","IO09",null,"SPARE"]
["PS11_11_FIOH4","PS11_11_FIOH4_IO10","IO10",null,"PS11_11CH4_S1_PB","START PUSHBUTTON"]
["PS11_11_FIOH4","PS11_11_FIOH4_IO11","IO11",null,"PS11_11CH4_S1_PB_LT","START PUSHBUTTON LIGHT"]
["PS11_11_FIOH4","PS11_11_FIOH4_IO12","IO12",null,"PS11_11DIV4_PX1","LIMIT SWITCH"]
["PS11_11_FIOH4","PS11_11_FIOH4_IO13","IO13",null,"PS11_11DIV4_PX2","LIMIT SWITCH"]
["PS11_11_FIOH4","PS11_11_FIOH4_IO14","IO14",null,"PS11_11DIV4_SOL1","SOLENOID VALVE"]
["PS11_11_FIOH4","PS11_11_FIOH4_IO15","IO15",null,"PS11_11DIV4_SOL2","SOLENOID VALVE"]
["PS11_11_FIOH5","PS11_11_FIOH5_IO00","IO00",null,"PS11_11CH5_BCN1_A","AMBER BEACON LIGHT"]
["PS11_11_FIOH5","PS11_11_FIOH5_IO01","IO01",null,"SPARE"]
["PS11_11_FIOH5","PS11_11_FIOH5_IO02","IO02",null,"PS11_11CH5_BCN1_B","BLUE BEACON LIGHT"]
["PS11_11_FIOH5","PS11_11_FIOH5_IO03","IO03",null,"SPARE"]
["PS11_11_FIOH5","PS11_11_FIOH5_IO04","IO04",null,"PS11_11CH5_BCN1_G","GREEN BEACON LIGHT"]
["PS11_11_FIOH5","PS11_11_FIOH5_IO05","IO05",null,"SPARE"]
["PS11_11_FIOH5","PS11_11_FIOH5_IO06","IO06",null,"PS11_11CH5_JPE1","JAM PHOTOEYE"]
["PS11_11_FIOH5","PS11_11_FIOH5_IO07","IO07",null,"SPARE"]
["PS11_11_FIOH5","PS11_11_FIOH5_IO08","IO08",null,"PS11_11CH5_FPE1","FULL PHOTOEYE"]
["PS11_11_FIOH5","PS11_11_FIOH5_IO09","IO09",null,"SPARE"]
["PS11_11_FIOH5","PS11_11_FIOH5_IO10","IO10",null,"PS11_11CH5_FPE2","FULL PHOTOEYE"]
["PS11_11_FIOH5","PS11_11_FIOH5_IO11","IO11",null,"SPARE"]
["PS11_11_FIOH5","PS11_11_FIOH5_IO12","IO12",null,"SPARE"]
["PS11_11_FIOH5","PS11_11_FIOH5_IO13","IO13",null,"SPARE"]
["PS11_11_FIOH5","PS11_11_FIOH5_IO14","IO14",null,"SPARE"]
["PS11_11_FIOH5","PS11_11_FIOH5_IO15","IO15",null,"SPARE"]
["PS11_11_FIOH6","PS11_11_FIOH6_IO00","IO00",null,"PS11_11CH6_BCN1_A","AMBER BEACON LIGHT"]
["PS11_11_FIOH6","PS11_11_FIOH6_IO01","IO01",null,"PS11_11CH6_BCN1_B","BLUE BEACON LIGHT"]
["PS11_11_FIOH6","PS11_11_FIOH6_IO02","IO02",null,"PS11_11CH6_BCN1_G","GREEN BEACON LIGHT"]
["PS11_11_FIOH6","PS11_11_FIOH6_IO03","IO03",null,"PS11_11CH6_JPE1","JAM PHOTOEYE"]
["PS11_11_FIOH6","PS11_11_FIOH6_IO04","IO04",null,"PS11_11CH6_FPE1","FULL PHOTOEYE"]
["PS11_11_FIOH6","PS11_11_FIOH6_IO05","IO05",null,"PS11_11CH6_FPE2","FULL PHOTOEYE"]
["PS11_11_FIOH6","PS11_11_FIOH6_IO06","IO06",null,"PS11_11CH6_S1_PB","START PUSHBUTTON"]
["PS11_11_FIOH6","PS11_11_FIOH6_IO07","IO07",null,"PS11_11CH6_S1_PB_LT","START PUSHBUTTON LIGHT"]
["PS11_11_FIOH6","PS11_11_FIOH6_IO08","IO08",null,"PS11_11DIV6_PX1","LIMIT SWITCH"]
["PS11_11_FIOH6","PS11_11_FIOH6_IO09","IO09",null,"SPARE"]
["PS11_11_FIOH6","PS11_11_FIOH6_IO10","IO10",null,"PS11_11DIV6_PX2","LIMIT SWITCH"]
["PS11_11_FIOH6","PS11_11_FIOH6_IO11","IO11",null,"SPARE"]
["PS11_11_FIOH6","PS11_11_FIOH6_IO12","IO12",null,"PS11_11DIV6_SOL1","SOLENOID VALVE"]
["PS11_11_FIOH6","PS11_11_FIOH6_IO13","IO13",null,"PS11_11DIV6_SOL2","SOLENOID VALVE"]
["PS11_11_FIOH6","PS11_11_FIOH6_IO14","IO14",null,"PS11_12CH_FPE1","FULL PHOTOEYE"]
["PS11_11_FIOH6","PS11_11_FIOH6_IO15","IO15",null,"SPARE"]
["PS11_3_FIO1","PS11_3_FIO1_IO00","IO00",null,"PS11_3_BCN2_R","RED BEACON LIGHT"]
["PS11_3_FIO1","PS11_3_FIO1_IO01","IO01",null,"SPARE"]
["PS11_3_FIO1","PS11_3_FIO1_IO02","IO02",null,"PS11_3_S1_PB","START PUSHBUTTON"]
["PS11_3_FIO1","PS11_3_FIO1_IO03","IO03",null,"PS11_3_S1_PB_LT","START PUSHBUTTON LIGHT"]
["PS11_3_FIO1","PS11_3_FIO1_IO04","IO04",null,"PS11_3_S2_PB","START PUSHBUTTON"]
["PS11_3_FIO1","PS11_3_FIO1_IO05","IO05",null,"PS11_3_S2_PB_LT","START PUSHBUTTON LIGHT"]
["PS11_3_FIO1","PS11_3_FIO1_IO06","IO06",null,"SPARE"]
["PS11_3_FIO1","PS11_3_FIO1_IO07","IO07",null,"SPARE"]
["PS11_3_FIO1","PS11_3_FIO1_IO08","IO08",null,"SPARE"]
["PS11_3_FIO1","PS11_3_FIO1_IO09","IO09",null,"SPARE"]
["PS11_3_FIO1","PS11_3_FIO1_IO10","IO10",null,"SPARE"]
["PS11_3_FIO1","PS11_3_FIO1_IO11","IO11",null,"SPARE"]
["PS11_3_FIO1","PS11_3_FIO1_IO12","IO12",null,"SPARE"]
["PS11_3_FIO1","PS11_3_FIO1_IO13","IO13",null,"SPARE"]
["PS11_3_FIO1","PS11_3_FIO1_IO14","IO14",null,"SPARE"]
["PS11_3_FIO1","PS11_3_FIO1_IO15","IO15",null,"SPARE"]
["PS11_4_FIO1","PS11_4_FIO1_IO00","IO00",null,"PS11_4_BCN1_A","AMBER BEACON LIGHT"]
["PS11_4_FIO1","PS11_4_FIO1_IO01","IO01",null,"PS11_4_BCN1_R","RED BEACON LIGHT"]
["PS11_4_FIO1","PS11_4_FIO1_IO02","IO02",null,"PS11_4_BCN2_R","RED BEACON LIGHT"]
["PS11_4_FIO1","PS11_4_FIO1_IO03","IO03",null,"SPARE"]
["PS11_4_FIO1","PS11_4_FIO1_IO04","IO04",null,"PS11_4_S1_PB","START PUSHBUTTON"]
["PS11_4_FIO1","PS11_4_FIO1_IO05","IO05",null,"PS11_4_S1_PB_LT","START PUSHBUTTON LIGHT"]
["PS11_4_FIO1","PS11_4_FIO1_IO06","IO06",null,"PS11_4_S2_PB","START PUSHBUTTON"]
["PS11_4_FIO1","PS11_4_FIO1_IO07","IO07",null,"PS11_4_S2_PB_LT","START PUSHBUTTON LIGHT"]
["PS11_4_FIO1","PS11_4_FIO1_IO08","IO08",null,"SPARE"]
["PS11_4_FIO1","PS11_4_FIO1_IO09","IO09",null,"SPARE"]
["PS11_4_FIO1","PS11_4_FIO1_IO10","IO10",null,"SPARE"]
["PS11_4_FIO1","PS11_4_FIO1_IO11","IO11",null,"SPARE"]
["PS11_4_FIO1","PS11_4_FIO1_IO12","IO12",null,"SPARE"]
["PS11_4_FIO1","PS11_4_FIO1_IO13","IO13",null,"SPARE"]
["PS11_4_FIO1","PS11_4_FIO1_IO14","IO14",null,"SPARE"]
["PS11_4_FIO1","PS11_4_FIO1_IO15","IO15",null,"SPARE"]
["PS11_7_FIO1","PS11_7_FIO1_IO00","IO00",null,"PS11_7_BCN1_R","RED BEACON LIGHT"]
["PS11_7_FIO1","PS11_7_FIO1_IO01","IO01",null,"SPARE"]
["PS11_7_FIO1","PS11_7_FIO1_IO02","IO02",null,"PS11_7_BCN2_R","RED BEACON LIGHT"]
["PS11_7_FIO1","PS11_7_FIO1_IO03","IO03",null,"SPARE"]
["PS11_7_FIO1","PS11_7_FIO1_IO04","IO04",null,"PS11_7_S1_PB","START PUSHBUTTON"]
["PS11_7_FIO1","PS11_7_FIO1_IO05","IO05",null,"PS11_7_S1_PB_LT","START PUSHBUTTON LIGHT"]
["PS11_7_FIO1","PS11_7_FIO1_IO06","IO06",null,"PS11_7_S2_PB","START PUSHBUTTON"]
["PS11_7_FIO1","PS11_7_FIO1_IO07","IO07",null,"PS11_7_S2_PB_LT","START PUSHBUTTON LIGHT"]
["PS11_7_FIO1","PS11_7_FIO1_IO08","IO08",null,"SPARE"]
["PS11_7_FIO1","PS11_7_FIO1_IO09","IO09",null,"SPARE"]
["PS11_7_FIO1","PS11_7_FIO1_IO10","IO10",null,"SPARE"]
["PS11_7_FIO1","PS11_7_FIO1_IO11","IO11",null,"SPARE"]
["PS11_7_FIO1","PS11_7_FIO1_IO12","IO12",null,"SPARE"]
["PS11_7_FIO1","PS11_7_FIO1_IO13","IO13",null,"SPARE"]
["PS11_7_FIO1","PS11_7_FIO1_IO14","IO14",null,"SPARE"]
["PS11_7_FIO1","PS11_7_FIO1_IO15","IO15",null,"SPARE"]
["FL1014_FIOH1","FL1014_FIOH1_IO8","IO8",null,"FL1014_2_BCN1_A","AMBER BEACON LIGHT"]
["FL1014_FIOH1","FL1014_FIOH1_IO9","IO9",null,"FL1014_2_BCN1_B","BLUE BEACON LIGHT"]
["FL1014_FIOH1","FL1014_FIOH1_IO10","IO10",null,"FL1014_2_JR1_PB","JAM RESET PUSHBUTTON"]
["FL1014_FIOH1","FL1014_FIOH1_IO11","IO11",null,"FL1014_2_JR1_PB_LT","JAM RESET PUSHBUTTON LIGHT"]
["FL1014_FIOH1","FL1014_FIOH1_IO12","IO12",null,"FL1014_1CH_PE1"]
["FL1014_FIOH1","FL1014_FIOH1_IO13","IO13",null,"SPARE"]
["FL1014_FIOH1","FL1014_FIOH1_IO14","IO14",null,"SPARE"]
["FL1014_FIOH1","FL1014_FIOH1_IO15","IO15",null,"SPARE"]
["S011020_FIOH1","S011020_FIOH1_IO8","IO8",null,"FL1018_2_BCN1_A","AMBER BEACON LIGHT"]
["S011020_FIOH2","S011020_FIOH2_IO9","IO9",null,"FL1018_2_BCN1_B","BLUE BEACON LIGHT"]
["S011020_FIOH3","S011020_FIOH3_IO10","IO10",null,"FL1018_2_JR1_PB","JAM RESET PUSHBUTTON"]
["S011020_FIOH4","S011020_FIOH4_IO11","IO11",null,"FL1018_2_JR1_PB_LT","JAM RESET PUSHBUTTON LIGHT"]
["S011020_FIOH5","S011020_FIOH5_IO12","IO12",null,"FL1018_1CH_PE1"]
["S011020_FIOH6","S011020_FIOH6_IO13","IO13",null,"SPARE"]
["S011020_FIOH7","S011020_FIOH7_IO14","IO14",null,"SPARE"]
["S011020_FIOH8","S011020_FIOH8_IO15","IO15",null,"SPARE"]
["FL1022_FIOH1","FL1022_FIOH1_IO8","IO8",null,"FL1022_2_BCN1_A","AMBER BEACON LIGHT"]
["FL1022_FIOH1","FL1022_FIOH1_IO9","IO9",null,"FL1022_2_BCN1_B","BLUE BEACON LIGHT"]
["FL1022_FIOH1","FL1022_FIOH1_IO10","IO10",null,"FL1022_2_JR1_PB","JAM RESET PUSHBUTTON"]
["FL1022_FIOH1","FL1022_FIOH1_IO11","IO11",null,"FL1022_2_JR1_PB_LT","JAM RESET PUSHBUTTON LIGHT"]
["FL1022_FIOH1","FL1022_FIOH1_IO12","IO12",null,"FL1022_1CH_PE1"]
["FL1022_FIOH1","FL1022_FIOH1_IO13","IO13",null,"SPARE"]
["FL1022_FIOH1","FL1022_FIOH1_IO14","IO14",null,"SPARE"]
["FL1022_FIOH1","FL1022_FIOH1_IO15","IO15",null,"SPARE"]
["FL1026_FIOH1","FL1026_FIOH1_IO8","IO8",null,"FL1026_2_BCN1_A","AMBER BEACON LIGHT"]
["FL1026_FIOH1","FL1026_FIOH1_IO9","IO9",null,"FL1026_2_BCN1_B","BLUE BEACON LIGHT"]
["FL1026_FIOH1","FL1026_FIOH1_IO10","IO10",null,"FL1026_2_JR1_PB","JAM RESET PUSHBUTTON"]
["FL1026_FIOH1","FL1026_FIOH1_IO11","IO11",null,"FL1026_2_JR1_PB_LT","JAM RESET PUSHBUTTON LIGHT"]
["FL1026_FIOH1","FL1026_FIOH1_IO12","IO12",null,"FL1026_1CH_PE1"]
["FL1026_FIOH1","FL1026_FIOH1_IO13","IO13",null,"SPARE"]
["FL1026_FIOH1","FL1026_FIOH1_IO14","IO14",null,"SPARE"]
["FL1026_FIOH1","FL1026_FIOH1_IO15","IO15",null,"SPARE"]
["FL1034_FIOH1","FL1034_FIOH1_IO8","IO8",null,"FL1034_2_BCN1_A","AMBER BEACON LIGHT"]
["FL1034_FIOH1","FL1034_FIOH1_IO9","IO9",null,"FL1034_2_BCN1_B","BLUE BEACON LIGHT"]
["FL1034_FIOH1","FL1034_FIOH1_IO10","IO10",null,"FL1034_2_JR1_PB","JAM RESET PUSHBUTTON"]
["FL1034_FIOH1","FL1034_FIOH1_IO11","IO11",null,"FL1034_2_JR1_PB_LT","JAM RESET PUSHBUTTON LIGHT"]
["FL1034_FIOH1","FL1034_FIOH1_IO12","IO12",null,"FL1034_1CH_PE1"]
["FL1034_FIOH1","FL1034_FIOH1_IO13","IO13",null,"SPARE"]
["FL1034_FIOH1","FL1034_FIOH1_IO14","IO14",null,"SPARE"]
["FL1034_FIOH1","FL1034_FIOH1_IO15","IO15",null,"SPARE"]
["S011040_FIOH1","S011040_FIOH1_IO8","IO8",null,"FL1038_2_BCN1_A","AMBER BEACON LIGHT"]
["S011040_FIOH1","S011040_FIOH1_IO9","IO9",null,"FL1038_2_BCN1_B","BLUE BEACON LIGHT"]
["S011040_FIOH1","S011040_FIOH1_IO10","IO10",null,"FL1038_2_JR1_PB","JAM RESET PUSHBUTTON"]
["S011040_FIOH1","S011040_FIOH1_IO11","IO11",null,"FL1038_2_JR1_PB_LT","JAM RESET PUSHBUTTON LIGHT"]
["S011040_FIOH1","S011040_FIOH1_IO12","IO12",null,"FL1038_1CH_PE1"]
["S011040_FIOH1","S011040_FIOH1_IO13","IO13",null,"SPARE"]
["S011040_FIOH1","S011040_FIOH1_IO14","IO14",null,"SPARE"]
["S011040_FIOH1","S011040_FIOH1_IO15","IO15",null,"SPARE"]
["S013010_FIOH1","S013010_FIOH1_IO8","IO8",null,"FL3012_2_BCN1_A","AMBER BEACON LIGHT"]
["S013010_FIOH1","S013010_FIOH1_IO9","IO9",null,"FL3012_2_BCN1_B","BLUE BEACON LIGHT"]
["S013010_FIOH1","S013010_FIOH1_IO10","IO10",null,"FL3012_2_JR1_PB","JAM RESET PUSHBUTTON"]
["S013010_FIOH1","S013010_FIOH1_IO11","IO11",null,"FL3012_2_JR1_PB_LT","JAM RESET PUSHBUTTON LIGHT"]
["S013010_FIOH1","S013010_FIOH1_IO12","IO12",null,"FL3012_1CH_PE1"]
["S013010_FIOH1","S013010_FIOH1_IO13","IO13",null,"SPARE"]
["S013010_FIOH1","S013010_FIOH1_IO14","IO14",null,"SPARE"]
["S013010_FIOH1","S013010_FIOH1_IO15","IO15",null,"SPARE"]
["FL3016_FIOH1","FL3016_FIOH1_IO8","IO8",null,"FL3016_2_BCN1_A","AMBER BEACON LIGHT"]
["FL3016_FIOH1","FL3016_FIOH1_IO9","IO9",null,"FL3016_2_BCN1_B","BLUE BEACON LIGHT"]
["FL3016_FIOH1","FL3016_FIOH1_IO10","IO10",null,"FL3016_2_JR1_PB","JAM RESET PUSHBUTTON"]
["FL3016_FIOH1","FL3016_FIOH1_IO11","IO11",null,"FL3016_2_JR1_PB_LT","JAM RESET PUSHBUTTON LIGHT"]
["FL3016_FIOH1","FL3016_FIOH1_IO12","IO12",null,"FL3016_1CH_PE1"]
["FL3016_FIOH1","FL3016_FIOH1_IO13","IO13",null,"SPARE"]
["FL3016_FIOH1","FL3016_FIOH1_IO14","IO14",null,"SPARE"]
["FL3016_FIOH1","FL3016_FIOH1_IO15","IO15",null,"SPARE"]
["S013018_FIOH1","S013018_FIOH1IO8","IO8",null,"FL3020_2_BCN1_A","AMBER BEACON LIGHT"]
["S013018_FIOH1","S013018_FIOH1IO9","IO9",null,"FL3020_2_BCN1_B","BLUE BEACON LIGHT"]
["S013018_FIOH1","S013018_FIOH1IO10","IO10",null,"FL3020_2_JR1_PB","JAM RESET PUSHBUTTON"]
["S013018_FIOH1","S013018_FIOH1IO11","IO11",null,"FL3020_2_JR1_PB_LT","JAM RESET PUSHBUTTON LIGHT"]
["S013018_FIOH1","S013018_FIOH1IO12","IO12",null,"FL3020_1CH_PE1"]
["S013018_FIOH1","S013018_FIOH1IO13","IO13",null,"SPARE"]
["S013018_FIOH1","S013018_FIOH1IO14","IO14",null,"SPARE"]
["S013018_FIOH1","S013018_FIOH1IO15","IO15",null,"SPARE"]
["FL3024_FIOH1","FL3024_FIOH1IO8","IO8",null,"FL3024_2_BCN1_A","AMBER BEACON LIGHT"]
["FL3024_FIOH1","FL3024_FIOH1IO9","IO9",null,"FL3024_2_BCN1_B","BLUE BEACON LIGHT"]
["FL3024_FIOH1","FL3024_FIOH1IO10","IO10",null,"FL3024_2_JR1_PB","JAM RESET PUSHBUTTON"]
["FL3024_FIOH1","FL3024_FIOH1IO11","IO11",null,"FL3024_2_JR1_PB_LT","JAM RESET PUSHBUTTON LIGHT"]
["FL3024_FIOH1","FL3024_FIOH1IO12","IO12",null,"FL3024_1CH_PE1"]
["FL3024_FIOH1","FL3024_FIOH1IO13","IO13",null,"SPARE"]
["FL3024_FIOH1","FL3024_FIOH1IO14","IO14",null,"SPARE"]
["FL3024_FIOH1","FL3024_FIOH1IO15","IO15",null,"SPARE"]

{"sheet":"MCM04_DESC_v2","index":7,"n_rows":2212,"n_cols":22,"rows_kept":2212,"cut":false,"hidden":false,"merged":[[61,6,65,6],[66,6,70,6],[71,6,75,6],[76,6,80,6],[31,6,35,6],[36,6,40,6],[41,6,45,6],[46,6,50,6],[51,6,55,6],[56,6,60,6],[26,6,30,6],[1,6,5,6],[6,6,10,6],[11,6,15,6],[16,6,20,6],[21,6,25,6]]}
["TAGNAME","TERM","DESCA","DESCB",null,"CONTROLLERS"]
["PRS3_2A_VFD1","I0","PRS3_2A_VFD1_DISC","DISCONNECT AUX",null,"PRS3_2A_VFD1",600,null,null,{"$f":"_xlfn.CONCAT(F2,\"/\",F3,\"/\",F4,\"/\",F5)","v":"PRS3_2A_VFD1/PRS3_2B_VFD1/PRS3_3A_VFD1/PRS3_3B_VFD1"},null,null,null,null,null,600,"PRS3_2A_VFD1/PRS3_2B_VFD1/PRS3_3A_VFD1/PRS3_3B_VFD1"]
["PRS3_2A_VFD1","I1","SPARE",null,null,"PRS3_2B_VFD1",null,null,null,null,null,null,null,null,null,601,"PRS3_5_VFD1/PRS4_1_VFD1/PRS4_2_VFD1/PS10_1_VFD1"]
["PRS3_2A_VFD1","I2","PRS3_2A_JPE1","JAM PHOTOEYE",null,"PRS3_3A_VFD1",null,null,null,null,null,null,null,null,null,602,"PS10_2_VFD1/PS10_3_VFD1/PS10_5_VFD1/PS10_5_SIO1"]
["PRS3_2A_VFD1","I3","SPARE",null,null,"PRS3_3B_VFD1",null,null,null,null,null,null,null,null,null,603,"PS11_1_VFD1/PS11_2_VFD1/PS11_3_VFD1/PS11_4_VFD1"]
["PRS3_2A_VFD1","IO0","SPARE",null,null,null,null,null,null,null,null,null,null,null,null,604,"PS11_6_VFD1/PS11_7_VFD1/PS11_8_VFD1/PS11_9_VFD1"]
["PRS3_2A_VFD1","IO1","SPARE",null,null,"PRS3_5_VFD1",601,null,null,{"$f":"_xlfn.CONCAT(F7,\"/\",F8,\"/\",F9,\"/\",F10)","v":"PRS3_5_VFD1/PRS4_1_VFD1/PRS4_2_VFD1/PS10_1_VFD1"},null,null,null,null,null,605,"PS11_11_VFD1/PS11_8_SIO1/PS11_8_FIOH1/ULC5_3_VFD1"]
["PRS3_2A_VFD1","SI0","SPARE",null,null,"PRS4_1_VFD1",null,null,null,null,null,null,null,null,null,606,"ULC6_3_VFD1/ULC7_3_VFD1/ULC8_3_VFD1/PRS3_2A_FIO1"]
["PRS3_2A_VFD1","SI1","SPARE",null,null,"PRS4_2_VFD1",null,null,null,null,null,null,null,null,null,607,"PRS3_2B_FIO1/PRS3_4CH_FIO1/PRS4_2_FIO1/PS10_1_FIO1"]
["PRS3_2A_VFD1","SI2","SPARE",null,null,"PS10_1_VFD1",null,null,null,null,null,null,null,null,null,608,"PS10_1_FIOH1/PS10_1_FIOH2/PS10_5_FIO1/PS10_5_FIO2"]
["PRS3_2A_VFD1","SI3","SPARE",null,null,null,null,null,null,null,null,null,null,null,null,609,"PS10_5_FIOH1/PS10_5_FIOH2/PS10_5_FIOH3/PS10_5_FIOH4"]
["PRS3_2A_VFD1","SO0","SPARE",null,null,"PS10_2_VFD1",602,null,null,{"$f":"_xlfn.CONCAT(F12,\"/\",F13,\"/\",F14,\"/\",F15)","v":"PS10_2_VFD1/PS10_3_VFD1/PS10_5_VFD1/PS10_5_SIO1"},null,null,null,null,null,610,"PS11_1_FIO1/PS11_1_FIOH1/PS11_11_FIO1/PS11_11_FIO2"]
["PRS3_2B_VFD1","I0","PRS3_2B_VFD1_DISC","DISCONNECT AUX",null,"PS10_3_VFD1",null,null,null,null,null,null,null,null,null,611,"PS11_11_FIO3/PS11_11_FIOH1/PS11_11_FIOH2/PS11_11_FIOH3"]
["PRS3_2B_VFD1","I1","SPARE",null,null,"PS10_5_VFD1",null,null,null,null,null,null,null,null,null,612,"PS11_11_FIOH4/PS11_11_FIOH5/PS11_11_FIOH6/PS11_3_FIO1"]
["PRS3_2B_VFD1","I2","PRS3_2B_JPE1","JAM PHOTOEYE",null,"PS10_5_SIO1",null,null,null,null,null,null,null,null,null,613,"PS11_4_FIO1/PS11_7_FIO1/FL1014_FIOH1/S011020_FIOH1"]
["PRS3_2B_VFD1","I3","SPARE",null,null,null,null,null,null,null,null,null,null,null,null,614,"FL1022_FIOH1/FL1026_FIOH1/FL1034_FIOH1/S011040_FIOH1"]
["PRS3_2B_VFD1","IO0","SPARE",null,null,"PS11_1_VFD1",603,null,null,{"$f":"_xlfn.CONCAT(F17,\"/\",F18,\"/\",F19,\"/\",F20)","v":"PS11_1_VFD1/PS11_2_VFD1/PS11_3_VFD1/PS11_4_VFD1"},null,null,null,null,null,615,"S013010_FIOH1/FL3016_FIOH1/S013018_FIOH1/FL3024_FIOH1"]
["PRS3_2B_VFD1","IO1","SPARE",null,null,"PS11_2_VFD1"]
["PRS3_2B_VFD1","SI0","SPARE",null,null,"PS11_3_VFD1"]
["PRS3_2B_VFD1","SI1","SPARE",null,null,"PS11_4_VFD1"]
["PRS3_2B_VFD1","SI2","SPARE"]
["PRS3_2B_VFD1","SI3","SPARE",null,null,"PS11_6_VFD1",604,null,null,{"$f":"_xlfn.CONCAT(F22,\"/\",F23,\"/\",F24,\"/\",F25)","v":"PS11_6_VFD1/PS11_7_VFD1/PS11_8_VFD1/PS11_9_VFD1"}]
["PRS3_2B_VFD1","SO0","SPARE",null,null,"PS11_7_VFD1"]
["PRS3_3A_VFD1","I0","PRS3_3A_VFD1_DISC","DISCONNECT AUX",null,"PS11_8_VFD1"]
["PRS3_3A_VFD1","I1","SPARE",null,null,"PS11_9_VFD1"]
["PRS3_3A_VFD1","I2","PRS3_3A_JPE1","JAM PHOTOEYE"]
["PRS3_3A_VFD1","I3","PRS3_3A_JPE2","JAM PHOTOEYE",null,"PS11_11_VFD1",605,null,null,{"$f":"_xlfn.CONCAT(F27,\"/\",F28,\"/\",F29,\"/\",F30)","v":"PS11_11_VFD1/PS11_8_SIO1/PS11_8_FIOH1/ULC5_3_VFD1"}]
["PRS3_3A_VFD1","IO0","PRS3_3A_BCN1_A","AMBER BEACON LIGHT",null,"PS11_8_SIO1"]
["PRS3_3A_VFD1","IO1","PRS3_3A_BCN1_B","BLUE BEACON LIGHT",null,"PS11_8_FIOH1"]
["PRS3_3A_VFD1","SI0","SPARE",null,null,"ULC5_3_VFD1"]
["PRS3_3A_VFD1","SI1","SPARE"]
["PRS3_3A_VFD1","SI2","SPARE",null,null,"ULC6_3_VFD1",606,null,null,{"$f":"_xlfn.CONCAT(F32,\"/\",F33,\"/\",F34,\"/\",F35)","v":"ULC6_3_VFD1/ULC7_3_VFD1/ULC8_3_VFD1/PRS3_2A_FIO1"}]
["PRS3_3A_VFD1","SI3","SPARE",null,null,"ULC7_3_VFD1"]
["PRS3_3A_VFD1","SO0","SPARE",null,null,"ULC8_3_VFD1"]
["PRS3_3B_VFD1","I0","PRS3_3B_VFD1_DISC","DISCONNECT AUX",null,"PRS3_2A_FIO1"]
["PRS3_3B_VFD1","I1","SPARE"]
["PRS3_3B_VFD1","I2","PRS3_3B_JPE1","JAM PHOTOEYE",null,"PRS3_2B_FIO1",607,null,null,{"$f":"_xlfn.CONCAT(F37,\"/\",F38,\"/\",F39,\"/\",F40)","v":"PRS3_2B_FIO1/PRS3_4CH_FIO1/PRS4_2_FIO1/PS10_1_FIO1"}]
["PRS3_3B_VFD1","I3","PRS3_3B_JPE2","JAM PHOTOEYE",null,"PRS3_4CH_FIO1"]
["PRS3_3B_VFD1","IO0","PRS3_3B_BCN1_A","AMBER BEACON LIGHT",null,"PRS4_2_FIO1"]
["PRS3_3B_VFD1","IO1","PRS3_3B_BCN1_B","BLUE BEACON LIGHT",null,"PS10_1_FIO1"]
["PRS3_3B_VFD1","SI0","SPARE"]
["PRS3_3B_VFD1","SI1","SPARE",null,null,"PS10_1_FIOH1",608,null,null,{"$f":"_xlfn.CONCAT(F42,\"/\",F43,\"/\",F44,\"/\",F45)","v":"PS10_1_FIOH1/PS10_1_FIOH2/PS10_5_FIO1/PS10_5_FIO2"}]
["PRS3_3B_VFD1","SI2","SPARE",null,null,"PS10_1_FIOH2"]
["PRS3_3B_VFD1","SI3","SPARE",null,null,"PS10_5_FIO1"]
["PRS3_3B_VFD1","SO0","SPARE",null,null,"PS10_5_FIO2"]
["PRS3_5_VFD1","I0","PRS3_5_VFD1_DISC","DISCONNECT AUX"]
["PRS3_5_VFD1","I1","SPARE",null,null,"PS10_5_FIOH1",609,null,null,{"$f":"_xlfn.CONCAT(F47,\"/\",F48,\"/\",F49,\"/\",F50)","v":"PS10_5_FIOH1/PS10_5_FIOH2/PS10_5_FIOH3/PS10_5_FIOH4"}]
["PRS3_5_VFD1","I2","PRS3_5_JPE1","JAM PHOTOEYE",null,"PS10_5_FIOH2"]
["PRS3_5_VFD1","I3","PRS3_5_JPE2","JAM PHOTOEYE",null,"PS10_5_FIOH3"]
["PRS3_5_VFD1","IO0","SPARE",null,null,"PS10_5_FIOH4"]
["PRS3_5_VFD1","IO1","SPARE"]
["PRS3_5_VFD1","SI0","PRS3_5_EPC1","E-STOP PULLCORD",null,"PS11_1_FIO1",610,null,null,{"$f":"_xlfn.CONCAT(F52,\"/\",F53,\"/\",F54,\"/\",F55)","v":"PS11_1_FIO1/PS11_1_FIOH1/PS11_11_FIO1/PS11_11_FIO2"}]
["PRS3_5_VFD1","SI1","PRS3_5_EPC1_2","E-STOP PULLCORD",null,"PS11_1_FIOH1"]
["PRS3_5_VFD1","SI2","PRS3_5_EPC2","E-STOP PULLCORD",null,"PS11_11_FIO1"]
["PRS3_5_VFD1","SI3","PRS3_5_EPC2_2","E-STOP PULLCORD",null,"PS11_11_FIO2"]
["PRS3_5_VFD1","SO0","SPARE"]
["PRS4_1_VFD1","I0","PRS4_1_VFD1_DISC","DISCONNECT AUX",null,"PS11_11_FIO3",611,null,null,{"$f":"_xlfn.CONCAT(F57,\"/\",F58,\"/\",F59,\"/\",F60)","v":"PS11_11_FIO3/PS11_11_FIOH1/PS11_11_FIOH2/PS11_11_FIOH3"}]
["PRS4_1_VFD1","I1","PRS4_1_ENC1","ENCODER",null,"PS11_11_FIOH1"]
["PRS4_1_VFD1","I2","PRS4_1_JPE1","JAM PHOTOEYE",null,"PS11_11_FIOH2"]
["PRS4_1_VFD1","I3","SPARE",null,null,"PS11_11_FIOH3"]
["PRS4_1_VFD1","IO0","SPARE"]
["PRS4_1_VFD1","IO1","SPARE",null,null,"PS11_11_FIOH4",612,null,null,{"$f":"_xlfn.CONCAT(F62,\"/\",F63,\"/\",F64,\"/\",F65)","v":"PS11_11_FIOH4/PS11_11_FIOH5/PS11_11_FIOH6/PS11_3_FIO1"}]
["PRS4_1_VFD1","SI0","PRS4_1_EPC1","E-STOP PULLCORD",null,"PS11_11_FIOH5"]
["PRS4_1_VFD1","SI1","PRS4_1_EPC1_2","E-STOP PULLCORD",null,"PS11_11_FIOH6"]
["PRS4_1_VFD1","SI2","PRS4_1_EPC2","E-STOP PULLCORD",null,"PS11_3_FIO1"]
["PRS4_1_VFD1","SI3","PRS4_1_EPC2_2","E-STOP PULLCORD"]
["PRS4_1_VFD1","SO0","SPARE",null,null,"PS11_4_FIO1",613,null,null,{"$f":"_xlfn.CONCAT(F67,\"/\",F68,\"/\",F69,\"/\",F70)","v":"PS11_4_FIO1/PS11_7_FIO1/FL1014_FIOH1/S011020_FIOH1"}]
["PRS4_2_VFD1","I0","PRS4_2_VFD1_DISC","DISCONNECT AUX",null,"PS11_7_FIO1"]
["PRS4_2_VFD1","I1","PRS4_2_ENC1","ENCODER",null,"FL1014_FIOH1"]
["PRS4_2_VFD1","I2","PRS4_2_JPE1","JAM PHOTOEYE",null,"S011020_FIOH1"]
["PRS4_2_VFD1","I3","PRS4_2_JPE2","JAM PHOTOEYE"]
["PRS4_2_VFD1","IO0","SPARE",null,null,"FL1022_FIOH1",614,null,null,{"$f":"_xlfn.CONCAT(F72,\"/\",F73,\"/\",F74,\"/\",F75)","v":"FL1022_FIOH1/FL1026_FIOH1/FL1034_FIOH1/S011040_FIOH1"}]
["PRS4_2_VFD1","IO1","SPARE",null,null,"FL1026_FIOH1"]
["PRS4_2_VFD1","SI0","PRS4_2_EPC1","E-STOP PULLCORD",null,"FL1034_FIOH1"]
["PRS4_2_VFD1","SI1","PRS4_2_EPC1_2","E-STOP PULLCORD",null,"S011040_FIOH1"]
["PRS4_2_VFD1","SI2","PRS4_2_EPC2","E-STOP PULLCORD"]
["PRS4_2_VFD1","SI3","PRS4_2_EPC2_2","E-STOP PULLCORD",null,"S013010_FIOH1",615,null,null,{"$f":"_xlfn.CONCAT(F77,\"/\",F78,\"/\",F79,\"/\",F80)","v":"S013010_FIOH1/FL3016_FIOH1/S013018_FIOH1/FL3024_FIOH1"}]
["PRS4_2_VFD1","SO0","SPARE",null,null,"FL3016_FIOH1"]
["PS10_1_VFD1","I0","PS10_1_VFD1_DISC","DISCONNECT AUX",null,"S013018_FIOH1"]
["PS10_1_VFD1","I1","PS10_1_ENC1","ENCODER",null,"FL3024_FIOH1"]
["PS10_1_VFD1","I2","PS10_1_JPE1","JAM PHOTOEYE"]
["PS10_1_VFD1","I3","PS10_1_JPE2","JAM PHOTOEYE"]
["PS10_1_VFD1","IO0","PS10_1_BCN1_A","AMBER BEACON LIGHT"]
["PS10_1_VFD1","IO1","PS10_1_BCN1_R","RED BEACON LIGHT"]
["PS10_1_VFD1","SI0","PS10_1_EPC1","E-STOP PULLCORD"]
["PS10_1_VFD1","SI1","PS10_1_EPC1_2","E-STOP PULLCORD"]
["PS10_1_VFD1","SI2","SPARE"]
["PS10_1_VFD1","SI3","SPARE"]
["PS10_1_VFD1","SO0","SPARE"]
["PS10_2_VFD1","I0","PS10_2_VFD1_DISC","DISCONNECT AUX"]
["PS10_3_VFD1","I0","PS10_3_VFD1_DISC","DISCONNECT AUX"]
["PS10_5_VFD1","I0","PS10_5_VFD1_DISC","DISCONNECT AUX"]
["PS10_5_SIO1","SI0","PS10_5_EPC1","E-STOP PULLCORD"]
["PS10_5_SIO1","SI1","PS10_5_EPC1_2","E-STOP PULLCORD"]
["PS10_5_SIO1","SI2","SPARE"]
["PS10_5_SIO1","SI3","SPARE"]
["PS10_5_SIO1","SI4","SPARE"]
["PS10_5_SIO1","SI5","SPARE"]
["PS10_5_SIO1","SI6","SPARE"]
["PS10_5_SIO1","SI7","SPARE"]
["PS10_5_SIO1","SO0","PS10_5_VFD1_STO","VFD SAFETY ACTIVE"]
["PS10_5_SIO1","SO1","PS10_3_VFD1_STO","VFD SAFETY ACTIVE"]
["PS10_5_SIO1","SO2","PS10_2_VFD1_STO","VFD SAFETY ACTIVE"]
["PS10_5_SIO1","SO3","SPARE"]
["PS10_5_SIO1","IO0","PS10_3_ENC1","ENCODER"]
["PS10_5_SIO1","IO1","SPARE"]
["PS10_5_SIO1","IO2","PS10_3_JPE1","JAM PHOTOEYE"]
["PS10_5_SIO1","IO3","SPARE"]
["PS11_1_VFD1","I0","PS11_1_VFD1_DISC","DISCONNECT AUX"]
["PS11_1_VFD1","I1","PS11_1_ENC1","ENCODER"]
["PS11_1_VFD1","I2","PS11_1_JPE1","JAM PHOTOEYE"]
["PS11_1_VFD1","I3","PS11_1_JPE2","JAM PHOTOEYE"]
["PS11_1_VFD1","IO0","SPARE"]
["PS11_1_VFD1","IO1","SPARE"]
["PS11_1_VFD1","SI0","PS11_1_EPC1","E-STOP PULLCORD"]
["PS11_1_VFD1","SI1","PS11_1_EPC1_2","E-STOP PULLCORD"]
["PS11_1_VFD1","SI2","SPARE"]
["PS11_1_VFD1","SI3","SPARE"]
["PS11_1_VFD1","SO0","SPARE"]
["PS11_2_VFD1","I0","PS11_2_VFD1_DISC","DISCONNECT AUX"]
["PS11_2_VFD1","I1","PS11_2_ENC1","ENCODER"]
["PS11_2_VFD1","I2","PS11_2_JPE1","JAM PHOTOEYE"]
["PS11_2_VFD1","I3","SPARE"]
["PS11_2_VFD1","IO0","PS11_2_BCN1_A","AMBER BEACON LIGHT"]
["PS11_2_VFD1","IO1","SPARE"]
["PS11_2_VFD1","SI0","SPARE"]
["PS11_2_VFD1","SI1","SPARE"]
["PS11_2_VFD1","SI2","SPARE"]
["PS11_2_VFD1","SI3","SPARE"]
["PS11_2_VFD1","SO0","SPARE"]
["PS11_3_VFD1","I0","PS11_3_VFD1_DISC","DISCONNECT AUX"]
["PS11_3_VFD1","I1","PS11_3_ENC1","ENCODER"]
["PS11_3_VFD1","I2","PS11_3_JPE1","JAM PHOTOEYE"]
["PS11_3_VFD1","I3","PS11_3_JPE2","JAM PHOTOEYE"]
["PS11_3_VFD1","IO0","PS11_3_BCN1_A","AMBER BEACON LIGHT"]
["PS11_3_VFD1","IO1","PS11_3_BCN1_R","RED BEACON LIGHT"]
["PS11_3_VFD1","SI0","PS11_3_EPC1","E-STOP PULLCORD"]
["PS11_3_VFD1","SI1","PS11_3_EPC1_2","E-STOP PULLCORD"]
["PS11_3_VFD1","SI2","PS11_3_EPC2","E-STOP PULLCORD"]
["PS11_3_VFD1","SI3","PS11_3_EPC2_2","E-STOP PULLCORD"]
["PS11_3_VFD1","SO0","SPARE"]
["PS11_4_VFD1","I0","PS11_4_VFD1_DISC","DISCONNECT AUX"]
["PS11_4_VFD1","I1","PS11_4_ENC1","ENCODER"]
["PS11_4_VFD1","I2","PS11_4_JPE1","JAM PHOTOEYE"]
["PS11_4_VFD1","I3","SPARE"]
["PS11_4_VFD1","IO0","SPARE"]
["PS11_4_VFD1","IO1","SPARE"]
["PS11_4_VFD1","SI0","PS11_4_EPC1","E-STOP PULLCORD"]
["PS11_4_VFD1","SI1","PS11_4_EPC1_2","E-STOP PULLCORD"]
["PS11_4_VFD1","SI2","PS11_4_EPC2","E-STOP PULLCORD"]
["PS11_4_VFD1","SI3","PS11_4_EPC2_2","E-STOP PULLCORD"]
["PS11_4_VFD1","SO0","SPARE"]
["PS11_6_VFD1","I0","PS11_6_VFD1_DISC","DISCONNECT AUX"]
["PS11_6_VFD1","I1","PS11_6_ENC1","ENCODER"]
["PS11_6_VFD1","I2","PS11_6_JPE1","JAM PHOTOEYE"]
["PS11_6_VFD1","I3","PS11_6_JPE2","JAM PHOTOEYE"]
["PS11_6_VFD1","IO0","PS11_7_ENC1","ENCODER"]
["PS11_6_VFD1","IO1","PS11_7_JPE1","JAM PHOTOEYE"]
["PS11_6_VFD1","SI0","PS11_7_EPC1","E-STOP PULLCORD"]
["PS11_6_VFD1","SI1","PS11_7_EPC1_2","E-STOP PULLCORD"]
["PS11_6_VFD1","SI2","PS11_7_EPC2","E-STOP PULLCORD"]
["PS11_6_VFD1","SI3","PS11_7_EPC2_2","E-STOP PULLCORD"]
["PS11_6_VFD1","SO0","SPARE"]
["PS11_7_VFD1","I0","PS11_7_VFD1_DISC","DISCONNECT AUX"]
["PS11_8_VFD1","I0","PS11_8_VFD1_DISC","DISCONNECT AUX"]
["PS11_9_VFD1","I0","PS11_9_VFD1_DISC","DISCONNECT AUX"]
["PS11_11_VFD1","I0","PS11_11_VFD1_DISC","DISCONNECT AUX"]
["PS11_8_SIO1","SI0","PS11_11_EPC1","E-STOP PULLCORD"]
["PS11_8_SIO1","SI1","PS11_11_EPC1_2","E-STOP PULLCORD"]
["PS11_8_SIO1","SI2","PS11_8_EPC1","E-STOP PULLCORD"]
["PS11_8_SIO1","SI3","PS11_8_EPC1_2","E-STOP PULLCORD"]
["PS11_8_SIO1","SI4","SPARE"]
["PS11_8_SIO1","SI5","SPARE"]
["PS11_8_SIO1","SI6","SPARE"]
["PS11_8_SIO1","SI7","SPARE"]
["PS11_8_SIO1","SO0","PS11_7_VFD1_STO","VFD SAFETY ACTIVE"]
["PS11_8_SIO1","SO1","PS11_8_VFD1_STO","VFD SAFETY ACTIVE"]
["PS11_8_SIO1","SO2","PS11_9_VFD1_STO","VFD SAFETY ACTIVE"]
["PS11_8_SIO1","SO3","PS11_11_VFD1_STO","VFD SAFETY ACTIVE"]
["PS11_8_SIO1","IO0","PS11_8_ENC1","ENCODER"]
["PS11_8_SIO1","IO1","PS11_8_JPE1","JAM PHOTOEYE"]
["PS11_8_SIO1","IO2","PS11_8_FIOH1","HUB ARMOR BLOCK"]
["PS11_8_SIO1","IO3","SPARE"]
["PS11_8_FIOH1","IO0","PS11_8_BCN1_R","RED BEACON LIGHT"]
["PS11_8_FIOH1","IO1","SPARE"]
["PS11_8_FIOH1","IO2","PS11_9_ENC1","ENCODER"]
["PS11_8_FIOH1","IO3","SPARE"]
["PS11_8_FIOH1","IO4","PS11_9_BCN1_A","AMBER BEACON LIGHT"]
["PS11_8_FIOH1","IO5","SPARE"]
["PS11_8_FIOH1","IO6","PS11_8_S1_PB","START PUSHBUTTON"]
["PS11_8_FIOH1","IO7","PS11_8_S1_PB_LT","START PUSHBUTTON LIGHT"]
["PS11_8_FIOH1","IO8","SPARE"]
["PS11_8_FIOH1","IO9","SPARE"]
["PS11_8_FIOH1","IO10","SPARE"]
["PS11_8_FIOH1","IO11","SPARE"]
["PS11_8_FIOH1","IO12","SPARE"]
["PS11_8_FIOH1","IO13","SPARE"]
["PS11_8_FIOH1","IO14","SPARE"]
["PS11_8_FIOH1","IO15","SPARE"]
["ULC5_3_VFD1","I0","ULC5_3_VFD1_DISC","DISCONNECT AUX"]
["ULC5_3_VFD1","I1","ULC5_3_ENC1","ENCODER"]
["ULC5_3_VFD1","I2","ULC5_3_JPE1","JAM PHOTOEYE"]
["ULC5_3_VFD1","I3","ULC5_3_JPE2","JAM PHOTOEYE"]
["ULC5_3_VFD1","IO0","ULC5_3_BCN1_A","AMBER BEACON LIGHT"]
["ULC5_3_VFD1","IO1","ULC5_3_BCN1_R","RED BEACON LIGHT"]
["ULC5_3_VFD1","SI0","ULC5_3_EPC1","E-STOP PULLCORD"]
["ULC5_3_VFD1","SI1","ULC5_3_EPC1_2","E-STOP PULLCORD"]
["ULC5_3_VFD1","SI2","ULC5_3_EPC2","E-STOP PULLCORD"]
["ULC5_3_VFD1","SI3","ULC5_3_EPC2_2","E-STOP PULLCORD"]
["ULC5_3_VFD1","SO0","ULC5_1_STO1","ESTOP OK","2025-06-02"]
["ULC6_3_VFD1","I0","ULC6_3_VFD1_DISC","DISCONNECT AUX"]
["ULC6_3_VFD1","I1","ULC6_3_ENC1","ENCODER"]
["ULC6_3_VFD1","I2","ULC6_3_JPE1","JAM PHOTOEYE"]
["ULC6_3_VFD1","I3","ULC6_3_JPE2","JAM PHOTOEYE"]
["ULC6_3_VFD1","IO0","ULC6_3_BCN1_A","AMBER BEACON LIGHT"]
["ULC6_3_VFD1","IO1","ULC6_3_BCN1_R","RED BEACON LIGHT"]
["ULC6_3_VFD1","SI0","ULC6_3_EPC1","E-STOP PULLCORD"]
["ULC6_3_VFD1","SI1","ULC6_3_EPC1_2","E-STOP PULLCORD"]
["ULC6_3_VFD1","SI2","SPARE"]
["ULC6_3_VFD1","SI3","SPARE"]
["ULC6_3_VFD1","SO0","ULC6_1_STO1","ESTOP OK","2025-06-02"]
["ULC7_3_VFD1","I0","ULC7_3_VFD1_DISC","DISCONNECT AUX"]
["ULC7_3_VFD1","I1","ULC7_3_ENC1","ENCODER"]
["ULC7_3_VFD1","I2","ULC7_3_JPE1","JAM PHOTOEYE"]
["ULC7_3_VFD1","I3","ULC7_3_JPE2","JAM PHOTOEYE"]
["ULC7_3_VFD1","IO0","SPARE"]
["ULC7_3_VFD1","IO1","SPARE"]
["ULC7_3_VFD1","SI0","ULC7_3_EPC1","E-STOP PULLCORD"]
["ULC7_3_VFD1","SI1","ULC7_3_EPC1_2","E-STOP PULLCORD"]
["ULC7_3_VFD1","SI2","ULC7_3_EPC2","E-STOP PULLCORD"]
["ULC7_3_VFD1","SI3","ULC7_3_EPC2_2","E-STOP PULLCORD"]
["ULC7_3_VFD1","SO0","ULC7_1_STO1","ESTOP OK","2025-06-02"]
["ULC8_3_VFD1","I0","ULC8_3_VFD1_DISC","DISCONNECT AUX"]
["ULC8_3_VFD1","I1","ULC8_3_ENC1","ENCODER"]
["ULC8_3_VFD1","I2","ULC8_3_JPE1","JAM PHOTOEYE"]
["ULC8_3_VFD1","I3","ULC8_3_JPE2","JAM PHOTOEYE"]
["ULC8_3_VFD1","IO0","SPARE"]
["ULC8_3_VFD1","IO1","SPARE"]
["ULC8_3_VFD1","SI0","ULC8_3_EPC1","E-STOP PULLCORD"]
["ULC8_3_VFD1","SI1","ULC8_3_EPC1_2","E-STOP PULLCORD"]
["ULC8_3_VFD1","SI2","SPARE"]
["ULC8_3_VFD1","SI3","SPARE"]
["ULC8_3_VFD1","SO0","ULC8_1_STO1","ESTOP OK","2025-06-02"]
["PRS3_2A_FIO1","IO00","PRS3_1ACH_BCN1_A","AMBER BEACON LIGHT"]
["PRS3_2A_FIO1","IO01","PRS3_1ACH_BCN1_B","BLUE BEACON LIGHT"]
["PRS3_2A_FIO1","IO02","PRS3_1ACH_FPE1","FULL PHOTOEYE"]
["PRS3_2A_FIO1","IO03","SPARE"]
["PRS3_2A_FIO1","IO04","PRS3_1ACH_JR1_PB","JAM RESET PUSHBUTTON"]
["PRS3_2A_FIO1","IO05","PRS3_1ACH_JR1_PB_LT","JAM RESET PUSHBUTTON LIGHT"]
["PRS3_2A_FIO1","IO06","PRS3_2A_JR1_PB","JAM RESET PUSHBUTTON"]
["PRS3_2A_FIO1","IO07","PRS3_2A_JR1_PB_LT","JAM RESET PUSHBUTTON LIGHT"]
["PRS3_2A_FIO1","IO08","PRS3_2A_BCN1_A","AMBER BEACON LIGHT"]
["PRS3_2A_FIO1","IO09","SPARE"]
["PRS3_2A_FIO1","IO10","SPARE"]
["PRS3_2A_FIO1","IO11","SPARE"]
["PRS3_2A_FIO1","IO12","SPARE"]
["PRS3_2A_FIO1","IO13","SPARE"]
["PRS3_2A_FIO1","IO14","SPARE"]
["PRS3_2A_FIO1","IO15","SPARE"]
["PRS3_2B_FIO1","IO00","PRS3_1BCH_BCN1_A","AMBER BEACON LIGHT"]
["PRS3_2B_FIO1","IO01","PRS3_1BCH_BCN1_B","BLUE BEACON LIGHT"]
["PRS3_2B_FIO1","IO02","PRS3_1BCH_FPE1","FULL PHOTOEYE"]
["PRS3_2B_FIO1","IO03","SPARE"]
["PRS3_2B_FIO1","IO04","PRS3_1BCH_JR1_PB","JAM RESET PUSHBUTTON"]
["PRS3_2B_FIO1","IO05","PRS3_1BCH_JR1_PB_LT","JAM RESET PUSHBUTTON LIGHT"]
["PRS3_2B_FIO1","IO06","PRS3_3A_JR1_PB","JAM RESET PUSHBUTTON"]
["PRS3_2B_FIO1","IO07","PRS3_3A_JR1_PB_LT","JAM RESET PUSHBUTTON LIGHT"]
["PRS3_2B_FIO1","IO08","PRS3_4CH_FPE1","FULL PHOTOEYE","2025-06-30"]
["PRS3_2B_FIO1","IO09","PRS3_4CH_FPE2","FULL PHOTOEYE","2025-06-30"]
["PRS3_2B_FIO1","IO10","PRS3_2B_JR1_PB","JAM RESET PUSHBUTTON"]
["PRS3_2B_FIO1","IO11","PRS3_2B_JR1_PB_LT","JAM RESET PUSHBUTTON LIGHT"]
["PRS3_2B_FIO1","IO12","PRS3_3B_JR1_PB","JAM RESET PUSHBUTTON"]
["PRS3_2B_FIO1","IO13","PRS3_3B_JR1_PB_LT","JAM RESET PUSHBUTTON LIGHT"]
["PRS3_2B_FIO1","IO14","PRS3_2B_BCN1_A","AMBER BEACON LIGHT","2025-06-30"]
["PRS3_2B_FIO1","IO15",null,null,"2025-06-30"]
["PRS3_4CH_FIO1","IO00","PRS3_5_BCN1_A","AMBER BEACON LIGHT"]
["PRS3_4CH_FIO1","IO01","PRS3_5_BCN1_R","RED BEACON LIGHT"]
["PRS3_4CH_FIO1","IO02","PRS3_5_BCN2_R","RED BEACON LIGHT"]
["PRS3_4CH_FIO1","IO03","SPARE"]
["PRS3_4CH_FIO1","IO04","PRS3_5_BCN3_A","AMBER BEACON LIGHT"]
["PRS3_4CH_FIO1","IO05","PRS3_5_BCN3_B","BLUE BEACON LIGHT"]
["PRS3_4CH_FIO1","IO06","PRS3_5_S1_PB","START PUSHBUTTON"]
["PRS3_4CH_FIO1","IO07","PRS3_5_S1_PB_LT","START PUSHBUTTON LIGHT"]
["PRS3_4CH_FIO1","IO08","PRS3_5_S2_PB","START PUSHBUTTON"]
["PRS3_4CH_FIO1","IO09","PRS3_5_S2_PB_LT","START PUSHBUTTON LIGHT"]
["PRS3_4CH_FIO1","IO10","SPARE"]
["PRS3_4CH_FIO1","IO11","SPARE"]
["PRS3_4CH_FIO1","IO12","SPARE"]
["PRS3_4CH_FIO1","IO13","SPARE"]
["PRS3_4CH_FIO1","IO14","SPARE"]
["PRS3_4CH_FIO1","IO15","SPARE"]
["PRS4_2_FIO1","IO00","PRS4_1_BCN1_R","RED BEACON LIGHT"]
["PRS4_2_FIO1","IO01","SPARE"]
["PRS4_2_FIO1","IO02","PRS4_1_BCN2_A","AMBER BEACON LIGHT"]
["PRS4_2_FIO1","IO03","PRS4_1_BCN2_R","RED BEACON LIGHT"]
["PRS4_2_FIO1","IO04","PRS4_1_S1_PB","START PUSHBUTTON"]
["PRS4_2_FIO1","IO05","PRS4_1_S1_PB_LT","START PUSHBUTTON LIGHT"]
["PRS4_2_FIO1","IO06","PRS4_1_S2_PB","START PUSHBUTTON"]
["PRS4_2_FIO1","IO07","PRS4_1_S2_PB_LT","START PUSHBUTTON LIGHT"]
["PRS4_2_FIO1","IO08","PRS4_2_BCN1_R","RED BEACON LIGHT"]
["PRS4_2_FIO1","IO09","SPARE"]
["PRS4_2_FIO1","IO10","PRS4_2_JR1_PB","JAM RESET PUSHBUTTON"]
["PRS4_2_FIO1","IO11","PRS4_2_JR1_PB_LT","JAM RESET PUSHBUTTON LIGHT"]
["PRS4_2_FIO1","IO12","PRS4_2_S1_PB","START PUSHBUTTON"]
["PRS4_2_FIO1","IO13","PRS4_2_S1_PB_LT","START PUSHBUTTON LIGHT"]
["PRS4_2_FIO1","IO14","PRS4_2_S2_PB","START PUSHBUTTON"]
["PRS4_2_FIO1","IO15","PRS4_2_S2_PB_LT","START PUSHBUTTON LIGHT"]
["PS10_1_FIO1","IO00","PS10_1_JPE3","JAM PHOTOEYE"]
["PS10_1_FIO1","IO01","PS10_1_JPE4","JAM PHOTOEYE"]
["PS10_1_FIO1","IO02","PS10_1_JR1_PB","JAM RESET PUSHBUTTON"]
["PS10_1_FIO1","IO03","PS10_1_JR1_PB_LT","JAM RESET PUSHBUTTON LIGHT"]
["PS10_1_FIO1","IO04","PS10_1_SS1_SPB","SS STATION START PUSHBUTTON","2025-06-30"]
["PS10_1_FIO1","IO05","PS10_1_SS1_SPB_LT","SS STATION START PUSHBUTTON LIGHT","2025-06-30"]
["PS10_1_FIO1","IO06","PS10_1_SS1_STPB","SS STATION STOP PUSHBUTTON","2025-06-30"]
["PS10_1_FIO1","IO07","SPARE"]
["PS10_1_FIO1","IO08","PS10_2_ENC1","ENCODER"]
["PS10_1_FIO1","IO09","SPARE"]
["PS10_1_FIO1","IO10","PS10_2_JPE1","JAM PHOTOEYE"]
["PS10_1_FIO1","IO11","SPARE"]
["PS10_1_FIO1","IO12","PS10_1_FIOH1","HUB ARMOR BLOCK"]
["PS10_1_FIO1","IO13","SPARE"]
["PS10_1_FIO1","IO14","PS10_1_FIOH2","HUB ARMOR BLOCK"]
["PS10_1_FIO1","IO15","SPARE"]
["PS10_1_FIOH1","IO00","ULC7_3_BCN1_A","AMBER BEACON LIGHT"]
["PS10_1_FIOH1","IO01","ULC7_3_BCN1_R","RED BEACON LIGHT"]
["PS10_1_FIOH1","IO02","ULC7_3_JR1_PB","JAM RESET PUSHBUTTON"]
["PS10_1_FIOH1","IO03","ULC7_3_JR1_PB_LT","JAM RESET PUSHBUTTON LIGHT"]
["PS10_1_FIOH1","IO04","ULC7_3_SS1_SPB","SS STATION START PUSHBUTTON","2025-06-30"]
["PS10_1_FIOH1","IO05","ULC7_3_SS1_SPB_LT","SS STATION START PUSHBUTTON LIGHT","2025-06-30"]
["PS10_1_FIOH1","IO06","ULC7_3_SS1_STPB","SS STATION STOP PUSHBUTTON","2025-06-30"]
["PS10_1_FIOH1","IO07","SPARE"]
["PS10_1_FIOH1","IO08","ULC7_3_SS2_SPB","SS STATION START PUSHBUTTON","2025-06-30"]
["PS10_1_FIOH1","IO09","ULC7_3_SS2_SPB_LT","SS STATION START PUSHBUTTON LIGHT","2025-06-30"]
["PS10_1_FIOH1","IO10","ULC7_3_SS2_STPB","SS STATION STOP PUSHBUTTON","2025-06-30"]
["PS10_1_FIOH1","IO11","SPARE"]
["PS10_1_FIOH1","IO12","SPARE"]
["PS10_1_FIOH1","IO13","SPARE"]
["PS10_1_FIOH1","IO14","SPARE"]
["PS10_1_FIOH1","IO15","SPARE"]
["PS10_1_FIOH2","IO00","ULC8_3_BCN1_A","AMBER BEACON LIGHT"]
["PS10_1_FIOH2","IO01","ULC8_3_BCN1_R","RED BEACON LIGHT"]
["PS10_1_FIOH2","IO02","ULC8_3_JR1_PB","JAM RESET PUSHBUTTON"]
["PS10_1_FIOH2","IO03","ULC8_3_JR1_PB_LT","JAM RESET PUSHBUTTON LIGHT"]
["PS10_1_FIOH2","IO04","ULC8_3_SS1_SPB","SS STATION START PUSHBUTTON","2025-06-30"]
["PS10_1_FIOH2","IO05","ULC8_3_SS1_SPB_LT","SS STATION START PUSHBUTTON LIGHT","2025-06-30"]
["PS10_1_FIOH2","IO06","ULC8_3_SS1_STPB","SS STATION STOP PUSHBUTTON","2025-06-30"]
["PS10_1_FIOH2","IO07","SPARE"]
["PS10_1_FIOH2","IO08","SPARE"]
["PS10_1_FIOH2","IO09","SPARE"]
["PS10_1_FIOH2","IO10","SPARE"]
["PS10_1_FIOH2","IO11","SPARE"]
["PS10_1_FIOH2","IO12","SPARE"]
["PS10_1_FIOH2","IO13","SPARE"]
["PS10_1_FIOH2","IO14","SPARE"]
["PS10_1_FIOH2","IO15","SPARE"]
["PS10_5_FIO1","IO00","PS10_5_JPE4","JAM PHOTOEYE"]
["PS10_5_FIO1","IO01","PS10_5_JPE5","JAM PHOTOEYE"]
["PS10_5_FIO1","IO02","PS10_5_JPE6","JAM PHOTOEYE"]
["PS10_5_FIO1","IO03","SPARE"]
["PS10_5_FIO1","IO04","PS10_5_JR1_PB","JAM RESET PUSHBUTTON"]
["PS10_5_FIO1","IO05","PS10_5_JR1_PB_LT","JAM RESET PUSHBUTTON LIGHT"]
["PS10_5_FIO1","IO06","PS10_5_JR2_PB","JAM RESET PUSHBUTTON"]
["PS10_5_FIO1","IO07","PS10_5_JR2_PB_LT","JAM RESET PUSHBUTTON LIGHT"]
["PS10_5_FIO1","IO08","PS10_5_JPE1","JAM PHOTOEYE"]
["PS10_5_FIO1","IO09","PS10_6CH_FPE1","FULL PHOTOEYE"]
["PS10_5_FIO1","IO10","PS10_5_PS1","PRESSURE SENSOR"]
["PS10_5_FIO1","IO11","SPARE"]
["PS10_5_FIO1","IO12","PS10_5_BCN1_A","AMBER BEACON LIGHT"]
["PS10_5_FIO1","IO13","PS10_5_BCN2_A","AMBER BEACON LIGHT"]
["PS10_5_FIO1","IO14","PS10_5_FIOH1","HUB ARMOR BLOCK"]
["PS10_5_FIO1","IO15"]
["PS10_5_FIO2","IO00","PS10_5DIV3_PX1","LIMIT SWITCH","2025-06-30"]
["PS10_5_FIO2","IO01","PS10_5DIV3_PX2","LIMIT SWITCH","2025-06-30"]
["PS10_5_FIO2","IO02","PS10_5DIV3_SOL1","SOLENOID VALVE"]
["PS10_5_FIO2","IO03","SPARE"]
["PS10_5_FIO2","IO04","PS10_5DIV3_SOL2","SOLENOID VALVE"]
["PS10_5_FIO2","IO05","SPARE"]
["PS10_5_FIO2","IO06","PS10_5_FIOH2","HUB ARMOR BLOCK"]
["PS10_5_FIO2","IO07","SPARE"]
["PS10_5_FIO2","IO08","PS10_5DIV4_SOL1","SOLENOID VALVE"]
["PS10_5_FIO2","IO09","PS10_5DIV4_SOL2","SOLENOID VALVE"]
["PS10_5_FIO2","IO10","PS10_5DIV4_PX1","LIMIT SWITCH"]
["PS10_5_FIO2","IO11","PS10_5DIV4_PX2","LIMIT SWITCH"]
["PS10_5_FIO2","IO12","PS10_5_FIOH3","HUB ARMOR BLOCK"]
["PS10_5_FIO2","IO13","SPARE"]
["PS10_5_FIO2","IO14","PS10_5_FIOH4","HUB ARMOR BLOCK"]
["PS10_5_FIO2","IO15","SPARE"]
["PS10_5_FIOH1","IO00","PS10_5CH1_BCN1_A","AMBER BEACON LIGHT",null,"pin2","black"]
["PS10_5_FIOH1","IO01","PS10_5CH1_BCN1_B","BLUE BEACON LIGHT",null,"pin3","white"]
["PS10_5_FIOH1","IO02","PS10_5CH1_BCN1_G","GREEN BEACON LIGHT",null,"pin1","black"]
["PS10_5_FIOH1","IO03","PS10_5CH1_FPE1","FULL PHOTOEYE"]
["PS10_5_FIOH1","IO04","PS10_5CH1_FPE2","FULL PHOTOEYE"]
["PS10_5_FIOH1","IO05","PS10_5CH1_JPE1","JAM PHOTOEYE"]
["PS10_5_FIOH1","IO06","PS10_5CH1_S1_PB","START PUSHBUTTON"]
["PS10_5_FIOH1","IO07","PS10_5CH1_S1_PB_LT","START PUSHBUTTON LIGHT"]
["PS10_5_FIOH1","IO08","PS10_5CH2_BCN1_A","AMBER BEACON LIGHT",null,"pin2","black"]
["PS10_5_FIOH1","IO09","PS10_5CH2_BCN1_B","BLUE BEACON LIGHT",null,"pin3","white"]
["PS10_5_FIOH1","IO10","PS10_5CH2_BCN1_G","GREEN BEACON LIGHT",null,"pin1","black"]
["PS10_5_FIOH1","IO11","PS10_5CH2_FPE1","FULL PHOTOEYE"]
["PS10_5_FIOH1","IO12","PS10_5CH2_FPE2","FULL PHOTOEYE"]
["PS10_5_FIOH1","IO13","PS10_5CH2_JPE1","JAM PHOTOEYE"]
["PS10_5_FIOH1","IO14","PS10_5CH2_S1_PB","START PUSHBUTTON"]
["PS10_5_FIOH1","IO15","PS10_5CH2_S1_PB_LT","START PUSHBUTTON LIGHT"]
["PS10_5_FIOH2","IO00","PS10_5DIV1_PX1","LIMIT SWITCH"]
["PS10_5_FIOH2","IO01","PS10_5DIV1_PX2","LIMIT SWITCH"]
["PS10_5_FIOH2","IO02","PS10_5DIV1_SOL1","SOLENOID VALVE"]
["PS10_5_FIOH2","IO03","PS10_5DIV1_SOL2","SOLENOID VALVE"]
["PS10_5_FIOH2","IO04","PS10_5DIV2_PX1","LIMIT SWITCH"]
["PS10_5_FIOH2","IO05","PS10_5DIV2_PX2","LIMIT SWITCH"]
["PS10_5_FIOH2","IO06","PS10_5DIV2_SOL1","SOLENOID VALVE"]
["PS10_5_FIOH2","IO07","PS10_5DIV2_SOL2","SOLENOID VALVE"]
["PS10_5_FIOH2","IO08","PS10_5_ENC1","ENCODER"]
["PS10_5_FIOH2","IO09","PS10_5_JPE2","JAM PHOTOEYE"]
["PS10_5_FIOH2","IO10","PS10_5_JPE3","JAM PHOTOEYE"]
["PS10_5_FIOH2","IO11","PS10_3_JR1_PB","JAM RESET PUSHBUTTON"]
["PS10_5_FIOH2","IO12","PS10_3_JR1_PB_LT","JAM RESET PUSHBUTTON LIGHT"]
["PS10_5_FIOH2","IO13","SPARE"]
["PS10_5_FIOH2","IO14","PS10_3_BCN1_A","AMBER BEACON LIGHT"]
["PS10_5_FIOH2","IO15","PS10_3_BCN1_R","RED BEACON LIGHT"]
["PS10_5_FIOH3","IO00","PS10_5CH3_BCN1_A","AMBER BEACON LIGHT","2025-07-03","pin2","black"]
["PS10_5_FIOH3","IO01","PS10_5CH3_BCN1_B","BLUE BEACON LIGHT","2025-07-03","pin3","white"]
["PS10_5_FIOH3","IO02","PS10_5CH3_BCN1_G","GREEN BEACON LIGHT","2025-07-03","pin1","black"]
["PS10_5_FIOH3","IO03","SPARE"]
["PS10_5_FIOH3","IO04","SPARE"]
["PS10_5_FIOH3","IO05","SPARE"]
["PS10_5_FIOH3","IO06","PS10_5CH3_FPE1","FULL PHOTOEYE"]
["PS10_5_FIOH3","IO07","SPARE"]
["PS10_5_FIOH3","IO08","PS10_5CH3_FPE2","FULL PHOTOEYE"]
["PS10_5_FIOH3","IO09","SPARE"]
["PS10_5_FIOH3","IO10","PS10_5CH3_JPE1","JAM PHOTOEYE"]
["PS10_5_FIOH3","IO11","SPARE"]
["PS10_5_FIOH3","IO12","PS10_5CH3_S1_PB","START PUSHBUTTON"]
["PS10_5_FIOH3","IO13","PS10_5CH3_S1_PB_LT","START PUSHBUTTON LIGHT"]
["PS10_5_FIOH3","IO14","SPARE"]
["PS10_5_FIOH3","IO15","SPARE"]
["PS10_5_FIOH4","IO00","PS10_5CH4_BCN1_A","AMBER BEACON LIGHT","2025-07-03","pin2","black"]
["PS10_5_FIOH4","IO01","PS10_5CH4_BCN1_B","BLUE BEACON LIGHT","2025-07-03","pin3","white"]
["PS10_5_FIOH4","IO02","PS10_5CH4_BCN1_G","GREEN BEACON LIGHT","2025-07-03","pin1","black"]
["PS10_5_FIOH4","IO03","SPARE"]
["PS10_5_FIOH4","IO04","SPARE"]
["PS10_5_FIOH4","IO05","SPARE"]
["PS10_5_FIOH4","IO06","PS10_5CH4_FPE1","FULL PHOTOEYE"]
["PS10_5_FIOH4","IO07","SPARE"]
["PS10_5_FIOH4","IO08","PS10_5CH4_FPE2","FULL PHOTOEYE"]
["PS10_5_FIOH4","IO09","SPARE"]
["PS10_5_FIOH4","IO10","PS10_5CH4_JPE1","JAM PHOTOEYE"]
["PS10_5_FIOH4","IO11","SPARE"]
["PS10_5_FIOH4","IO12","PS10_5CH4_S1_PB","START PUSHBUTTON"]
["PS10_5_FIOH4","IO13","PS10_5CH4_S1_PB_LT","START PUSHBUTTON LIGHT"]
["PS10_5_FIOH4","IO14","SPARE"]
["PS10_5_FIOH4","IO15","SPARE"]
["PS11_1_FIO1","IO00","PS11_1_BCN1_A","AMBER BEACON LIGHT"]
["PS11_1_FIO1","IO01","PS11_1_BCN1_R","RED BEACON LIGHT"]
["PS11_1_FIO1","IO02","PS11_1_JPE3","JAM PHOTOEYE"]
["PS11_1_FIO1","IO03","SPARE"]
["PS11_1_FIO1","IO04","PS11_1_JPE4","JAM PHOTOEYE"]
["PS11_1_FIO1","IO05","SPARE"]
["PS11_1_FIO1","IO06","PS11_1_JR1_PB","JAM RESET PUSHBUTTON"]
["PS11_1_FIO1","IO07","PS11_1_JR1_PB_LT","JAM RESET PUSHBUTTON LIGHT"]
["PS11_1_FIO1","IO08","PS11_1_JR2_PB","JAM RESET PUSHBUTTON"]
["PS11_1_FIO1","IO09","PS11_1_JR2_PB_LT","JAM RESET PUSHBUTTON LIGHT"]
["PS11_1_FIO1","IO10","SPARE"]
["PS11_1_FIO1","IO11","SPARE"]
["PS11_1_FIO1","IO12","SPARE"]
["PS11_1_FIO1","IO13","SPARE"]
["PS11_1_FIO1","IO14","PS11_1_FIOH1","HUB ARMOR BLOCK"]
["PS11_1_FIO1","IO15","SPARE"]
["PS11_1_FIOH1","IO00","ULC5_3_JR1_PB","JAM RESET PUSHBUTTON"]
["PS11_1_FIOH1","IO01","ULC5_3_JR1_PB_LT","JAM RESET PUSHBUTTON LIGHT"]
["PS11_1_FIOH1","IO02","ULC5_3_SS1_SPB","SS STATION START PUSHBUTTON","2025-06-30"]
["PS11_1_FIOH1","IO03","ULC5_3_SS1_SPB_LT","SS STATION START PUSHBUTTON LIGHT","2025-06-30"]
["PS11_1_FIOH1","IO04","ULC5_3_SS1_STPB","SS STATION STOP PUSHBUTTON","2025-06-30"]
["PS11_1_FIOH1","IO05","SPARE"]
["PS11_1_FIOH1","IO06","ULC5_3_SS2_SPB","SS STATION START PUSHBUTTON"]
["PS11_1_FIOH1","IO07","ULC5_3_SS2_STPB","SS STATION STOP PUSHBUTTON"]
["PS11_1_FIOH1","IO08","ULC5_3_SS2_STPB_LT","SS STATION STOP PUSHBUTTON LIGHT"]
["PS11_1_FIOH1","IO09","SPARE"]
["PS11_1_FIOH1","IO10","ULC6_3_JR1_PB","JAM RESET PUSHBUTTON"]
["PS11_1_FIOH1","IO11","ULC6_3_JR1_PB_LT","JAM RESET PUSHBUTTON LIGHT"]
["PS11_1_FIOH1","IO12","ULC6_3_SS2_SPB","SS STATION START PUSHBUTTON","2025-06-30"]
["PS11_1_FIOH1","IO13","ULC6_3_SS2_SPB_LT","SS STATION START PUSHBUTTON LIGHT","2025-06-30"]
["PS11_1_FIOH1","IO14","ULC6_3_SS2_STPB","SS STATION STOP PUSHBUTTON","2025-06-30"]
["PS11_1_FIOH1","IO15","SPARE"]
["PS11_11_FIO1","IO00","PS11_11_BCN1_R","RED BEACON LIGHT"]
["PS11_11_FIO1","IO01","PS11_11_BCN2_A","AMBER BEACON LIGHT"]
["PS11_11_FIO1","IO02","PS11_11_BCN3_A","AMBER BEACON LIGHT"]
["PS11_11_FIO1","IO03","PS11_11_BCN4_A","AMBER BEACON LIGHT"]
["PS11_11_FIO1","IO04","PS11_11_JR1_PB","JAM RESET PUSHBUTTON","2025-06-30"]
["PS11_11_FIO1","IO05","PS11_11_JR1_PB_LT","JAM RESET PUSHBUTTON LIGHT","2025-06-30"]
["PS11_11_FIO1","IO06","PS11_11_JR2_PB","JAM RESET PUSHBUTTON","2025-06-30"]
["PS11_11_FIO1","IO07","PS11_11_JR2_PB_LT","JAM RESET PUSHBUTTON LIGHT","2025-06-30"]
["PS11_11_FIO1","IO08","PS11_11_JPE4","JAM PHOTOEYE","2025-06-30"]
["PS11_11_FIO1","IO09","PS11_11_JPE5","JAM PHOTOEYE","2025-06-30"]
["PS11_11_FIO1","IO10","PS11_11_JPE6","JAM PHOTOEYE","2025-06-30"]
["PS11_11_FIO1","IO11","PS11_11_JPE7","JAM PHOTOEYE","2025-06-30"]
["PS11_11_FIO1","IO12","PS11_11_FIOH1","HUB ARMOR BLOCK"]
["PS11_11_FIO1","IO13","SPARE"]
["PS11_11_FIO1","IO14","PS11_11_FIOH2","HUB ARMOR BLOCK"]
["PS11_11_FIO1","IO15","SPARE"]
["PS11_11_FIO2","IO00","PS11_11CH3_S1_PB","START PUSHBUTTON"]
["PS11_11_FIO2","IO01","PS11_11CH3_S1_PB_LT","START PUSHBUTTON LIGHT"]
["PS11_11_FIO2","IO02","PS11_11DIV3_PX1","LIMIT SWITCH"]
["PS11_11_FIO2","IO03","SPARE"]
["PS11_11_FIO2","IO04","PS11_11DIV3_PX2","LIMIT SWITCH"]
["PS11_11_FIO2","IO05","SPARE"]
["PS11_11_FIO2","IO06","PS11_11DIV3_SOL1","SOLENOID VALVE"]
["PS11_11_FIO2","IO07","SPARE"]
["PS11_11_FIO2","IO08","PS11_11DIV3_SOL2","SOLENOID VALVE"]
["PS11_11_FIO2","IO09","SPARE"]
["PS11_11_FIO2","IO10","PS11_11_ENC1","ENCODER"]
["PS11_11_FIO2","IO11","SPARE"]
["PS11_11_FIO2","IO12","PS11_11_JPE2","JAM PHOTOEYE"]
["PS11_11_FIO2","IO13","SPARE"]
["PS11_11_FIO2","IO14","PS11_11_JPE3","JAM PHOTOEYE"]
["PS11_11_FIO2","IO15","SPARE"]
["PS11_11_FIO3","IO00","PS11_11CH5_S1_PB","START PUSHBUTTON"]
["PS11_11_FIO3","IO01","PS11_11CH5_S1_PB_LT","START PUSHBUTTON LIGHT"]
["PS11_11_FIO3","IO02","PS11_11DIV5_PX1","LIMIT SWITCH"]
["PS11_11_FIO3","IO03","SPARE"]
["PS11_11_FIO3","IO04","PS11_11_FIOH3","HUB ARMOR BLOCK","2025-07-30"]
["PS11_11_FIO3","IO05","SPARE"]
["PS11_11_FIO3","IO06","PS11_11_FIOH4","HUB ARMOR BLOCK","2025-07-30"]
["PS11_11_FIO3","IO07","SPARE",null,"2025-07-30"]
["PS11_11_FIO3","IO08","PS11_11DIV5_SOL1","SOLENOID VALVE","2025-07-30"]
["PS11_11_FIO3","IO09","PS11_11DIV5_SOL2","SOLENOID VALVE","2025-07-30"]
["PS11_11_FIO3","IO10","PS11_11DIV5_PX2","LIMIT SWITCH","2025-07-30"]
["PS11_11_FIO3","IO11","SPARE"]
["PS11_11_FIO3","IO12","PS11_11_FIOH5","HUB ARMOR BLOCK"]
["PS11_11_FIO3","IO13","SPARE"]
["PS11_11_FIO3","IO14","PS11_11_FIOH6","HUB ARMOR BLOCK"]
["PS11_11_FIO3","IO15","SPARE"]
["PS11_11_FIOH1","IO00","PS11_11_JR3_PB","JAM RESET PUSHBUTTON"]
["PS11_11_FIOH1","IO01","PS11_11_JR3_PB_LT","JAM RESET PUSHBUTTON LIGHT"]
["PS11_11_FIOH1","IO02","PS11_11_PS1","PRESSURE SENSOR"]
["PS11_11_FIOH1","IO03","SPARE"]
["PS11_11_FIOH1","IO04","PS11_11_S1_PB","START PUSHBUTTON"]
["PS11_11_FIOH1","IO05","PS11_11_S1_PB_LT","START PUSHBUTTON LIGHT"]
["PS11_11_FIOH1","IO06","PS11_11_JPE1","JAM PHOTOEYE"]
["PS11_11_FIOH1","IO07","PS11_11CH1_BCN1_A","AMBER BEACON LIGHT"]
["PS11_11_FIOH1","IO08","PS11_11CH1_BCN1_B","BLUE BEACON LIGHT"]
["PS11_11_FIOH1","IO09","PS11_11CH1_BCN1_G","GREEN BEACON LIGHT"]
["PS11_11_FIOH1","IO10","PS11_11CH1_FPE1","FULL PHOTOEYE"]
["PS11_11_FIOH1","IO11","PS11_11CH1_FPE2","FULL PHOTOEYE"]
["PS11_11_FIOH1","IO12","PS11_11CH1_JPE1","JAM PHOTOEYE"]
["PS11_11_FIOH1","IO13","PS11_11CH1_S1_PB","START PUSHBUTTON"]
["PS11_11_FIOH1","IO14","PS11_11CH1_S1_PB_LT","START PUSHBUTTON LIGHT"]
["PS11_11_FIOH1","IO15","SPARE"]
["PS11_11_FIOH2","IO00","PS11_11CH2_BCN1_A","AMBER BEACON LIGHT"]
["PS11_11_FIOH2","IO01","PS11_11CH2_BCN1_B","BLUE BEACON LIGHT"]
["PS11_11_FIOH2","IO02","PS11_11CH2_BCN1_G","GREEN BEACON LIGHT"]
["PS11_11_FIOH2","IO03","PS11_11CH2_JPE1","JAM PHOTOEYE"]
["PS11_11_FIOH2","IO04","PS11_11CH2_FPE1","FULL PHOTOEYE"]
["PS11_11_FIOH2","IO05","PS11_11CH2_FPE2","FULL PHOTOEYE"]
["PS11_11_FIOH2","IO06","PS11_11CH2_S1_PB","START PUSHBUTTON"]
["PS11_11_FIOH2","IO07","PS11_11CH2_S1_PB_LT","START PUSHBUTTON LIGHT"]
["PS11_11_FIOH2","IO08","PS11_11DIV1_PX1","LIMIT SWITCH"]
["PS11_11_FIOH2","IO09","PS11_11DIV1_PX2","LIMIT SWITCH"]
["PS11_11_FIOH2","IO10","PS11_11DIV1_SOL1","SOLENOID VALVE"]
["PS11_11_FIOH2","IO11","PS11_11DIV1_SOL2","SOLENOID VALVE"]
["PS11_11_FIOH2","IO12","PS11_11DIV2_PX1","LIMIT SWITCH"]
["PS11_11_FIOH2","IO13","PS11_11DIV2_PX2","LIMIT SWITCH"]
["PS11_11_FIOH2","IO14","PS11_11DIV2_SOL1","SOLENOID VALVE"]
["PS11_11_FIOH2","IO15","PS11_11DIV2_SOL2","SOLENOID VALVE"]
["PS11_11_FIOH3","IO00","PS11_11CH3_BCN2_A","AMBER BEACON LIGHT","2025-07-03"]
["PS11_11_FIOH3","IO01","PS11_11CH3_BCN3_B","BLUE BEACON LIGHT","2025-07-03"]
["PS11_11_FIOH3","IO02","PS11_11CH3_BCN1_G","GREEN BEACON LIGHT","2025-07-03"]
["PS11_11_FIOH3","IO03","SPARE"]
["PS11_11_FIOH3","IO04","SPARE"]
["PS11_11_FIOH3","IO05","SPARE"]
["PS11_11_FIOH3","IO06","PS11_11CH3_JPE1","JAM PHOTOEYE"]
["PS11_11_FIOH3","IO07","SPARE"]
["PS11_11_FIOH3","IO08","PS11_11CH3_FPE1","FULL PHOTOEYE"]
["PS11_11_FIOH3","IO09","SPARE"]
["PS11_11_FIOH3","IO10","PS11_11CH3_FPE2","FULL PHOTOEYE"]
["PS11_11_FIOH3","IO11","SPARE"]
["PS11_11_FIOH3","IO12","SPARE"]
["PS11_11_FIOH3","IO13","SPARE"]
["PS11_11_FIOH3","IO14","SPARE"]
["PS11_11_FIOH3","IO15","SPARE"]
["PS11_11_FIOH4","IO00","PS11_11CH4_BCN1_A","AMBER BEACON LIGHT"]
["PS11_11_FIOH4","IO01","SPARE"]
["PS11_11_FIOH4","IO02","PS11_11CH4_BCN1_B","BLUE BEACON LIGHT"]
["PS11_11_FIOH4","IO03","SPARE"]
["PS11_11_FIOH4","IO04","PS11_11CH4_BCN1_G","GREEN BEACON LIGHT"]
["PS11_11_FIOH4","IO05","SPARE"]
["PS11_11_FIOH4","IO06","PS11_11CH4_FPE1","FULL PHOTOEYE"]
["PS11_11_FIOH4","IO07","PS11_11CH4_FPE2","FULL PHOTOEYE"]
["PS11_11_FIOH4","IO08","PS11_11CH4_JPE1","JAM PHOTOEYE"]
["PS11_11_FIOH4","IO09","SPARE"]
["PS11_11_FIOH4","IO10","PS11_11CH4_S1_PB","START PUSHBUTTON"]
["PS11_11_FIOH4","IO11","PS11_11CH4_S1_PB_LT","START PUSHBUTTON LIGHT"]
["PS11_11_FIOH4","IO12","PS11_11DIV4_PX1","LIMIT SWITCH"]
["PS11_11_FIOH4","IO13","PS11_11DIV4_PX2","LIMIT SWITCH"]
["PS11_11_FIOH4","IO14","PS11_11DIV4_SOL1","SOLENOID VALVE"]
["PS11_11_FIOH4","IO15","PS11_11DIV4_SOL2","SOLENOID VALVE"]
["PS11_11_FIOH5","IO00","PS11_11CH5_BCN1_A","AMBER BEACON LIGHT","2025-07-03"]
["PS11_11_FIOH5","IO01","PS11_11CH5_BCN1_B","BLUE BEACON LIGHT","2025-07-03"]
["PS11_11_FIOH5","IO02","PS11_11CH5_BCN1_G","GREEN BEACON LIGHT","2025-07-03"]
["PS11_11_FIOH5","IO03","SPARE"]
["PS11_11_FIOH5","IO04","SPARE"]
["PS11_11_FIOH5","IO05","SPARE"]
["PS11_11_FIOH5","IO06","PS11_11CH5_JPE1","JAM PHOTOEYE"]
["PS11_11_FIOH5","IO07","SPARE"]
["PS11_11_FIOH5","IO08","PS11_11CH5_FPE1","FULL PHOTOEYE"]
["PS11_11_FIOH5","IO09","SPARE"]
["PS11_11_FIOH5","IO10","PS11_11CH5_FPE2","FULL PHOTOEYE"]
["PS11_11_FIOH5","IO11","SPARE"]
["PS11_11_FIOH5","IO12","SPARE"]
["PS11_11_FIOH5","IO13","SPARE"]
["PS11_11_FIOH5","IO14","SPARE"]
["PS11_11_FIOH5","IO15","SPARE"]
["PS11_11_FIOH6","IO00","PS11_11CH6_BCN1_A","AMBER BEACON LIGHT"]
["PS11_11_FIOH6","IO01","PS11_11CH6_BCN1_B","BLUE BEACON LIGHT"]
["PS11_11_FIOH6","IO02","PS11_11CH6_BCN1_G","GREEN BEACON LIGHT"]
["PS11_11_FIOH6","IO03","PS11_11CH6_JPE1","JAM PHOTOEYE"]
["PS11_11_FIOH6","IO04","PS11_11CH6_FPE1","FULL PHOTOEYE"]
["PS11_11_FIOH6","IO05","PS11_11CH6_FPE2","FULL PHOTOEYE"]
["PS11_11_FIOH6","IO06","PS11_11CH6_S1_PB","START PUSHBUTTON"]
["PS11_11_FIOH6","IO07","PS11_11CH6_S1_PB_LT","START PUSHBUTTON LIGHT"]
["PS11_11_FIOH6","IO08","PS11_11DIV6_PX1","LIMIT SWITCH"]
["PS11_11_FIOH6","IO09","SPARE"]
["PS11_11_FIOH6","IO10","PS11_11DIV6_PX2","LIMIT SWITCH"]
["PS11_11_FIOH6","IO11","SPARE"]
["PS11_11_FIOH6","IO12","PS11_11DIV6_SOL1","SOLENOID VALVE"]
["PS11_11_FIOH6","IO13","PS11_11DIV6_SOL2","SOLENOID VALVE"]
["PS11_11_FIOH6","IO14","PS11_12CH_FPE1","FULL PHOTOEYE"]
["PS11_11_FIOH6","IO15","SPARE"]
["PS11_3_FIO1","IO00","PS11_3_BCN2_R","RED BEACON LIGHT"]
["PS11_3_FIO1","IO01","SPARE"]
["PS11_3_FIO1","IO02","PS11_3_S1_PB","START PUSHBUTTON"]
["PS11_3_FIO1","IO03","PS11_3_S1_PB_LT","START PUSHBUTTON LIGHT"]
["PS11_3_FIO1","IO04","PS11_3_S2_PB","START PUSHBUTTON"]
["PS11_3_FIO1","IO05","PS11_3_S2_PB_LT","START PUSHBUTTON LIGHT"]
["PS11_3_FIO1","IO06","SPARE"]
["PS11_3_FIO1","IO07","SPARE"]
["PS11_3_FIO1","IO08","SPARE"]
["PS11_3_FIO1","IO09","SPARE"]
["PS11_3_FIO1","IO10","SPARE"]
["PS11_3_FIO1","IO11","SPARE"]
["PS11_3_FIO1","IO12","SPARE"]
["PS11_3_FIO1","IO13","SPARE"]
["PS11_3_FIO1","IO14","SPARE"]
["PS11_3_FIO1","IO15","SPARE"]
["PS11_4_FIO1","IO00","PS11_4_BCN1_A","AMBER BEACON LIGHT"]
["PS11_4_FIO1","IO01","PS11_4_BCN1_R","RED BEACON LIGHT"]
["PS11_4_FIO1","IO02","PS11_4_BCN2_R","RED BEACON LIGHT"]
["PS11_4_FIO1","IO03","SPARE"]
["PS11_4_FIO1","IO04","PS11_4_S1_PB","START PUSHBUTTON"]
["PS11_4_FIO1","IO05","PS11_4_S1_PB_LT","START PUSHBUTTON LIGHT"]
["PS11_4_FIO1","IO06","PS11_4_S2_PB","START PUSHBUTTON"]
["PS11_4_FIO1","IO07","PS11_4_S2_PB_LT","START PUSHBUTTON LIGHT"]
["PS11_4_FIO1","IO08","SPARE"]
["PS11_4_FIO1","IO09","SPARE"]
["PS11_4_FIO1","IO10","SPARE"]
["PS11_4_FIO1","IO11","SPARE"]
["PS11_4_FIO1","IO12","SPARE"]
["PS11_4_FIO1","IO13","SPARE"]
["PS11_4_FIO1","IO14","SPARE"]
["PS11_4_FIO1","IO15","SPARE"]
["PS11_7_FIO1","IO00","PS11_7_BCN1_R","RED BEACON LIGHT"]
["PS11_7_FIO1","IO01","SPARE"]
["PS11_7_FIO1","IO02","PS11_7_BCN2_R","RED BEACON LIGHT"]
["PS11_7_FIO1","IO03","SPARE"]
["PS11_7_FIO1","IO04","PS11_7_S1_PB","START PUSHBUTTON"]
["PS11_7_FIO1","IO05","PS11_7_S1_PB_LT","START PUSHBUTTON LIGHT"]
["PS11_7_FIO1","IO06","PS11_7_S2_PB","START PUSHBUTTON"]
["PS11_7_FIO1","IO07","PS11_7_S2_PB_LT","START PUSHBUTTON LIGHT"]
["PS11_7_FIO1","IO08","SPARE"]
["PS11_7_FIO1","IO09","SPARE"]
["PS11_7_FIO1","IO10","SPARE"]
["PS11_7_FIO1","IO11","SPARE"]
["PS11_7_FIO1","IO12","SPARE"]
["PS11_7_FIO1","IO13","SPARE"]
["PS11_7_FIO1","IO14","SPARE"]
["PS11_7_FIO1","IO15","SPARE"]
[]
["FL1014_FIOH1","IO0","SPARE"]
["FL1014_FIOH1","IO1","SPARE"]
["FL1014_FIOH1","IO2","SPARE"]
["FL1014_FIOH1","IO3","SPARE"]
["FL1014_FIOH1","IO4","SPARE"]
["FL1014_FIOH1","IO5","SPARE",null,null,null,null,null,null,null,null,null,null,null,null,null,null,null,null,null,null,"2025-06-18"]
["FL1014_FIOH1","IO6","SPARE"]
["FL1014_FIOH1","IO7","SPARE"]
["FL1014_FIOH1","IO8","FL1014_1_BCN1_A"]
["FL1014_FIOH1","IO9","FL1014_1_BCN1_B"]
["FL1014_FIOH1","IO10","FL1014_2_JR1_PB"]
["FL1014_FIOH1","IO11","FL1014_2_JR1_PB_LT"]
["FL1014_FIOH1","IO12","FL1014_1CH_PE1"]
["FL1014_FIOH1","IO13","SPARE",null,null,null,null,null,null,null,null,null,null,null,null,null,null,null,null,null,null,"2025-06-18"]
["FL1014_FIOH1","IO14","FL1014_2_BCN1_A"]
["FL1014_FIOH1","IO15","FL1014_2_BCN1_B"]
["FL1022_FIOH1","IO0","SPARE"]
["FL1022_FIOH1","IO1","SPARE"]
["FL1022_FIOH1","IO2","SPARE"]
["FL1022_FIOH1","IO3","SPARE"]
["FL1022_FIOH1","IO4","SPARE"]
["FL1022_FIOH1","IO5","SPARE"]
["FL1022_FIOH1","IO6","SPARE"]
["FL1022_FIOH1","IO7","SPARE"]
["FL1022_FIOH1","IO8","FL1022_1_BCN1_A"]
["FL1022_FIOH1","IO9","FL1022_1_BCN1_B"]
["FL1022_FIOH1","IO10","FL1022_2_JR1_PB"]
["FL1022_FIOH1","IO11","FL1022_2_JR1_PB_LT"]
["FL1022_FIOH1","IO12","FL1022_1CH_PE1"]
["FL1022_FIOH1","IO13","SPARE",null,null,null,null,null,null,null,null,null,null,null,null,null,null,null,null,null,null,"2025-06-18"]
["FL1022_FIOH1","IO14","FL1022_2_BCN1_A"]
["FL1022_FIOH1","IO15","FL1022_2_BCN1_B"]
["FL1026_FIOH1","IO0","SPARE"]
["FL1026_FIOH1","IO1","SPARE"]
["FL1026_FIOH1","IO2","SPARE"]
["FL1026_FIOH1","IO3","SPARE"]
["FL1026_FIOH1","IO4","SPARE"]
["FL1026_FIOH1","IO5","SPARE",null,null,null,null,null,null,null,null,null,null,null,null,null,null,null,null,null,null,"2025-06-18"]
["FL1026_FIOH1","IO6","SPARE"]
["FL1026_FIOH1","IO7","SPARE"]
["FL1026_FIOH1","IO8","FL1026_1_BCN1_A"]
["FL1026_FIOH1","IO9","FL1026_1_BCN1_B"]
["FL1026_FIOH1","IO10","FL1026_2_JR1_PB"]
["FL1026_FIOH1","IO11","FL1026_2_JR1_PB_LT"]
["FL1026_FIOH1","IO12","FL1026_1CH_PE1"]
["FL1026_FIOH1","IO13","SPARE",null,null,null,null,null,null,null,null,null,null,null,null,null,null,null,null,null,null,"2025-06-18"]
["FL1026_FIOH1","IO14","FL1026_2_BCN1_A"]
["FL1026_FIOH1","IO15","FL1026_2_BCN1_B"]
["FL1034_FIOH1","IO0","SPARE"]
["FL1034_FIOH1","IO1","SPARE"]
["FL1034_FIOH1","IO2","SPARE"]
["FL1034_FIOH1","IO3","SPARE"]
["FL1034_FIOH1","IO4","SPARE"]
["FL1034_FIOH1","IO5","SPARE",null,null,null,null,null,null,null,null,null,null,null,null,null,null,null,null,null,null,"2025-06-18"]
["FL1034_FIOH1","IO6","SPARE"]
["FL1034_FIOH1","IO7","SPARE"]
["FL1034_FIOH1","IO8","FL1034_1_BCN1_A"]
["FL1034_FIOH1","IO9","FL1034_1_BCN1_B"]
["FL1034_FIOH1","IO10","FL1034_2_JR1_PB"]
["FL1034_FIOH1","IO11","FL1034_2_JR1_PB_LT"]
["FL1034_FIOH1","IO12","FL1034_1CH_PE1"]
["FL1034_FIOH1","IO13","SPARE",null,null,null,null,null,null,null,null,null,null,null,null,null,null,null,null,null,null,"2025-06-18"]
["FL1034_FIOH1","IO14","FL1034_2_BCN1_A"]
["FL1034_FIOH1","IO15","FL1034_2_BCN1_B"]
["FL3016_FIOH1","IO0","SPARE"]
["FL3016_FIOH1","IO1","SPARE"]
["FL3016_FIOH1","IO2","SPARE"]
["FL3016_FIOH1","IO3","SPARE"]
["FL3016_FIOH1","IO4","SPARE"]
["FL3016_FIOH1","IO5","SPARE",null,null,null,null,null,null,null,null,null,null,null,null,null,null,null,null,null,null,"2025-06-18"]
["FL3016_FIOH1","IO6","SPARE"]
["FL3016_FIOH1","IO7","SPARE"]
["FL3016_FIOH1","IO8","FL3016_1_BCN1_A"]
["FL3016_FIOH1","IO9","FL3016_1_BCN1_B"]
["FL3016_FIOH1","IO10","FL3016_2_JR1_PB"]
["FL3016_FIOH1","IO11","FL3016_2_JR1_PB_LT"]
["FL3016_FIOH1","IO12","FL3016_1CH_PE1"]
["FL3016_FIOH1","IO13","SPARE",null,null,null,null,null,null,null,null,null,null,null,null,null,null,null,null,null,null,"2025-06-18"]
["FL3016_FIOH1","IO14","FL3016_2_BCN1_A"]
["FL3016_FIOH1","IO15","FL3016_2_BCN1_B"]
["FL3024_FIOH1","IO0","SPARE"]
["FL3024_FIOH1","IO1","SPARE"]
["FL3024_FIOH1","IO2","SPARE"]
["FL3024_FIOH1","IO3","SPARE"]
["FL3024_FIOH1","IO4","SPARE"]
["FL3024_FIOH1","IO5","SPARE"]
["FL3024_FIOH1","IO6","SPARE"]
["FL3024_FIOH1","IO7","SPARE"]
["FL3024_FIOH1","IO8","FL3024_1_BCN1_A"]
["FL3024_FIOH1","IO9","FL3024_1_BCN1_B"]
["FL3024_FIOH1","IO10","FL3024_2_JR1_PB"]
["FL3024_FIOH1","IO11","FL3024_2_JR1_PB_LT"]
["FL3024_FIOH1","IO12","FL3024_1CH_PE1"]
["FL3024_FIOH1","IO13","SPARE"]
["FL3024_FIOH1","IO14","FL3024_2_BCN1_A"]
["FL3024_FIOH1","IO15","FL3024_2_BCN1_B"]
["S011004_FIOH1","IO0","S011004_PE1"]
["S011004_FIOH1","IO1","SPARE"]
["S011004_FIOH1","IO2","S011004_PE2"]
["S011004_FIOH1","IO3","SPARE"]
["S011004_FIOH1","IO4","S011004_PR1"]
["S011004_FIOH1","IO5","SPARE"]
["S011004_FIOH1","IO6","S011004_SOL1"]
["S011004_FIOH1","IO7","SPARE"]
["S011004_FIOH1","IO8","SPARE"]
["S011004_FIOH1","IO9","SPARE"]
["S011004_FIOH1","IO10","SPARE"]
["S011004_FIOH1","IO11","SPARE"]
["S011004_FIOH1","IO12","SPARE"]
["S011004_FIOH1","IO13","SPARE"]
["S011004_FIOH1","IO14","SPARE"]
["S011004_FIOH1","IO15","SPARE"]
["S011008_FIOH1","IO0","S011008_PE1"]
["S011008_FIOH1","IO1","SPARE"]
["S011008_FIOH1","IO2","S011008_PE2"]
["S011008_FIOH1","IO3","SPARE"]
["S011008_FIOH1","IO4","S011008_PR1"]
["S011008_FIOH1","IO5","SPARE"]
["S011008_FIOH1","IO6","S011008_SOL1"]
["S011008_FIOH1","IO7","SPARE"]
["S011008_FIOH1","IO8","S011006_PE1"]
["S011008_FIOH1","IO9","SPARE"]
["S011008_FIOH1","IO10","S011006_PE2"]
["S011008_FIOH1","IO11","SPARE"]
["S011008_FIOH1","IO12","S011006_PR1"]
["S011008_FIOH1","IO13","SPARE"]
["S011008_FIOH1","IO14","S011006_SOL1"]
["S011008_FIOH1","IO15","SPARE"]
["S011012_FIOH1","IO0","S011012_PE1"]
["S011012_FIOH1","IO1","SPARE"]
["S011012_FIOH1","IO2","S011012_PE2"]
["S011012_FIOH1","IO3","SPARE"]
["S011012_FIOH1","IO4","S011012_PR1"]
["S011012_FIOH1","IO5","SPARE"]
["S011012_FIOH1","IO6","S011012_SOL1"]
["S011012_FIOH1","IO7","SPARE"]
["S011012_FIOH1","IO8","S011010_PE1"]
["S011012_FIOH1","IO9","SPARE"]
["S011012_FIOH1","IO10","S011010_PE2"]
["S011012_FIOH1","IO11","SPARE"]
["S011012_FIOH1","IO12","S011010_PR1"]
["S011012_FIOH1","IO13","SPARE"]
["S011012_FIOH1","IO14","S011010_SOL1"]
["S011012_FIOH1","IO15","SPARE"]
["S011020_FIOH1","IO0","S011020_PE1"]
["S011020_FIOH1","IO1","SPARE"]
["S011020_FIOH1","IO2","S011020_PE2"]
["S011020_FIOH1","IO3","SPARE"]
["S011020_FIOH1","IO4","S011020_PR1"]
["S011020_FIOH1","IO5","SPARE"]
["S011020_FIOH1","IO6","S011020_SOL1"]
["S011020_FIOH1","IO7","SPARE"]
["S011020_FIOH1","IO8","FL1018_1_BCN1_A"]
["S011020_FIOH1","IO9","FL1018_1_BCN1_B"]
["S011020_FIOH1","IO10","FL1018_2_JR1_PB"]
["S011020_FIOH1","IO11","FL1018_2_JR1_PB_LT"]
["S011020_FIOH1","IO12","FL1018_1CH_PE1"]
["S011020_FIOH1","IO13","SPARE"]
["S011020_FIOH1","IO14","FL1018_2_BCN1_A"]
["S011020_FIOH1","IO15","FL1018_2_BCN1_B"]
["S011032_FIOH1","IO0","S011032_PE1"]
["S011032_FIOH1","IO1","SPARE"]
["S011032_FIOH1","IO2","S011032_PE2"]
["S011032_FIOH1","IO3","SPARE"]
["S011032_FIOH1","IO4","S011032_PR1"]
["S011032_FIOH1","IO5","SPARE"]
["S011032_FIOH1","IO6","S011032_SOL1"]
["S011032_FIOH1","IO7","SPARE"]
["S011032_FIOH1","IO8","S011030_PE1"]
["S011032_FIOH1","IO9","SPARE"]
["S011032_FIOH1","IO10","S011030_PE2"]
["S011032_FIOH1","IO11","SPARE"]
["S011032_FIOH1","IO12","S011030_PR1"]
["S011032_FIOH1","IO13","SPARE"]
["S011032_FIOH1","IO14","S011030_SOL1"]
["S011032_FIOH1","IO15","SPARE"]
["S011040_FIOH1","IO0","S011040_PE1"]
["S011040_FIOH1","IO1","SPARE"]
["S011040_FIOH1","IO2","S011040_PE2"]
["S011040_FIOH1","IO3","SPARE"]
["S011040_FIOH1","IO4","S011040_PR1"]
["S011040_FIOH1","IO5","SPARE"]
["S011040_FIOH1","IO6","S011040_SOL1"]
["S011040_FIOH1","IO7","SPARE"]
["S011040_FIOH1","IO8","FL1038_1_BCN1_A"]
["S011040_FIOH1","IO9","FL1038_1_BCN1_B"]
["S011040_FIOH1","IO10","FL1038_2_JR1_PB"]
["S011040_FIOH1","IO11","FL1038_2_JR1_PB_LT"]
["S011040_FIOH1","IO12","FL1038_1CH_PE1"]
["S011040_FIOH1","IO13","SPARE"]
["S011040_FIOH1","IO14","FL1038_2_BCN1_A"]
["S011040_FIOH1","IO15","FL1038_2_BCN1_B"]
["S011044_FIOH1","IO0","S011044_PE1"]
["S011044_FIOH1","IO1","SPARE"]
["S011044_FIOH1","IO2","S011044_PE2"]
["S011044_FIOH1","IO3","SPARE"]
["S011044_FIOH1","IO4","S011044_PR1"]
["S011044_FIOH1","IO5","SPARE"]
["S011044_FIOH1","IO6","S011044_SOL1"]
["S011044_FIOH1","IO7","SPARE"]
["S011044_FIOH1","IO8","S011042_PE1"]
["S011044_FIOH1","IO9","SPARE"]
["S011044_FIOH1","IO10","S011042_PE2"]
["S011044_FIOH1","IO11","SPARE"]
["S011044_FIOH1","IO12","S011042_PR1"]
["S011044_FIOH1","IO13","SPARE"]
["S011044_FIOH1","IO14","S011042_SOL1"]
["S011044_FIOH1","IO15","SPARE"]
["S011048_FIOH1","IO0","S011048_PE1"]
["S011048_FIOH1","IO1","SPARE"]
["S011048_FIOH1","IO2","S011048_PE2"]
["S011048_FIOH1","IO3","SPARE"]
["S011048_FIOH1","IO4","S011048_PR1"]
["S011048_FIOH1","IO5","SPARE"]
["S011048_FIOH1","IO6","S011048_SOL1"]
["S011048_FIOH1","IO7","SPARE"]
["S011048_FIOH1","IO8","S011046_PE1"]
["S011048_FIOH1","IO9","SPARE"]
["S011048_FIOH1","IO10","S011046_PE2"]
["S011048_FIOH1","IO11","SPARE"]
["S011048_FIOH1","IO12","S011046_PR1"]
["S011048_FIOH1","IO13","SPARE"]
["S011048_FIOH1","IO14","S011046_SOL1"]
["S011048_FIOH1","IO15","SPARE"]
["S011052_FIOH1","IO0","S011052_PE1"]
["S011052_FIOH1","IO1","SPARE"]
["S011052_FIOH1","IO2","S011052_PE2"]
["S011052_FIOH1","IO3","SPARE"]
["S011052_FIOH1","IO4","S011052_PR1"]
["S011052_FIOH1","IO5","SPARE"]
["S011052_FIOH1","IO6","S011052_SOL1"]
["S011052_FIOH1","IO7","SPARE"]
["S011052_FIOH1","IO8","S011050_PE1"]
["S011052_FIOH1","IO9","SPARE"]
["S011052_FIOH1","IO10","S011050_PE2"]
["S011052_FIOH1","IO11","SPARE"]
["S011052_FIOH1","IO12","S011050_PR1"]
["S011052_FIOH1","IO13","SPARE"]
["S011052_FIOH1","IO14","S011050_SOL1"]
["S011052_FIOH1","IO15","SPARE"]
["S011056_FIOH1","IO0","S011056_PE1"]
["S011056_FIOH1","IO1","SPARE"]
["S011056_FIOH1","IO2","S011056_PE2"]
["S011056_FIOH1","IO3","SPARE"]
["S011056_FIOH1","IO4","S011056_PR1"]
["S011056_FIOH1","IO5","SPARE"]
["S011056_FIOH1","IO6","S011056_SOL1"]
["S011056_FIOH1","IO7","SPARE"]
["S011056_FIOH1","IO8","S011054_PE1"]
["S011056_FIOH1","IO9","SPARE"]
["S011056_FIOH1","IO10","S011054_PE2"]
["S011056_FIOH1","IO11","SPARE"]
["S011056_FIOH1","IO12","S011054_PR1"]
["S011056_FIOH1","IO13","SPARE"]
["S011056_FIOH1","IO14","S011054_SOL1"]
["S011056_FIOH1","IO15","SPARE"]
["S013004_FIOH1","IO0","S013002_PE1"]
["S013004_FIOH1","IO1","SPARE"]
["S013004_FIOH1","IO2","S013002_PE2"]
["S013004_FIOH1","IO3","SPARE"]
["S013004_FIOH1","IO4","S013002_PR1"]
["S013004_FIOH1","IO5","SPARE"]
["S013004_FIOH1","IO6","S013002_SOL1"]
["S013004_FIOH1","IO7","SPARE"]
["S013004_FIOH1","IO8","S013004_PE1"]
["S013004_FIOH1","IO9","SPARE"]
["S013004_FIOH1","IO10","S013004_PE2"]
["S013004_FIOH1","IO11","SPARE"]
["S013004_FIOH1","IO12","S013004_PR1"]
["S013004_FIOH1","IO13","SPARE"]
["S013004_FIOH1","IO14","S013004_SOL1"]
["S013004_FIOH1","IO15","SPARE"]
["S013008_FIOH1","IO0","S013006_PE1"]
["S013008_FIOH1","IO1","SPARE"]
["S013008_FIOH1","IO2","S013006_PE2"]
["S013008_FIOH1","IO3","SPARE"]
["S013008_FIOH1","IO4","S013006_PR1"]
["S013008_FIOH1","IO5","SPARE"]
["S013008_FIOH1","IO6","S013006_SOL1"]
["S013008_FIOH1","IO7","SPARE"]
["S013008_FIOH1","IO8","S013008_PE1"]
["S013008_FIOH1","IO9","SPARE"]
["S013008_FIOH1","IO10","S013008_PE2"]
["S013008_FIOH1","IO11","SPARE"]
["S013008_FIOH1","IO12","S013008_PR1"]
["S013008_FIOH1","IO13","SPARE"]
["S013008_FIOH1","IO14","S013008_SOL1"]
["S013008_FIOH1","IO15","SPARE"]
["S013010_FIOH1","IO0","S013010_PE1"]
["S013010_FIOH1","IO1","SPARE"]
["S013010_FIOH1","IO2","S013010_PE2"]
["S013010_FIOH1","IO3","SPARE"]
["S013010_FIOH1","IO4","S013010_PR1"]
["S013010_FIOH1","IO5","SPARE"]
["S013010_FIOH1","IO6","S013010_SOL1"]
["S013010_FIOH1","IO7","SPARE"]
["S013010_FIOH1","IO8","FL3012_1_BCN1_A"]
["S013010_FIOH1","IO9","FL3012_1_BCN1_B"]
["S013010_FIOH1","IO10","FL3012_2_JR1_PB"]
["S013010_FIOH1","IO11","FL3012_2_JR1_PB_LT"]
["S013010_FIOH1","IO12","FL3012_1CH_PE1"]
["S013010_FIOH1","IO13","SPARE"]
["S013010_FIOH1","IO14","FL3012_2_BCN1_A"]
["S013010_FIOH1","IO15","FL3012_2_BCN1_B"]
["S013018_FIOH1","IO0","S013018_PE1"]
["S013018_FIOH1","IO1","SPARE"]
["S013018_FIOH1","IO2","S013018_PE2"]
["S013018_FIOH1","IO3","SPARE"]
["S013018_FIOH1","IO4","S013018_PR1"]
["S013018_FIOH1","IO5","SPARE"]
["S013018_FIOH1","IO6","S013018_SOL1"]
["S013018_FIOH1","IO7","SPARE"]
["S013018_FIOH1","IO8","FL3020_1_BCN1_A"]
["S013018_FIOH1","IO9","FL3020_1_BCN1_B"]
["S013018_FIOH1","IO10","FL3020_2_JR1_PB"]
["S013018_FIOH1","IO11","FL3020_2_JR1_PB_LT"]
["S013018_FIOH1","IO12","FL3020_1CH_PE1"]
["S013018_FIOH1","IO13","SPARE"]
["S013018_FIOH1","IO14","FL3020_2_BCN1_A"]
["S013018_FIOH1","IO15","FL3020_2_BCN1_B"]
["S013028_FIOH1","IO0","S013026_PE1"]
["S013028_FIOH1","IO1","SPARE"]
["S013028_FIOH1","IO2","S013026_PE2"]
["S013028_FIOH1","IO3","SPARE"]
["S013028_FIOH1","IO4","S013026_PR1"]
["S013028_FIOH1","IO5","SPARE"]
["S013028_FIOH1","IO6","S013026_SOL1"]
["S013028_FIOH1","IO7","SPARE"]
["S013028_FIOH1","IO8","S013028_PE1"]
["S013028_FIOH1","IO9","SPARE"]
["S013028_FIOH1","IO10","S013028_PE2"]
["S013028_FIOH1","IO11","SPARE"]
["S013028_FIOH1","IO12","S013028_PR1"]
["S013028_FIOH1","IO13","SPARE"]
["S013028_FIOH1","IO14","S013028_SOL1"]
["S013028_FIOH1","IO15","SPARE"]
["S013032_FIOH1","IO0","SPARE"]
["S013032_FIOH1","IO1","SPARE"]
["S013032_FIOH1","IO2","SPARE"]
["S013032_FIOH1","IO3","SPARE"]
["S013032_FIOH1","IO4","SPARE"]
["S013032_FIOH1","IO5","SPARE"]
["S013032_FIOH1","IO6","SPARE"]
["S013032_FIOH1","IO7","SPARE"]
["S013032_FIOH1","IO8","S013032_PE1"]
["S013032_FIOH1","IO9","SPARE"]
["S013032_FIOH1","IO10","S013032_PE2"]
["S013032_FIOH1","IO11","SPARE"]
["S013032_FIOH1","IO12","S013032_PR1"]
["S013032_FIOH1","IO13","SPARE"]
["S013032_FIOH1","IO14","S013032_SOL1"]
["S013032_FIOH1","IO15","SPARE"]
["S013036_FIOH1","IO0","S013034_PE1"]
["S013036_FIOH1","IO1","SPARE"]
["S013036_FIOH1","IO2","S013034_PE2"]
["S013036_FIOH1","IO3","SPARE"]
["S013036_FIOH1","IO4","S013034_PR1"]
["S013036_FIOH1","IO5","SPARE"]
["S013036_FIOH1","IO6","S013034_SOL1"]
["S013036_FIOH1","IO7","SPARE"]
["S013036_FIOH1","IO8","S013036_PE1"]
["S013036_FIOH1","IO9","SPARE"]
["S013036_FIOH1","IO10","S013036_PE2"]
["S013036_FIOH1","IO11","SPARE"]
["S013036_FIOH1","IO12","S013036_PR1"]
["S013036_FIOH1","IO13","SPARE"]
["S013036_FIOH1","IO14","S013036_SOL1"]
["S013036_FIOH1","IO15","SPARE"]
["S013040_FIOH1","IO0","S013038_PE1"]
["S013040_FIOH1","IO1","SPARE"]
["S013040_FIOH1","IO2","S013038_PE2"]
["S013040_FIOH1","IO3","SPARE"]
["S013040_FIOH1","IO4","S013038_PR1"]
["S013040_FIOH1","IO5","SPARE"]
["S013040_FIOH1","IO6","S013038_SOL1"]
["S013040_FIOH1","IO7","SPARE"]
["S013040_FIOH1","IO8","S013040_PE1"]
["S013040_FIOH1","IO9","SPARE"]
["S013040_FIOH1","IO10","S013040_PE2"]
["S013040_FIOH1","IO11","SPARE"]
["S013040_FIOH1","IO12","S013040_PR1"]
["S013040_FIOH1","IO13","SPARE"]
["S013040_FIOH1","IO14","S013040_SOL1"]
["S013040_FIOH1","IO15","SPARE"]
["S013044_FIOH1","IO0","S013042_PE1"]
["S013044_FIOH1","IO1","SPARE"]
["S013044_FIOH1","IO2","S013042_PE2"]
["S013044_FIOH1","IO3","SPARE"]
["S013044_FIOH1","IO4","S013042_PR1"]
["S013044_FIOH1","IO5","SPARE"]
["S013044_FIOH1","IO6","S013042_SOL1"]
["S013044_FIOH1","IO7","SPARE"]
["S013044_FIOH1","IO8","S013044_PE1"]
["S013044_FIOH1","IO9","SPARE"]
["S013044_FIOH1","IO10","S013044_PE2"]
["S013044_FIOH1","IO11","SPARE"]
["S013044_FIOH1","IO12","S013044_PR1"]
["S013044_FIOH1","IO13","SPARE"]
["S013044_FIOH1","IO14","S013044_SOL1"]
["S013044_FIOH1","IO15","SPARE"]
["S013048_FIOH1","IO0","S013046_PE1"]
["S013048_FIOH1","IO1","SPARE"]
["S013048_FIOH1","IO2","S013046_PE2"]
["S013048_FIOH1","IO3","SPARE"]
["S013048_FIOH1","IO4","S013046_PR1"]
["S013048_FIOH1","IO5","SPARE"]
["S013048_FIOH1","IO6","S013046_SOL1"]
["S013048_FIOH1","IO7","SPARE"]
["S013048_FIOH1","IO8","S013048_PE1"]
["S013048_FIOH1","IO9","SPARE"]
["S013048_FIOH1","IO10","S013048_PE2"]
["S013048_FIOH1","IO11","SPARE"]
["S013048_FIOH1","IO12","S013048_PR1"]
["S013048_FIOH1","IO13","SPARE"]
["S013048_FIOH1","IO14","S013048_SOL1"]
["S013048_FIOH1","IO15","SPARE"]
["S013052_FIOH1","IO0","S013050_PE1"]
["S013052_FIOH1","IO1","SPARE"]
["S013052_FIOH1","IO2","S013050_PE2"]
["S013052_FIOH1","IO3","SPARE"]
["S013052_FIOH1","IO4","S013050_PR1"]
["S013052_FIOH1","IO5","SPARE"]
["S013052_FIOH1","IO6","S013050_SOL1"]
["S013052_FIOH1","IO7","SPARE"]
["S013052_FIOH1","IO8","S013052_PE1"]
["S013052_FIOH1","IO9","SPARE"]
["S013052_FIOH1","IO10","S013052_PE2"]
["S013052_FIOH1","IO11","SPARE"]
["S013052_FIOH1","IO12","S013052_PR1"]
["S013052_FIOH1","IO13","SPARE"]
["S013052_FIOH1","IO14","S013052_SOL1"]
["S013052_FIOH1","IO15","SPARE"]
["S013056_FIOH1","IO0","S013054_PE1"]
["S013056_FIOH1","IO1","SPARE"]
["S013056_FIOH1","IO2","S013054_PE2"]
["S013056_FIOH1","IO3","SPARE"]
["S013056_FIOH1","IO4","S013054_PR1"]
["S013056_FIOH1","IO5","SPARE"]
["S013056_FIOH1","IO6","S013054_SOL1"]
["S013056_FIOH1","IO7","SPARE"]
["S013056_FIOH1","IO8","S013056_PE1"]
["S013056_FIOH1","IO9","SPARE"]
["S013056_FIOH1","IO10","S013056_PE2"]
["S013056_FIOH1","IO11","SPARE"]
["S013056_FIOH1","IO12","S013056_PR1"]
["S013056_FIOH1","IO13","SPARE"]
["S013056_FIOH1","IO14","S013056_SOL1"]
["S013056_FIOH1","IO15","SPARE"]
["S013060_FIOH1","IO0","S013058_PE1"]
["S013060_FIOH1","IO1","SPARE"]
["S013060_FIOH1","IO2","S013058_PE2"]
["S013060_FIOH1","IO3","SPARE"]
["S013060_FIOH1","IO4","S013058_PR1"]
["S013060_FIOH1","IO5","SPARE"]
["S013060_FIOH1","IO6","S013058_SOL1"]
["S013060_FIOH1","IO7","SPARE"]
["S013060_FIOH1","IO8","S013060_PE1"]
["S013060_FIOH1","IO9","SPARE"]
["S013060_FIOH1","IO10","S013060_PE2"]
["S013060_FIOH1","IO11","SPARE"]
["S013060_FIOH1","IO12","S013060_PR1"]
["S013060_FIOH1","IO13","SPARE"]
["S013060_FIOH1","IO14","S013060_SOL1"]
["S013060_FIOH1","IO15","SPARE"]
["S013064_FIOH1","IO0","SPARE"]
["S013064_FIOH1","IO1","SPARE"]
["S013064_FIOH1","IO2","SPARE"]
["S013064_FIOH1","IO3","SPARE"]
["S013064_FIOH1","IO4","SPARE"]
["S013064_FIOH1","IO5","SPARE"]
["S013064_FIOH1","IO6","SPARE"]
["S013064_FIOH1","IO7","SPARE"]
["S013064_FIOH1","IO8","S013064_PE1"]
["S013064_FIOH1","IO9","SPARE"]
["S013064_FIOH1","IO10","S013064_PE2"]
["S013064_FIOH1","IO11","SPARE"]
["S013064_FIOH1","IO12","S013064_PR1"]
["S013064_FIOH1","IO13","SPARE"]
["S013064_FIOH1","IO14","S013064_SOL1"]
["S013064_FIOH1","IO15","SPARE"]
["S013068_FIOH1","IO0","S013066_PE1"]
["S013068_FIOH1","IO1","SPARE"]
["S013068_FIOH1","IO2","S013066_PE2"]
["S013068_FIOH1","IO3","SPARE"]
["S013068_FIOH1","IO4","S013066_PR1"]
["S013068_FIOH1","IO5","SPARE"]
["S013068_FIOH1","IO6","S013066_SOL1"]
["S013068_FIOH1","IO7","SPARE"]
["S013068_FIOH1","IO8","S013068_PE1"]
["S013068_FIOH1","IO9","SPARE"]
["S013068_FIOH1","IO10","S013068_PE2"]
["S013068_FIOH1","IO11","SPARE"]
["S013068_FIOH1","IO12","S013068_PR1"]
["S013068_FIOH1","IO13","SPARE"]
["S013068_FIOH1","IO14","S013068_SOL1"]
["S013068_FIOH1","IO15","SPARE"]
["S013072_FIOH1","IO0","S013070_PE1"]
["S013072_FIOH1","IO1","SPARE"]
["S013072_FIOH1","IO2","S013070_PE2"]
["S013072_FIOH1","IO3","SPARE"]
["S013072_FIOH1","IO4","S013070_PR1"]
["S013072_FIOH1","IO5","SPARE"]
["S013072_FIOH1","IO6","S013070_SOL1"]
["S013072_FIOH1","IO7","SPARE"]
["S013072_FIOH1","IO8","S013072_PE1"]
["S013072_FIOH1","IO9","SPARE"]
["S013072_FIOH1","IO10","S013072_PE2"]
["S013072_FIOH1","IO11","SPARE"]
["S013072_FIOH1","IO12","S013072_PR1"]
["S013072_FIOH1","IO13","SPARE"]
["S013072_FIOH1","IO14","S013072_SOL1"]
["S013072_FIOH1","IO15","SPARE"]
["S013076_FIOH1","IO0","S013074_PE1"]
["S013076_FIOH1","IO1","SPARE"]
["S013076_FIOH1","IO2","S013074_PE2"]
["S013076_FIOH1","IO3","SPARE"]
["S013076_FIOH1","IO4","S013074_PR1"]
["S013076_FIOH1","IO5","SPARE"]
["S013076_FIOH1","IO6","S013074_SOL1"]
["S013076_FIOH1","IO7","SPARE"]
["S013076_FIOH1","IO8","S013076_PE1"]
["S013076_FIOH1","IO9","SPARE"]
["S013076_FIOH1","IO10","S013076_PE2"]
["S013076_FIOH1","IO11","SPARE"]
["S013076_FIOH1","IO12","S013076_PR1"]
["S013076_FIOH1","IO13","SPARE"]
["S013076_FIOH1","IO14","S013076_SOL1"]
["S013076_FIOH1","IO15","SPARE"]
["S013080_FIOH1","IO0","S013078_PE1"]
["S013080_FIOH1","IO1","SPARE"]
["S013080_FIOH1","IO2","S013078_PE2"]
["S013080_FIOH1","IO3","SPARE"]
["S013080_FIOH1","IO4","S013078_PR1"]
["S013080_FIOH1","IO5","SPARE"]
["S013080_FIOH1","IO6","S013078_SOL1"]
["S013080_FIOH1","IO7","SPARE"]
["S013080_FIOH1","IO8","S013080_PE1"]
["S013080_FIOH1","IO9","SPARE"]
["S013080_FIOH1","IO10","S013080_PE2"]
["S013080_FIOH1","IO11","SPARE"]
["S013080_FIOH1","IO12","S013080_PR1"]
["S013080_FIOH1","IO13","SPARE"]
["S013080_FIOH1","IO14","S013080_SOL1"]
["S013080_FIOH1","IO15","SPARE"]
["S013084_FIOH1","IO0","S013082_PE1"]
["S013084_FIOH1","IO1","SPARE"]
["S013084_FIOH1","IO2","S013082_PE2"]
["S013084_FIOH1","IO3","SPARE"]
["S013084_FIOH1","IO4","S013082_PR1"]
["S013084_FIOH1","IO5","SPARE"]
["S013084_FIOH1","IO6","S013082_SOL1"]
["S013084_FIOH1","IO7","SPARE"]
["S013084_FIOH1","IO8","S013084_PE1"]
["S013084_FIOH1","IO9","SPARE"]
["S013084_FIOH1","IO10","S013084_PE2"]
["S013084_FIOH1","IO11","SPARE"]
["S013084_FIOH1","IO12","S013084_PR1"]
["S013084_FIOH1","IO13","SPARE"]
["S013084_FIOH1","IO14","S013084_SOL1"]
["S013084_FIOH1","IO15","SPARE"]
["S013088_FIOH1","IO0","S013086_PE1"]
["S013088_FIOH1","IO1","SPARE"]
["S013088_FIOH1","IO2","S013086_PE2"]
["S013088_FIOH1","IO3","SPARE"]
["S013088_FIOH1","IO4","S013086_PR1"]
["S013088_FIOH1","IO5","SPARE"]
["S013088_FIOH1","IO6","S013086_SOL1"]
["S013088_FIOH1","IO7","SPARE"]
["S013088_FIOH1","IO8","S013088_PE1"]
["S013088_FIOH1","IO9","SPARE"]
["S013088_FIOH1","IO10","S013088_PE2"]
["S013088_FIOH1","IO11","SPARE"]
["S013088_FIOH1","IO12","S013088_PR1"]
["S013088_FIOH1","IO13","SPARE"]
["S013088_FIOH1","IO14","S013088_SOL1"]
["S013088_FIOH1","IO15","SPARE"]
["S013092_FIOH1","IO0","S013090_PE1"]
["S013092_FIOH1","IO1","SPARE"]
["S013092_FIOH1","IO2","S013090_PE2"]
["S013092_FIOH1","IO3","SPARE"]
["S013092_FIOH1","IO4","S013090_PR1"]
["S013092_FIOH1","IO5","SPARE"]
["S013092_FIOH1","IO6","S013090_SOL1"]
["S013092_FIOH1","IO7","SPARE"]
["S013092_FIOH1","IO8","S013092_PE1"]
["S013092_FIOH1","IO9","SPARE"]
["S013092_FIOH1","IO10","S013092_PE2"]
["S013092_FIOH1","IO11","SPARE"]
["S013092_FIOH1","IO12","S013092_PR1"]
["S013092_FIOH1","IO13","SPARE"]
["S013092_FIOH1","IO14","S013092_SOL1"]
["S013092_FIOH1","IO15","SPARE"]
["S013094_FIOH1","IO0","S013094_PE1"]
["S013094_FIOH1","IO1","SPARE"]
["S013094_FIOH1","IO2","S013094_PE2"]
["S013094_FIOH1","IO3","SPARE"]
["S013094_FIOH1","IO4","S013094_PR1"]
["S013094_FIOH1","IO5","SPARE"]
["S013094_FIOH1","IO6","S013094_SOL1"]
["S013094_FIOH1","IO7","SPARE"]
["S013094_FIOH1","IO8","SPARE"]
["S013094_FIOH1","IO9","SPARE"]
["S013094_FIOH1","IO10","SPARE"]
["S013094_FIOH1","IO11","SPARE"]
["S013094_FIOH1","IO12","SPARE"]
["S013094_FIOH1","IO13","SPARE"]
["S013094_FIOH1","IO14","SPARE"]
["S013094_FIOH1","IO15","SPARE"]
["VSA_DPM1_FIO1","IO0","SPARE"]
["VSA_DPM1_FIO1","IO1","SPARE"]
["VSA_DPM1_FIO1","IO2","S011003_BCN1"]
["VSA_DPM1_FIO1","IO3","SPARE"]
["VSA_DPM1_FIO1","IO4","SPARE"]
["VSA_DPM1_FIO1","IO5","SPARE"]
["VSA_DPM1_FIO1","IO6","S011003_GS1_PB"]
["VSA_DPM1_FIO1","IO7","S011003_GS1_PB_LT"]
["VSA_DPM1_FIO1","IO8","S011005_BCN1"]
["VSA_DPM1_FIO1","IO9","SPARE"]
["VSA_DPM1_FIO1","IO10","S011007_BCN1"]
["VSA_DPM1_FIO1","IO11","SPARE"]
["VSA_DPM1_FIO1","IO12","S011005_GS1_PB"]
["VSA_DPM1_FIO1","IO13","S011005_GS1_PB_LT"]
["VSA_DPM1_FIO1","IO14","S011007_GS1_PB"]
["VSA_DPM1_FIO1","IO15","S011007_GS1_PB_LT"]
["VSA_DPM1_FIO2","IO0","S011008_BCN1"]
["VSA_DPM1_FIO2","IO1","SPARE"]
["VSA_DPM1_FIO2","IO2","S011006_BCN1"]
["VSA_DPM1_FIO2","IO3","SPARE"]
["VSA_DPM1_FIO2","IO4","S011008_FIOH1"]
["VSA_DPM1_FIO2","IO5","SPARE"]
["VSA_DPM1_FIO2","IO6","S011004_JR1_PB"]
["VSA_DPM1_FIO2","IO7","S011004_JR1_PB_LT"]
["VSA_DPM1_FIO2","IO8","S011004_BCN1"]
["VSA_DPM1_FIO2","IO9","SPARE"]
["VSA_DPM1_FIO2","IO10","SPARE"]
["VSA_DPM1_FIO2","IO11","SPARE"]
["VSA_DPM1_FIO2","IO12","S011004_FIOH1"]
["VSA_DPM1_FIO2","IO13","SPARE"]
["VSA_DPM1_FIO2","IO14","S011003_JR1_PB"]
["VSA_DPM1_FIO2","IO15","S011003_JR1_PB_LT"]
["VSA_DPM1_FIO3","IO0","S011009_BCN1"]
["VSA_DPM1_FIO3","IO1","SPARE"]
["VSA_DPM1_FIO3","IO2","S011011_BCN1"]
["VSA_DPM1_FIO3","IO3","SPARE"]
["VSA_DPM1_FIO3","IO4","S011009_GS1_PB"]
["VSA_DPM1_FIO3","IO5","S011009_GS1_PB_LT"]
["VSA_DPM1_FIO3","IO6","S011011_GS1_PB"]
["VSA_DPM1_FIO3","IO7","S011011_GS1_PB_LT"]
["VSA_DPM1_FIO3","IO8","S011013_BCN1"]
["VSA_DPM1_FIO3","IO9","SPARE"]
["VSA_DPM1_FIO3","IO10","SPARE"]
["VSA_DPM1_FIO3","IO11","SPARE"]
["VSA_DPM1_FIO3","IO12","S011013_GS1_PB"]
["VSA_DPM1_FIO3","IO13","S011013_GS1_PB_LT"]
["VSA_DPM1_FIO3","IO14","SPARE"]
["VSA_DPM1_FIO3","IO15","SPARE"]
["VSA_DPM1_FIO4","IO0","SPARE"]
["VSA_DPM1_FIO4","IO1","SPARE"]
["VSA_DPM1_FIO4","IO2","SPARE"]
["VSA_DPM1_FIO4","IO3","SPARE"]
["VSA_DPM1_FIO4","IO4","FL1014_FIOH1"]
["VSA_DPM1_FIO4","IO5","SPARE"]
["VSA_DPM1_FIO4","IO6","S011012_JR1_PB"]
["VSA_DPM1_FIO4","IO7","S011012_JR1_PB_LT"]
["VSA_DPM1_FIO4","IO8","S011012_BCN1"]
["VSA_DPM1_FIO4","IO9","SPARE"]
["VSA_DPM1_FIO4","IO10","S011010_BCN1"]
["VSA_DPM1_FIO4","IO11","SPARE"]
["VSA_DPM1_FIO4","IO12","S011012_FIOH1"]
["VSA_DPM1_FIO4","IO13","SPARE"]
["VSA_DPM1_FIO4","IO14","S011011_JR1_PB"]
["VSA_DPM1_FIO4","IO15","S011011_JR1_PB_LT"]
["VSA_DPM1_FIO5","IO0","S011017_BCN1"]
["VSA_DPM1_FIO5","IO1","SPARE"]
["VSA_DPM1_FIO5","IO2","S011019_BCN1"]
["VSA_DPM1_FIO5","IO3","SPARE"]
["VSA_DPM1_FIO5","IO4","S011017_GS1_PB"]
["VSA_DPM1_FIO5","IO5","S011017_GS1_PB_LT"]
["VSA_DPM1_FIO5","IO6","S011019_GS1_PB"]
["VSA_DPM1_FIO5","IO7","S011019_GS1_PB_LT"]
["VSA_DPM1_FIO5","IO8","S011021_BCN1"]
["VSA_DPM1_FIO5","IO9","SPARE"]
["VSA_DPM1_FIO5","IO10","S011023_BCN1"]
["VSA_DPM1_FIO5","IO11","SPARE"]
["VSA_DPM1_FIO5","IO12","S011021_GS1_PB"]
["VSA_DPM1_FIO5","IO13","S011021_GS1_PB_LT"]
["VSA_DPM1_FIO5","IO14","S011023_GS1_PB"]
["VSA_DPM1_FIO5","IO15","S011023_GS1_PB_LT"]
["VSA_DPM1_FIO6","IO0","SPARE"]
["VSA_DPM1_FIO6","IO1","SPARE"]
["VSA_DPM1_FIO6","IO2","SPARE"]
["VSA_DPM1_FIO6","IO3","SPARE"]
["VSA_DPM1_FIO6","IO4","FL1022_FIOH1"]
["VSA_DPM1_FIO6","IO5","SPARE"]
["VSA_DPM1_FIO6","IO6","S011020_JR1_PB"]
["VSA_DPM1_FIO6","IO7","S011020_JR1_PB_LT"]
["VSA_DPM1_FIO6","IO8","S011020_BCN1"]
["VSA_DPM1_FIO6","IO9","SPARE"]
["VSA_DPM1_FIO6","IO10","SPARE"]
["VSA_DPM1_FIO6","IO11","SPARE"]
["VSA_DPM1_FIO6","IO12","S011020_FIOH1"]
["VSA_DPM1_FIO6","IO13","SPARE"]
["VSA_DPM1_FIO6","IO14","S011021_JR1_PB"]
["VSA_DPM1_FIO6","IO15","S011021_JR1_PB_LT"]
["VSA_DPM1_FIO7","IO0","S011025_BCN1"]
["VSA_DPM1_FIO7","IO1","SPARE"]
["VSA_DPM1_FIO7","IO2","SPARE"]
["VSA_DPM1_FIO7","IO3","SPARE"]
["VSA_DPM1_FIO7","IO4","S011025_GS1_PB"]
["VSA_DPM1_FIO7","IO5","S011025_GS1_PB_LT"]
["VSA_DPM1_FIO7","IO6","SPARE"]
["VSA_DPM1_FIO7","IO7","SPARE"]
["VSA_DPM1_FIO7","IO8","SPARE"]
["VSA_DPM1_FIO7","IO9","SPARE"]
["VSA_DPM1_FIO7","IO10","SPARE"]
["VSA_DPM1_FIO7","IO11","SPARE"]
["VSA_DPM1_FIO7","IO12","SPARE"]
["VSA_DPM1_FIO7","IO13","SPARE"]
["VSA_DPM1_FIO7","IO14","SPARE"]
["VSA_DPM1_FIO7","IO15","SPARE"]
["VSA_DPM1_FIO8","IO0","S011032_BCN1"]
["VSA_DPM1_FIO8","IO1","SPARE"]
["VSA_DPM1_FIO8","IO2","S011030_BCN1"]
["VSA_DPM1_FIO8","IO3","SPARE"]
["VSA_DPM1_FIO8","IO4","S011032_FIOH1"]
["VSA_DPM1_FIO8","IO5","SPARE"]
["VSA_DPM1_FIO8","IO6","S011030_JR1_PB"]
["VSA_DPM1_FIO8","IO7","S011030_JR1_PB_LT"]
["VSA_DPM1_FIO8","IO8","SPARE"]
["VSA_DPM1_FIO8","IO9","SPARE"]
["VSA_DPM1_FIO8","IO10","SPARE"]
["VSA_DPM1_FIO8","IO11","SPARE"]
["VSA_DPM1_FIO8","IO12","FL1026_FIOH1"]
["VSA_DPM1_FIO8","IO13","SPARE"]
["VSA_DPM1_FIO8","IO14","SPARE"]
["VSA_DPM1_FIO8","IO15","SPARE"]
["VSA_DPM2_FIO1","IO0","S011033_BCN1"]
["VSA_DPM2_FIO1","IO1","SPARE"]
["VSA_DPM2_FIO1","IO2","S011035_BCN1"]
["VSA_DPM2_FIO1","IO3","SPARE"]
["VSA_DPM2_FIO1","IO4","S011033_GS1_PB"]
["VSA_DPM2_FIO1","IO5","S011033_GS1_PB_LT"]
["VSA_DPM2_FIO1","IO6","S011035_GS1_PB"]
["VSA_DPM2_FIO1","IO7","S011035_GS1_PB_LT"]
["VSA_DPM2_FIO1","IO8","S011037_BCN1"]
["VSA_DPM2_FIO1","IO9","SPARE"]
["VSA_DPM2_FIO1","IO10","S011039_BCN1"]
["VSA_DPM2_FIO1","IO11","SPARE"]
["VSA_DPM2_FIO1","IO12","S011037_GS1_PB"]
["VSA_DPM2_FIO1","IO13","S011037_GS1_PB_LT"]
["VSA_DPM2_FIO1","IO14","S011039_GS1_PB"]
["VSA_DPM2_FIO1","IO15","S011039_GS1_PB_LT"]
["VSA_DPM2_FIO2","IO0","S011040_BCN1"]
["VSA_DPM2_FIO2","IO1","SPARE"]
["VSA_DPM2_FIO2","IO2","SPARE"]
["VSA_DPM2_FIO2","IO3","SPARE"]
["VSA_DPM2_FIO2","IO4","S011040_FIOH1"]
["VSA_DPM2_FIO2","IO5","SPARE"]
["VSA_DPM2_FIO2","IO6","SPARE"]
["VSA_DPM2_FIO2","IO7","SPARE"]
["VSA_DPM2_FIO2","IO8","SPARE"]
["VSA_DPM2_FIO2","IO9","SPARE"]
["VSA_DPM2_FIO2","IO10","SPARE"]
["VSA_DPM2_FIO2","IO11","SPARE"]
["VSA_DPM2_FIO2","IO12","FL1034_FIOH1"]
["VSA_DPM2_FIO2","IO13","SPARE"]
["VSA_DPM2_FIO2","IO14","S011033_JR1_PB"]
["VSA_DPM2_FIO2","IO15","S011033_JR1_PB_LT"]
["VSA_DPM2_FIO3","IO0","S011041_BCN1"]
["VSA_DPM2_FIO3","IO1","SPARE"]
["VSA_DPM2_FIO3","IO2","S011043_BCN1"]
["VSA_DPM2_FIO3","IO3","SPARE"]
["VSA_DPM2_FIO3","IO4","S011041_GS1_PB"]
["VSA_DPM2_FIO3","IO5","S011041_GS1_PB_LT"]
["VSA_DPM2_FIO3","IO6","S011043_GS1_PB"]
["VSA_DPM2_FIO3","IO7","S011043_GS1_PB_LT"]
["VSA_DPM2_FIO3","IO8","SPARE"]
["VSA_DPM2_FIO3","IO9","SPARE"]
["VSA_DPM2_FIO3","IO10","S011047_BCN1"]
["VSA_DPM2_FIO3","IO11","SPARE"]
["VSA_DPM2_FIO3","IO12","SPARE"]
["VSA_DPM2_FIO3","IO13","SPARE"]
["VSA_DPM2_FIO3","IO14","S011047_GS1_PB"]
["VSA_DPM2_FIO3","IO15","S011047_GS1_PB_LT"]
["VSA_DPM2_FIO4","IO0","S011048_BCN1"]
["VSA_DPM2_FIO4","IO1","SPARE"]
["VSA_DPM2_FIO4","IO2","S011046_BCN1"]
["VSA_DPM2_FIO4","IO3","SPARE"]
["VSA_DPM2_FIO4","IO4","S011048_FIOH1"]
["VSA_DPM2_FIO4","IO5","SPARE"]
["VSA_DPM2_FIO4","IO6","S011042_JR1_PB"]
["VSA_DPM2_FIO4","IO7","S011042_JR1_PB_LT"]
["VSA_DPM2_FIO4","IO8","S011044_BCN1"]
["VSA_DPM2_FIO4","IO9","SPARE"]
["VSA_DPM2_FIO4","IO10","S011042_BCN1"]
["VSA_DPM2_FIO4","IO11","SPARE"]
["VSA_DPM2_FIO4","IO12","S011044_FIOH1"]
["VSA_DPM2_FIO4","IO13","SPARE"]
["VSA_DPM2_FIO4","IO14","S011041_JR1_PB"]
["VSA_DPM2_FIO4","IO15","S011041_JR1_PB_LT"]
["VSA_DPM2_FIO5","IO0","S011049_BCN1"]
["VSA_DPM2_FIO5","IO1","SPARE"]
["VSA_DPM2_FIO5","IO2","S011051_BCN1"]
["VSA_DPM2_FIO5","IO3","SPARE"]
["VSA_DPM2_FIO5","IO4","S011049_GS1_PB"]
["VSA_DPM2_FIO5","IO5","S011049_GS1_PB_LT"]
["VSA_DPM2_FIO5","IO6","S011051_GS1_PB"]
["VSA_DPM2_FIO5","IO7","S011051_GS1_PB_LT"]
["VSA_DPM2_FIO5","IO8","S011053_BCN1"]
["VSA_DPM2_FIO5","IO9","SPARE"]
["VSA_DPM2_FIO5","IO10","S011055_BCN1"]
["VSA_DPM2_FIO5","IO11","SPARE"]
["VSA_DPM2_FIO5","IO12","S011053_GS1_PB"]
["VSA_DPM2_FIO5","IO13","S011053_GS1_PB_LT"]
["VSA_DPM2_FIO5","IO14","S011055_GS1_PB"]
["VSA_DPM2_FIO5","IO15","S011055_GS1_PB_LT"]
["VSA_DPM2_FIO6","IO0","S011056_BCN1"]
["VSA_DPM2_FIO6","IO1","SPARE"]
["VSA_DPM2_FIO6","IO2","S011054_BCN1"]
["VSA_DPM2_FIO6","IO3","SPARE"]
["VSA_DPM2_FIO6","IO4","S011056_FIOH1"]
["VSA_DPM2_FIO6","IO5","SPARE"]
["VSA_DPM2_FIO6","IO6","S011050_JR1_PB"]
["VSA_DPM2_FIO6","IO7","S011050_JR1_PB_LT"]
["VSA_DPM2_FIO6","IO8","S011052_BCN1"]
["VSA_DPM2_FIO6","IO9","SPARE"]
["VSA_DPM2_FIO6","IO10","S011050_BCN1"]
["VSA_DPM2_FIO6","IO11","SPARE"]
["VSA_DPM2_FIO6","IO12","S011052_FIOH1"]
["VSA_DPM2_FIO6","IO13","SPARE"]
["VSA_DPM2_FIO6","IO14","S011051_JR1_PB"]
["VSA_DPM2_FIO6","IO15","S011051_JR1_PB_LT"]
["VSA_DPM2_FIO7","IO0","S011057_BCN1"]
["VSA_DPM2_FIO7","IO1","SPARE"]
["VSA_DPM2_FIO7","IO2","SPARE"]
["VSA_DPM2_FIO7","IO3","SPARE"]
["VSA_DPM2_FIO7","IO4","S011057_GS1_PB"]
["VSA_DPM2_FIO7","IO5","S011057_GS1_PB_LT"]
["VSA_DPM2_FIO7","IO6","SPARE"]
["VSA_DPM2_FIO7","IO7","SPARE"]
["VSA_DPM2_FIO7","IO8","SPARE"]
["VSA_DPM2_FIO7","IO9","SPARE"]
["VSA_DPM2_FIO7","IO10","SPARE"]
["VSA_DPM2_FIO7","IO11","SPARE"]
["VSA_DPM2_FIO7","IO12","SPARE"]
["VSA_DPM2_FIO7","IO13","SPARE"]
["VSA_DPM2_FIO7","IO14","SPARE"]
["VSA_DPM2_FIO7","IO15","SPARE"]
["VSA_DPM3_FIO1","IO0","S011067_BCN1"]
["VSA_DPM3_FIO1","IO1","SPARE"]
["VSA_DPM3_FIO1","IO2","S011069_BCN1"]
["VSA_DPM3_FIO1","IO3","SPARE"]
["VSA_DPM3_FIO1","IO4","S011067_GS1_PB"]
["VSA_DPM3_FIO1","IO5","S011067_GS1_PB_LT"]
["VSA_DPM3_FIO1","IO6","S011069_GS1_PB"]
["VSA_DPM3_FIO1","IO7","S011069_GS1_PB_LT"]
["VSA_DPM3_FIO1","IO8","S011071_BCN1"]
["VSA_DPM3_FIO1","IO9","SPARE"]
["VSA_DPM3_FIO1","IO10","S011073_BCN1"]
["VSA_DPM3_FIO1","IO11","SPARE"]
["VSA_DPM3_FIO1","IO12","S011071_GS1_PB"]
["VSA_DPM3_FIO1","IO13","S011071_GS1_PB_LT"]
["VSA_DPM3_FIO1","IO14","S011073_GS1_PB"]
["VSA_DPM3_FIO1","IO15","S011073_GS1_PB_LT"]
["VSA_DPM3_FIO2","IO0","S011075_BCN1"]
["VSA_DPM3_FIO2","IO1","SPARE"]
["VSA_DPM3_FIO2","IO2","S011077_BCN1"]
["VSA_DPM3_FIO2","IO3","SPARE"]
["VSA_DPM3_FIO2","IO4","S011075_GS1_PB"]
["VSA_DPM3_FIO2","IO5","S011075_GS1_PB_LT"]
["VSA_DPM3_FIO2","IO6","S011077_GS1_PB"]
["VSA_DPM3_FIO2","IO7","S011077_GS1_PB_LT"]
["VSA_DPM3_FIO2","IO8","S011079_BCN1"]
["VSA_DPM3_FIO2","IO9","SPARE"]
["VSA_DPM3_FIO2","IO10","S011081_BCN1"]
["VSA_DPM3_FIO2","IO11","SPARE"]
["VSA_DPM3_FIO2","IO12","S011079_GS1_PB"]
["VSA_DPM3_FIO2","IO13","S011079_GS1_PB_LT"]
["VSA_DPM3_FIO2","IO14","S011081_GS1_PB"]
["VSA_DPM3_FIO2","IO15","S011081_GS1_PB_LT"]
["VSA_DPM3_FIO3","IO0","S011083_BCN1"]
["VSA_DPM3_FIO3","IO1","SPARE"]
["VSA_DPM3_FIO3","IO2","S011085_BCN1"]
["VSA_DPM3_FIO3","IO3","SPARE"]
["VSA_DPM3_FIO3","IO4","S011083_GS1_PB"]
["VSA_DPM3_FIO3","IO5","S011083_GS1_PB_LT"]
["VSA_DPM3_FIO3","IO6","S011085_GS1_PB"]
["VSA_DPM3_FIO3","IO7","S011085_GS1_PB_LT"]
["VSA_DPM3_FIO3","IO8","S011087_BCN1"]
["VSA_DPM3_FIO3","IO9","SPARE"]
["VSA_DPM3_FIO3","IO10","S011089_BCN1"]
["VSA_DPM3_FIO3","IO11","SPARE"]
["VSA_DPM3_FIO3","IO12","S011087_GS1_PB"]
["VSA_DPM3_FIO3","IO13","S011087_GS1_PB_LT"]
["VSA_DPM3_FIO3","IO14","S011089_GS1_PB"]
["VSA_DPM3_FIO3","IO15","S011089_GS1_PB_LT"]
["VSA_DPM3_FIO4","IO0","S011091_BCN1"]
["VSA_DPM3_FIO4","IO1","SPARE"]
["VSA_DPM3_FIO4","IO2","S011086_BCN1"]
["VSA_DPM3_FIO4","IO3","SPARE"]
["VSA_DPM3_FIO4","IO4","S011091_GS1_PB"]
["VSA_DPM3_FIO4","IO5","S011091_GS1_PB_LT"]
["VSA_DPM3_FIO4","IO6","S011086_GS1_PB"]
["VSA_DPM3_FIO4","IO7","S011086_GS1_PB_LT"]
["VSA_DPM3_FIO4","IO8","S011095_BCN1"]
["VSA_DPM3_FIO4","IO9","SPARE"]
["VSA_DPM3_FIO4","IO10","S011097_BCN1"]
["VSA_DPM3_FIO4","IO11","SPARE"]
["VSA_DPM3_FIO4","IO12","S011095_GS1_PB"]
["VSA_DPM3_FIO4","IO13","S011095_GS1_PB_LT"]
["VSA_DPM3_FIO4","IO14","S011097_GS1_PB"]
["VSA_DPM3_FIO4","IO15","S011097_GS1_PB_LT"]
["VSA_DPM3_FIO5","IO0","S011099_BCN1"]
["VSA_DPM3_FIO5","IO1","SPARE"]
["VSA_DPM3_FIO5","IO2","S011101_BCN1"]
["VSA_DPM3_FIO5","IO3","SPARE"]
["VSA_DPM3_FIO5","IO4","S011099_GS1_PB"]
["VSA_DPM3_FIO5","IO5","S011099_GS1_PB_LT"]
["VSA_DPM3_FIO5","IO6","S011101_GS1_PB"]
["VSA_DPM3_FIO5","IO7","S011101_GS1_PB_LT"]
["VSA_DPM3_FIO5","IO8","SPARE"]
["VSA_DPM3_FIO5","IO9","SPARE"]
["VSA_DPM3_FIO5","IO10","SPARE"]
["VSA_DPM3_FIO5","IO11","SPARE"]
["VSA_DPM3_FIO5","IO12","SPARE"]
["VSA_DPM3_FIO5","IO13","SPARE"]
["VSA_DPM3_FIO5","IO14","SPARE"]
["VSA_DPM3_FIO5","IO15","SPARE"]
["VSA_DPM3_FIO6","IO0","S011067_JR1_PB"]
["VSA_DPM3_FIO6","IO1","S011067_JR1_PB_LT"]
["VSA_DPM3_FIO6","IO2","S011073_JR1_PB"]
["VSA_DPM3_FIO6","IO3","S011073_JR1_PB_LT"]
["VSA_DPM3_FIO6","IO4","S011085_JR1_PB"]
["VSA_DPM3_FIO6","IO5","S011085_JR1_PB_LT"]
["VSA_DPM3_FIO6","IO6","S011077_JR1_PB"]
["VSA_DPM3_FIO6","IO7","S011077_JR1_PB_LT"]
["VSA_DPM3_FIO6","IO8","S011095_JR1_PB"]
["VSA_DPM3_FIO6","IO9","S011095_JR1_PB_LT"]
["VSA_DPM3_FIO6","IO10","S011078_JR1_PB"]
["VSA_DPM3_FIO6","IO11","S011078_JR1_PB_LT"]
["VSA_DPM3_FIO6","IO12","SPARE"]
["VSA_DPM3_FIO6","IO13","SPARE"]
["VSA_DPM3_FIO6","IO14","SPARE"]
["VSA_DPM3_FIO6","IO15","SPARE"]
["VSA_DPM3_FIO7","IO0","S011084_BCN1"]
["VSA_DPM3_FIO7","IO1","SPARE"]
["VSA_DPM3_FIO7","IO2","S011082_BCN1"]
["VSA_DPM3_FIO7","IO3","SPARE"]
["VSA_DPM3_FIO7","IO4","S011084_GS1_PB"]
["VSA_DPM3_FIO7","IO5","S011084_GS1_PB_LT"]
["VSA_DPM3_FIO7","IO6","S011082_GS1_PB "]
["VSA_DPM3_FIO7","IO7","S011082_GS1_PB_LT "]
["VSA_DPM3_FIO7","IO8","S011080_BCN1"]
["VSA_DPM3_FIO7","IO9","SPARE"]
["VSA_DPM3_FIO7","IO10","S011078_BCN1"]
["VSA_DPM3_FIO7","IO11","SPARE"]
["VSA_DPM3_FIO7","IO12","S011080_GS1_PB"]
["VSA_DPM3_FIO7","IO13","S011080_GS1_PB_LT"]
["VSA_DPM3_FIO7","IO14","S011078_GS1_PB "]
["VSA_DPM3_FIO7","IO15","S011078_GS1_PB_LT"]
["VSC_DPM1_FIO1","IO0","S013002_BCN1"]
["VSC_DPM1_FIO1","IO1","SPARE"]
["VSC_DPM1_FIO1","IO2","S013004_BCN1"]
["VSC_DPM1_FIO1","IO3","SPARE"]
["VSC_DPM1_FIO1","IO4","S013004_FIOH1"]
["VSC_DPM1_FIO1","IO5","SPARE"]
["VSC_DPM1_FIO1","IO6","S013004_JR1_PB"]
["VSC_DPM1_FIO1","IO7","S013004_JR1_PB_LT"]
["VSC_DPM1_FIO1","IO8","S013006_BCN1"]
["VSC_DPM1_FIO1","IO9","SPARE"]
["VSC_DPM1_FIO1","IO10","S013008_BCN1"]
["VSC_DPM1_FIO1","IO11","SPARE"]
["VSC_DPM1_FIO1","IO12","S013008_FIOH1"]
["VSC_DPM1_FIO1","IO13","SPARE"]
["VSC_DPM1_FIO1","IO14","SPARE"]
["VSC_DPM1_FIO1","IO15","SPARE"]
["VSC_DPM1_FIO2","IO0","S013007_BCN1"]
["VSC_DPM1_FIO2","IO1","SPARE"]
["VSC_DPM1_FIO2","IO2","S013005_BCN1"]
["VSC_DPM1_FIO2","IO3","SPARE"]
["VSC_DPM1_FIO2","IO4","S013007_GS1_PB"]
["VSC_DPM1_FIO2","IO5","S013007_GS1_PB_LT"]
["VSC_DPM1_FIO2","IO6","S013005_GS1_PB"]
["VSC_DPM1_FIO2","IO7","S013005_GS1_PB_LT"]
["VSC_DPM1_FIO2","IO8","SPARE"]
["VSC_DPM1_FIO2","IO9","SPARE"]
["VSC_DPM1_FIO2","IO10","SPARE"]
["VSC_DPM1_FIO2","IO11","SPARE"]
["VSC_DPM1_FIO2","IO12","SPARE"]
["VSC_DPM1_FIO2","IO13","SPARE"]
["VSC_DPM1_FIO2","IO14","SPARE"]
["VSC_DPM1_FIO2","IO15","SPARE"]
["VSC_DPM1_FIO3","IO0","S013010_BCN1"]
["VSC_DPM1_FIO3","IO1","SPARE"]
["VSC_DPM1_FIO3","IO2","SPARE"]
["VSC_DPM1_FIO3","IO3","SPARE"]
["VSC_DPM1_FIO3","IO4","S013010_FIOH1"]
["VSC_DPM1_FIO3","IO5","SPARE"]
["VSC_DPM1_FIO3","IO6","S013010_JR1_PB"]
["VSC_DPM1_FIO3","IO7","S013010_JR1_PB_LT"]
["VSC_DPM1_FIO3","IO8","SPARE"]
["VSC_DPM1_FIO3","IO9","SPARE"]
["VSC_DPM1_FIO3","IO10","SPARE"]
["VSC_DPM1_FIO3","IO11","SPARE"]
["VSC_DPM1_FIO3","IO12","FL3016_FIOH1"]
["VSC_DPM1_FIO3","IO13","SPARE"]
["VSC_DPM1_FIO3","IO14","S013011_JR1_PB"]
["VSC_DPM1_FIO3","IO15","S013011_JR1_PB_LT"]
["VSC_DPM1_FIO4","IO0","S013015_BCN1"]
["VSC_DPM1_FIO4","IO1","SPARE"]
["VSC_DPM1_FIO4","IO2","S013013_BCN1"]
["VSC_DPM1_FIO4","IO3","SPARE"]
["VSC_DPM1_FIO4","IO4","S013015_GS1_PB"]
["VSC_DPM1_FIO4","IO5","S013015_GS1_PB_LT"]
["VSC_DPM1_FIO4","IO6","S013013_GS1_PB"]
["VSC_DPM1_FIO4","IO7","S013013_GS1_PB_LT"]
["VSC_DPM1_FIO4","IO8","S013011_BCN1"]
["VSC_DPM1_FIO4","IO9","SPARE"]
["VSC_DPM1_FIO4","IO10","S013009_BCN1"]
["VSC_DPM1_FIO4","IO11","SPARE"]
["VSC_DPM1_FIO4","IO12","S013011_GS1_PB"]
["VSC_DPM1_FIO4","IO13","S013011_GS1_PB_LT"]
["VSC_DPM1_FIO4","IO14","S013009_GS1_PB"]
["VSC_DPM1_FIO4","IO15","S013009_GS1_PB_LT"]
["VSC_DPM1_FIO5","IO0","S013018_BCN1"]
["VSC_DPM1_FIO5","IO1","SPARE"]
["VSC_DPM1_FIO5","IO2","SPARE"]
["VSC_DPM1_FIO5","IO3","SPARE"]
["VSC_DPM1_FIO5","IO4","S013018_FIOH1"]
["VSC_DPM1_FIO5","IO5","SPARE"]
["VSC_DPM1_FIO5","IO6","S013018_JR1_PB"]
["VSC_DPM1_FIO5","IO7","S013018_JR1_PB_LT"]
["VSC_DPM1_FIO5","IO8","SPARE"]
["VSC_DPM1_FIO5","IO9","SPARE"]
["VSC_DPM1_FIO5","IO10","SPARE"]
["VSC_DPM1_FIO5","IO11","SPARE"]
["VSC_DPM1_FIO5","IO12","FL3024_FIOH1"]
["VSC_DPM1_FIO5","IO13","SPARE"]
["VSC_DPM1_FIO5","IO14","S013017_JR1_PB"]
["VSC_DPM1_FIO5","IO15","S013017_JR1_PB_LT"]
["VSC_DPM1_FIO6","IO0","S013023_BCN1"]
["VSC_DPM1_FIO6","IO1","SPARE"]
["VSC_DPM1_FIO6","IO2","S013021_BCN1"]
["VSC_DPM1_FIO6","IO3","SPARE"]
["VSC_DPM1_FIO6","IO4","S013023_GS1_PB"]
["VSC_DPM1_FIO6","IO5","S013023_GS1_PB_LT"]
["VSC_DPM1_FIO6","IO6","S013021_GS1_PB"]
["VSC_DPM1_FIO6","IO7","S013021_GS1_PB_LT"]
["VSC_DPM1_FIO6","IO8","SPARE"]
["VSC_DPM1_FIO6","IO9","SPARE"]
["VSC_DPM1_FIO6","IO10","S013017_BCN1"]
["VSC_DPM1_FIO6","IO11","SPARE"]
["VSC_DPM1_FIO6","IO12","SPARE"]
["VSC_DPM1_FIO6","IO13","SPARE"]
["VSC_DPM1_FIO6","IO14","S013017_GS1_PB"]
["VSC_DPM1_FIO6","IO15","S013017_GS1_PB_LT"]
["VSC_DPM1_FIO7","IO0","S013026_BCN1"]
["VSC_DPM1_FIO7","IO1","SPARE"]
["VSC_DPM1_FIO7","IO2","S013028_BCN1"]
["VSC_DPM1_FIO7","IO3","SPARE"]
["VSC_DPM1_FIO7","IO4","S013028_FIOH1"]
["VSC_DPM1_FIO7","IO5","SPARE"]
["VSC_DPM1_FIO7","IO6","S013026_JR1_PB"]
["VSC_DPM1_FIO7","IO7","S013026_JR1_PB_LT"]
["VSC_DPM1_FIO7","IO8","S013027_JR1_PB"]
["VSC_DPM1_FIO7","IO9","S013027_JR1_PB_LT"]
["VSC_DPM1_FIO7","IO10","S013032_BCN1"]
["VSC_DPM1_FIO7","IO11","SPARE"]
["VSC_DPM1_FIO7","IO12","S013032_FIOH1"]
["VSC_DPM1_FIO7","IO13","SPARE"]
["VSC_DPM1_FIO7","IO14","S013031_JR1_PB"]
["VSC_DPM1_FIO7","IO15","S013031_JR1_PB_LT"]
["VSC_DPM1_FIO8","IO0","S013031_BCN1"]
["VSC_DPM1_FIO8","IO1","SPARE"]
["VSC_DPM1_FIO8","IO2","SPARE"]
["VSC_DPM1_FIO8","IO3","SPARE"]
["VSC_DPM1_FIO8","IO4","S013031_GS1_PB"]
["VSC_DPM1_FIO8","IO5","S013031_GS1_PB_LT"]
["VSC_DPM1_FIO8","IO6","SPARE"]
["VSC_DPM1_FIO8","IO7","SPARE"]
["VSC_DPM1_FIO8","IO8","S013027_BCN1"]
["VSC_DPM1_FIO8","IO9","SPARE"]
["VSC_DPM1_FIO8","IO10","S013025_BCN1"]
["VSC_DPM1_FIO8","IO11","SPARE"]
["VSC_DPM1_FIO8","IO12","S013027_GS1_PB"]
["VSC_DPM1_FIO8","IO13","S013027_GS1_PB_LT"]
["VSC_DPM1_FIO8","IO14","S013025_GS1_PB"]
["VSC_DPM1_FIO8","IO15","S013025_GS1_PB_LT"]
["VSC_DPM2_FIO1","IO0","S013034_BCN1"]
["VSC_DPM2_FIO1","IO1","SPARE"]
["VSC_DPM2_FIO1","IO2","S013036_BCN1"]
["VSC_DPM2_FIO1","IO3","SPARE"]
["VSC_DPM2_FIO1","IO4","S013036_FIOH1"]
["VSC_DPM2_FIO1","IO5","SPARE"]
["VSC_DPM2_FIO1","IO6","S013036_JR1_PB"]
["VSC_DPM2_FIO1","IO7","S013036_JR1_PB_LT"]
["VSC_DPM2_FIO1","IO8","S013038_BCN1"]
["VSC_DPM2_FIO1","IO9","SPARE"]
["VSC_DPM2_FIO1","IO10","S013040_BCN1"]
["VSC_DPM2_FIO1","IO11","SPARE"]
["VSC_DPM2_FIO1","IO12","S013040_FIOH1"]
["VSC_DPM2_FIO1","IO13","SPARE"]
["VSC_DPM2_FIO1","IO14","SPARE"]
["VSC_DPM2_FIO1","IO15","SPARE"]
["VSC_DPM2_FIO2","IO0","S013039_BCN1"]
["VSC_DPM2_FIO2","IO1","SPARE"]
["VSC_DPM2_FIO2","IO2","S013037_BCN1"]
["VSC_DPM2_FIO2","IO3","SPARE"]
["VSC_DPM2_FIO2","IO4","S013039_GS1_PB"]
["VSC_DPM2_FIO2","IO5","S013039_GS1_PB_LT"]
["VSC_DPM2_FIO2","IO6","S013037_GS1_PB"]
["VSC_DPM2_FIO2","IO7","S013037_GS1_PB_LT"]
["VSC_DPM2_FIO2","IO8","SPARE"]
["VSC_DPM2_FIO2","IO9","SPARE"]
["VSC_DPM2_FIO2","IO10","SPARE"]
["VSC_DPM2_FIO2","IO11","SPARE"]
["VSC_DPM2_FIO2","IO12","SPARE"]
["VSC_DPM2_FIO2","IO13","SPARE"]
["VSC_DPM2_FIO2","IO14","SPARE"]
["VSC_DPM2_FIO2","IO15","SPARE"]
["VSC_DPM2_FIO3","IO0","S013042_BCN1"]
["VSC_DPM2_FIO3","IO1","SPARE"]
["VSC_DPM2_FIO3","IO2","S013044_BCN1"]
["VSC_DPM2_FIO3","IO3","SPARE"]
["VSC_DPM2_FIO3","IO4","S013044_FIOH1"]
["VSC_DPM2_FIO3","IO5","SPARE"]
["VSC_DPM2_FIO3","IO6","S013044_JR1_PB"]
["VSC_DPM2_FIO3","IO7","S013044_JR1_PB_LT"]
["VSC_DPM2_FIO3","IO8","S013046_BCN1"]
["VSC_DPM2_FIO3","IO9","SPARE"]
["VSC_DPM2_FIO3","IO10","S013048_BCN1"]
["VSC_DPM2_FIO3","IO11","SPARE"]
["VSC_DPM2_FIO3","IO12","S013048_FIOH1"]
["VSC_DPM2_FIO3","IO13","SPARE"]
["VSC_DPM2_FIO3","IO14","S013043_JR1_PB"]
["VSC_DPM2_FIO3","IO15","S013043_JR1_PB_LT"]
["VSC_DPM2_FIO4","IO0","S013047_BCN1"]
["VSC_DPM2_FIO4","IO1","SPARE"]
["VSC_DPM2_FIO4","IO2","S013045_BCN1"]
["VSC_DPM2_FIO4","IO3","SPARE"]
["VSC_DPM2_FIO4","IO4","S013047_GS1_PB"]
["VSC_DPM2_FIO4","IO5","S013047_GS1_PB_LT"]
["VSC_DPM2_FIO4","IO6","S013045_GS1_PB"]
["VSC_DPM2_FIO4","IO7","S013045_GS1_PB_LT"]
["VSC_DPM2_FIO4","IO8","S013043_BCN1"]
["VSC_DPM2_FIO4","IO9","SPARE"]
["VSC_DPM2_FIO4","IO10","S013041_BCN1"]
["VSC_DPM2_FIO4","IO11","SPARE"]
["VSC_DPM2_FIO4","IO12","S013043_GS1_PB"]
["VSC_DPM2_FIO4","IO13","S013043_GS1_PB_LT"]
["VSC_DPM2_FIO4","IO14","S013041_GS1_PB"]
["VSC_DPM2_FIO4","IO15","S013041_GS1_PB_LT"]
["VSC_DPM2_FIO5","IO0","S013050_BCN1"]
["VSC_DPM2_FIO5","IO1","SPARE"]
["VSC_DPM2_FIO5","IO2","S013052_BCN1"]
["VSC_DPM2_FIO5","IO3","SPARE"]
["VSC_DPM2_FIO5","IO4","S013052_FIOH1"]
["VSC_DPM2_FIO5","IO5","SPARE"]
["VSC_DPM2_FIO5","IO6","S013052_JR1_PB"]
["VSC_DPM2_FIO5","IO7","S013052_JR1_PB_LT"]
["VSC_DPM2_FIO5","IO8","S013054_BCN1"]
["VSC_DPM2_FIO5","IO9","SPARE"]
["VSC_DPM2_FIO5","IO10","S013056_BCN1"]
["VSC_DPM2_FIO5","IO11","SPARE"]
["VSC_DPM2_FIO5","IO12","S013056_FIOH1"]
["VSC_DPM2_FIO5","IO13","SPARE"]
["VSC_DPM2_FIO5","IO14","S013049_JR1_PB"]
["VSC_DPM2_FIO5","IO15","S013049_JR1_PB_LT"]
["VSC_DPM2_FIO6","IO0","S013055_BCN1"]
["VSC_DPM2_FIO6","IO1","SPARE"]
["VSC_DPM2_FIO6","IO2","S013053_BCN1"]
["VSC_DPM2_FIO6","IO3","SPARE"]
["VSC_DPM2_FIO6","IO4","S013055_GS1_PB"]
["VSC_DPM2_FIO6","IO5","S013055_GS1_PB_LT"]
["VSC_DPM2_FIO6","IO6","S013053_GS1_PB"]
["VSC_DPM2_FIO6","IO7","S013053_GS1_PB_LT"]
["VSC_DPM2_FIO6","IO8","SPARE"]
["VSC_DPM2_FIO6","IO9","SPARE"]
["VSC_DPM2_FIO6","IO10","S013049_BCN1"]
["VSC_DPM2_FIO6","IO11","SPARE"]
["VSC_DPM2_FIO6","IO12","SPARE"]
["VSC_DPM2_FIO6","IO13","SPARE"]
["VSC_DPM2_FIO6","IO14","S013049_GS1_PB"]
["VSC_DPM2_FIO6","IO15","S013049_GS1_PB_LT"]
["VSC_DPM2_FIO7","IO0","S013058_BCN1"]
["VSC_DPM2_FIO7","IO1","SPARE"]
["VSC_DPM2_FIO7","IO2","S013060_BCN1"]
["VSC_DPM2_FIO7","IO3","SPARE"]
["VSC_DPM2_FIO7","IO4","S013060_FIOH1"]
["VSC_DPM2_FIO7","IO5","SPARE"]
["VSC_DPM2_FIO7","IO6","S013060_JR1_PB"]
["VSC_DPM2_FIO7","IO7","S013060_JR1_PB_LT"]
["VSC_DPM2_FIO7","IO8","SPARE"]
["VSC_DPM2_FIO7","IO9","SPARE"]
["VSC_DPM2_FIO7","IO10","S013064_BCN1"]
["VSC_DPM2_FIO7","IO11","SPARE"]
["VSC_DPM2_FIO7","IO12","S013064_FIOH1"]
["VSC_DPM2_FIO7","IO13","SPARE"]
["VSC_DPM2_FIO7","IO14","S013059_JR1_PB"]
["VSC_DPM2_FIO7","IO15","S013059_JR1_PB_LT"]
["VSC_DPM2_FIO8","IO0","S013063_BCN1"]
["VSC_DPM2_FIO8","IO1","SPARE"]
["VSC_DPM2_FIO8","IO2","SPARE"]
["VSC_DPM2_FIO8","IO3","SPARE"]
["VSC_DPM2_FIO8","IO4","S013063_GS1_PB"]
["VSC_DPM2_FIO8","IO5","S013063_GS1_PB_LT"]
["VSC_DPM2_FIO8","IO6","SPARE"]
["VSC_DPM2_FIO8","IO7","SPARE"]
["VSC_DPM2_FIO8","IO8","S013059_BCN1"]
["VSC_DPM2_FIO8","IO9","SPARE"]
["VSC_DPM2_FIO8","IO10","S013057_BCN1"]
["VSC_DPM2_FIO8","IO11","SPARE"]
["VSC_DPM2_FIO8","IO12","S013059_GS1_PB"]
["VSC_DPM2_FIO8","IO13","S013059_GS1_PB_LT"]
["VSC_DPM2_FIO8","IO14","S013057_GS1_PB"]
["VSC_DPM2_FIO8","IO15","S013057_GS1_PB_LT"]
["VSC_DPM3_FIO1","IO0","S013066_BCN1"]
["VSC_DPM3_FIO1","IO1","SPARE"]
["VSC_DPM3_FIO1","IO2","S013068_BCN1"]
["VSC_DPM3_FIO1","IO3","SPARE"]
["VSC_DPM3_FIO1","IO4","S013068_FIOH1"]
["VSC_DPM3_FIO1","IO5","SPARE"]
["VSC_DPM3_FIO1","IO6","S013070_JR1_PB"]
["VSC_DPM3_FIO1","IO7","S013070_JR1_PB_LT"]
["VSC_DPM3_FIO1","IO8","S013070_BCN1"]
["VSC_DPM3_FIO1","IO9","SPARE"]
["VSC_DPM3_FIO1","IO10","S013072_BCN1"]
["VSC_DPM3_FIO1","IO11","SPARE"]
["VSC_DPM3_FIO1","IO12","S013072_FIOH1"]
["VSC_DPM3_FIO1","IO13","SPARE"]
["VSC_DPM3_FIO1","IO14","S013067_JR1_PB"]
["VSC_DPM3_FIO1","IO15","S013067_JR1_PB_LT"]
["VSC_DPM3_FIO2","IO0","S013071_BCN1"]
["VSC_DPM3_FIO2","IO1","SPARE"]
["VSC_DPM3_FIO2","IO2","SPARE"]
["VSC_DPM3_FIO2","IO3","SPARE"]
["VSC_DPM3_FIO2","IO4","S013071_GS1_PB"]
["VSC_DPM3_FIO2","IO5","S013071_GS1_PB_LT"]
["VSC_DPM3_FIO2","IO6","SPARE"]
["VSC_DPM3_FIO2","IO7","SPARE"]
["VSC_DPM3_FIO2","IO8","S013067_BCN1"]
["VSC_DPM3_FIO2","IO9","SPARE"]
["VSC_DPM3_FIO2","IO10","S013065_BCN1"]
["VSC_DPM3_FIO2","IO11","SPARE"]
["VSC_DPM3_FIO2","IO12","S013067_GS1_PB"]
["VSC_DPM3_FIO2","IO13","S013067_GS1_PB_LT"]
["VSC_DPM3_FIO2","IO14","S013065_GS1_PB"]
["VSC_DPM3_FIO2","IO15","S013065_GS1_PB_LT"]
["VSC_DPM3_FIO3","IO0","S013074_BCN1"]
["VSC_DPM3_FIO3","IO1","SPARE"]
["VSC_DPM3_FIO3","IO2","S013076_BCN1"]
["VSC_DPM3_FIO3","IO3","SPARE"]
["VSC_DPM3_FIO3","IO4","S013076_FIOH1"]
["VSC_DPM3_FIO3","IO5","SPARE"]
["VSC_DPM3_FIO3","IO6","S013078_JR1_PB"]
["VSC_DPM3_FIO3","IO7","S013078_JR1_PB_LT"]
["VSC_DPM3_FIO3","IO8","S013078_BCN1"]
["VSC_DPM3_FIO3","IO9","SPARE"]
["VSC_DPM3_FIO3","IO10","S013080_BCN1"]
["VSC_DPM3_FIO3","IO11","SPARE"]
["VSC_DPM3_FIO3","IO12","S013080_FIOH1"]
["VSC_DPM3_FIO3","IO13","SPARE"]
["VSC_DPM3_FIO3","IO14","S013077_JR1_PB"]
["VSC_DPM3_FIO3","IO15","S013077_JR1_PB_LT"]
["VSC_DPM3_FIO4","IO0","S013079_BCN1"]
["VSC_DPM3_FIO4","IO1","SPARE"]
["VSC_DPM3_FIO4","IO2","S013077_BCN1"]
["VSC_DPM3_FIO4","IO3","SPARE"]
["VSC_DPM3_FIO4","IO4","S013079_GS1_PB"]
["VSC_DPM3_FIO4","IO5","S013079_GS1_PB_LT"]
["VSC_DPM3_FIO4","IO6","S013077_GS1_PB"]
["VSC_DPM3_FIO4","IO7","S013077_GS1_PB_LT"]
["VSC_DPM3_FIO4","IO8","S013075_BCN1"]
["VSC_DPM3_FIO4","IO9","SPARE"]
["VSC_DPM3_FIO4","IO10","S013073_BCN1"]
["VSC_DPM3_FIO4","IO11","SPARE"]
["VSC_DPM3_FIO4","IO12","S013075_GS1_PB"]
["VSC_DPM3_FIO4","IO13","S013075_GS1_PB_LT"]
["VSC_DPM3_FIO4","IO14","S013073_GS1_PB"]
["VSC_DPM3_FIO4","IO15","S013073_GS1_PB_LT"]
["VSC_DPM3_FIO5","IO0","S013082_BCN1"]
["VSC_DPM3_FIO5","IO1","SPARE"]
["VSC_DPM3_FIO5","IO2","S013084_BCN1"]
["VSC_DPM3_FIO5","IO3","SPARE"]
["VSC_DPM3_FIO5","IO4","S013084_FIOH1"]
["VSC_DPM3_FIO5","IO5","SPARE"]
["VSC_DPM3_FIO5","IO6","S013086_JR1_PB"]
["VSC_DPM3_FIO5","IO7","S013086_JR1_PB_LT"]
["VSC_DPM3_FIO5","IO8","S013086_BCN1"]
["VSC_DPM3_FIO5","IO9","SPARE"]
["VSC_DPM3_FIO5","IO10","S013088_BCN1"]
["VSC_DPM3_FIO5","IO11","SPARE"]
["VSC_DPM3_FIO5","IO12","S013088_FIOH1"]
["VSC_DPM3_FIO5","IO13","SPARE"]
["VSC_DPM3_FIO5","IO14","S013083_JR1_PB"]
["VSC_DPM3_FIO5","IO15","S013083_JR1_PB_LT"]
["VSC_DPM3_FIO6","IO0","S013087_BCN1"]
["VSC_DPM3_FIO6","IO1","SPARE"]
["VSC_DPM3_FIO6","IO2","SPARE"]
["VSC_DPM3_FIO6","IO3","SPARE"]
["VSC_DPM3_FIO6","IO4","S013087_GS1_PB"]
["VSC_DPM3_FIO6","IO5","S013087_GS1_PB_LT"]
["VSC_DPM3_FIO6","IO6","SPARE"]
["VSC_DPM3_FIO6","IO7","SPARE"]
["VSC_DPM3_FIO6","IO8","S013083_BCN1"]
["VSC_DPM3_FIO6","IO9","SPARE"]
["VSC_DPM3_FIO6","IO10","S013081_BCN1"]
["VSC_DPM3_FIO6","IO11","SPARE"]
["VSC_DPM3_FIO6","IO12","S013083_GS1_PB"]
["VSC_DPM3_FIO6","IO13","S013083_GS1_PB_LT"]
["VSC_DPM3_FIO6","IO14","S013081_GS1_PB"]
["VSC_DPM3_FIO6","IO15","S013081_GS1_PB_LT"]
["VSC_DPM3_FIO7","IO0","S013090_BCN1"]
["VSC_DPM3_FIO7","IO1","SPARE"]
["VSC_DPM3_FIO7","IO2","S013092_BCN1"]
["VSC_DPM3_FIO7","IO3","SPARE"]
["VSC_DPM3_FIO7","IO4","S013092_FIOH1"]
["VSC_DPM3_FIO7","IO5","SPARE"]
["VSC_DPM3_FIO7","IO6","S013094_JR1_PB"]
["VSC_DPM3_FIO7","IO7","S013094_JR1_PB_LT"]
["VSC_DPM3_FIO7","IO8","S013094_BCN1"]
["VSC_DPM3_FIO7","IO9","SPARE"]
["VSC_DPM3_FIO7","IO10","SPARE"]
["VSC_DPM3_FIO7","IO11","SPARE"]
["VSC_DPM3_FIO7","IO12","S013094_FIOH1"]
["VSC_DPM3_FIO7","IO13","SPARE"]
["VSC_DPM3_FIO7","IO14","S013093_JR1_PB"]
["VSC_DPM3_FIO7","IO15","S013093_JR1_PB_LT"]
["VSC_DPM3_FIO8","IO0","SPARE"]
["VSC_DPM3_FIO8","IO1","SPARE"]
["VSC_DPM3_FIO8","IO2","S013093_BCN1"]
["VSC_DPM3_FIO8","IO3","SPARE"]
["VSC_DPM3_FIO8","IO4","SPARE"]
["VSC_DPM3_FIO8","IO5","SPARE"]
["VSC_DPM3_FIO8","IO6","S013093_GS1_PB"]
["VSC_DPM3_FIO8","IO7","S013093_GS1_PB_LT"]
["VSC_DPM3_FIO8","IO8","S013091_BCN1"]
["VSC_DPM3_FIO8","IO9","SPARE"]
["VSC_DPM3_FIO8","IO10","S013089_BCN1"]
["VSC_DPM3_FIO8","IO11","SPARE"]
["VSC_DPM3_FIO8","IO12","S013091_GS1_PB"]
["VSC_DPM3_FIO8","IO13","S013091_GS1_PB_LT"]
["VSC_DPM3_FIO8","IO14","S013089_GS1_PB"]
["VSC_DPM3_FIO8","IO15","S013089_GS1_PB_LT"]
[]
[]
[]
[]
[]
[]
[]
[]
[]
[]
[]
[]
[]
[]
[]
[]
[]
[]
[]
[]
[]
[]
[]
[]
[]
[]
[]
[]
[]
[]
[]
[]
[]
[]
[]
[]
[]
[]
[]
[]
[]
[]
[]
[]
[]
[]
[]
[]
[]
[]
[]
[]
[]
[]
[]
[]
[]
[]
[]
[]
[]
[]
[]
[]
[]
[]
[]
[]
[]
[]
[]
[]
[]
[]
[]
[]
[]
[]
[]
[]
[]
[]
["FL1014_2_VFD1","I0","FL1014_2_VFD1_DISC","DISCONNECT AUX"]
["FL1014_2_VFD1","I1","SPARE"]
["FL1014_2_VFD1","I2","FL1014_2_PE1","TRACKING PE"]
["FL1014_2_VFD1","I3","FL1014_3CH_PE1","FULL PHOTOEYE"]
["FL1014_2_VFD1","IO0","FL1014_2_JR2_PB","JAM RESET PUSHBUTTON"]
["FL1014_2_VFD1","IO1","FL1014_2_JR2_PB_LT","JAM RESET PUSHBUTTON LIGHT"]
["FL1014_2_VFD1","SI0","FL1014_1_ESTOP","ESTOP OK"]
["FL1014_2_VFD1","SI1","SPARE"]
["FL1014_2_VFD1","SI2","SPARE"]
["FL1014_2_VFD1","SI3","SPARE"]
["FL1014_2_VFD1","SO0","FL1014_1_STO1","ESTOP OK"]
["FL1018_2_VFD1","I0","FL1018_2_VFD1_DISC","DISCONNECT AUX"]
["FL1018_2_VFD1","I1","SPARE"]
["FL1018_2_VFD1","I2","FL1018_2_PE1","TRACKING PE"]
["FL1018_2_VFD1","I3","FL1018_3CH_PE1","FULL PHOTOEYE"]
["FL1018_2_VFD1","IO0","FL1018_2_JR2_PB","JAM RESET PUSHBUTTON"]
["FL1018_2_VFD1","IO1","FL1018_2_JR2_PB_LT","JAM RESET PUSHBUTTON LIGHT"]
["FL1018_2_VFD1","SI0","FL1018_1_ESTOP","ESTOP OK"]
["FL1018_2_VFD1","SI1","SPARE"]
["FL1018_2_VFD1","SI2","SPARE"]
["FL1018_2_VFD1","SI3","SPARE"]
["FL1018_2_VFD1","SO0","FL1018_1_STO1","ESTOP OK"]
["FL1022_2_VFD1","I0","FL1022_2_VFD1_DISC","DISCONNECT AUX"]
["FL1022_2_VFD1","I1","SPARE"]
["FL1022_2_VFD1","I2","FL1022_2_PE1","TRACKING PE"]
["FL1022_2_VFD1","I3","FL1022_3CH_PE1","FULL PHOTOEYE"]
["FL1022_2_VFD1","IO0","FL1022_2_JR2_PB","JAM RESET PUSHBUTTON"]
["FL1022_2_VFD1","IO1","FL1022_2_JR2_PB_LT","JAM RESET PUSHBUTTON LIGHT"]
["FL1022_2_VFD1","SI0","FL1022_1_ESTOP","ESTOP OK"]
["FL1022_2_VFD1","SI1","SPARE"]
["FL1022_2_VFD1","SI2","SPARE"]
["FL1022_2_VFD1","SI3","SPARE"]
["FL1022_2_VFD1","SO0","FL1022_1_STO1","ESTOP OK"]
["FL1026_2_VFD1","I0","FL1026_2_VFD1_DISC","DISCONNECT AUX"]
["FL1026_2_VFD1","I1","SPARE"]
["FL1026_2_VFD1","I2","FL1026_2_PE1","TRACKING PE"]
["FL1026_2_VFD1","I3","FL1026_3CH_PE1","FULL PHOTOEYE"]
["FL1026_2_VFD1","IO0","FL1026_2_JR2_PB","JAM RESET PUSHBUTTON"]
["FL1026_2_VFD1","IO1","FL1026_2_JR2_PB_LT","JAM RESET PUSHBUTTON LIGHT"]
["FL1026_2_VFD1","SI0","FL1026_1_ESTOP","ESTOP OK"]
["FL1026_2_VFD1","SI1","SPARE"]
["FL1026_2_VFD1","SI2","SPARE"]
["FL1026_2_VFD1","SI3","SPARE"]
["FL1026_2_VFD1","SO0","FL1026_1_STO1","ESTOP OK"]
["FL1034_2_VFD1","I0","FL1034_2_VFD1_DISC","DISCONNECT AUX"]
["FL1034_2_VFD1","I1","SPARE"]
["FL1034_2_VFD1","I2","FL1034_2_PE1","TRACKING PE"]
["FL1034_2_VFD1","I3","FL1034_3CH_PE1","FULL PHOTOEYE"]
["FL1034_2_VFD1","IO0","FL1034_2_JR2_PB","JAM RESET PUSHBUTTON"]
["FL1034_2_VFD1","IO1","FL1034_2_JR2_PB_LT","JAM RESET PUSHBUTTON LIGHT"]
["FL1034_2_VFD1","SI0","FL1034_1_ESTOP","ESTOP OK"]
["FL1034_2_VFD1","SI1","SPARE"]
["FL1034_2_VFD1","SI2","SPARE"]
["FL1034_2_VFD1","SI3","SPARE"]
["FL1034_2_VFD1","SO0","FL1034_1_STO1","ESTOP OK"]
["FL1038_2_VFD1","I0","FL1038_2_VFD1_DISC","DISCONNECT AUX"]
["FL1038_2_VFD1","I1","SPARE"]
["FL1038_2_VFD1","I2","FL1038_2_PE1","TRACKING PE"]
["FL1038_2_VFD1","I3","FL1038_3CH_PE1","FULL PHOTOEYE"]
["FL1038_2_VFD1","IO0","FL1038_2_JR2_PB","JAM RESET PUSHBUTTON"]
["FL1038_2_VFD1","IO1","FL1038_2_JR2_PB_LT","JAM RESET PUSHBUTTON LIGHT"]
["FL1038_2_VFD1","SI0","FL1038_1_ESTOP","ESTOP OK"]
["FL1038_2_VFD1","SI1","SPARE"]
["FL1038_2_VFD1","SI2","SPARE"]
["FL1038_2_VFD1","SI3","SPARE"]
["FL1038_2_VFD1","SO0","FL1038_1_STO1","ESTOP OK"]
["FL3012_2_VFD1","I0","FL3012_2_VFD1_DISC","DISCONNECT AUX"]
["FL3012_2_VFD1","I1","SPARE"]
["FL3012_2_VFD1","I2","FL3012_2_PE1","TRACKING PE"]
["FL3012_2_VFD1","I3","FL3012_3CH_PE1","FULL PHOTOEYE"]
["FL3012_2_VFD1","IO0","FL3012_2_JR2_PB","JAM RESET PUSHBUTTON"]
["FL3012_2_VFD1","IO1","FL3012_2_JR2_PB_LT","JAM RESET PUSHBUTTON LIGHT"]
["FL3012_2_VFD1","SI0","FL3012_1_ESTOP","ESTOP OK"]
["FL3012_2_VFD1","SI1","SPARE"]
["FL3012_2_VFD1","SI2","SPARE"]
["FL3012_2_VFD1","SI3","SPARE"]
["FL3012_2_VFD1","SO0","FL3012_1_STO1","ESTOP OK"]
["FL3016_2_VFD1","I0","FL3016_2_VFD1_DISC","DISCONNECT AUX"]
["FL3016_2_VFD1","I1","SPARE"]
["FL3016_2_VFD1","I2","FL3016_2_PE1","TRACKING PE"]
["FL3016_2_VFD1","I3","FL3016_3CH_PE1","FULL PHOTOEYE"]
["FL3016_2_VFD1","IO0","FL3016_2_JR2_PB","JAM RESET PUSHBUTTON"]
["FL3016_2_VFD1","IO1","FL3016_2_JR2_PB_LT","JAM RESET PUSHBUTTON LIGHT"]
["FL3016_2_VFD1","SI0","FL3016_1_ESTOP","ESTOP OK"]
["FL3016_2_VFD1","SI1","SPARE"]
["FL3016_2_VFD1","SI2","SPARE"]
["FL3016_2_VFD1","SI3","SPARE"]
["FL3016_2_VFD1","SO0","FL3016_1_STO1","ESTOP OK"]
["FL3020_2_VFD1","I0","FL3020_2_VFD1_DISC","DISCONNECT AUX"]
["FL3020_2_VFD1","I1","SPARE"]
["FL3020_2_VFD1","I2","FL3020_2_PE1","TRACKING PE"]
["FL3020_2_VFD1","I3","FL3020_3CH_PE1","FULL PHOTOEYE"]
["FL3020_2_VFD1","IO0","FL3020_2_JR2_PB","JAM RESET PUSHBUTTON"]
["FL3020_2_VFD1","IO1","FL3020_2_JR2_PB_LT","JAM RESET PUSHBUTTON LIGHT"]
["FL3020_2_VFD1","SI0","FL3020_1_ESTOP","ESTOP OK"]
["FL3020_2_VFD1","SI1","SPARE"]
["FL3020_2_VFD1","SI2","SPARE"]
["FL3020_2_VFD1","SI3","SPARE"]
["FL3020_2_VFD1","SO0","FL3020_1_STO1","ESTOP OK"]
["FL3024_2_VFD1","I0","FL3024_2_VFD1_DISC","DISCONNECT AUX"]
["FL3024_2_VFD1","I1","SPARE"]
["FL3024_2_VFD1","I2","FL3024_2_PE1","TRACKING PE"]
["FL3024_2_VFD1","I3","FL3024_3CH_PE1","FULL PHOTOEYE"]
["FL3024_2_VFD1","IO0","FL3024_2_JR2_PB","JAM RESET PUSHBUTTON"]
["FL3024_2_VFD1","IO1","FL3024_2_JR2_PB_LT","JAM RESET PUSHBUTTON LIGHT"]
["FL3024_2_VFD1","SI0","FL3024_1_ESTOP","ESTOP OK"]
["FL3024_2_VFD1","SI1","SPARE"]
["FL3024_2_VFD1","SI2","SPARE"]
["FL3024_2_VFD1","SI3","SPARE"]
["FL3024_2_VFD1","SO0","FL3024_1_STO1","ESTOP OK"]