{"text_format":"1","workbook":"xlsx","n_sheets":8,"sheets":["Templates","Devices","Instructions","IO Assignment MCM04","NETWORK","Part number","MCM04_DESC","MCM04_DESC_v2"],"not_rendered":{"charts":0,"images":10,"macros":1,"external_links":0,"defined_names":6,"comments":2,"pivot_tables":0},"unopened":[],"bounds":{"document_bytes":16777216,"sheet_cells":100000,"rows_first":2000,"rows_last":500,"rows_between":2000,"halvings":0,"cell_chars":16384,"cell_head_chars":4096},"cells_cut":0,"cells_raw":0,"read":"whole","date_system":"1900"}

{"sheet":"Templates","index":0,"n_rows":19,"n_cols":3,"rows_kept":19,"cut":false,"hidden":true,"merged":[]}
[]
["VFD IO TEMPLATE",null,"FIO IO Template"]
["I0",null,"IO00"]
["I1",null,"IO01"]
["I2",null,"IO02"]
["I3",null,"IO03"]
["IO0",null,"IO04"]
["IO1",null,"IO05"]
["SI0",null,"IO06"]
["SI1",null,"IO07"]
["SI2",null,"IO08"]
["SI3",null,"IO09"]
["SO0",null,"IO10"]
[null,null,"IO11"]
[null,null,"IO12"]
[null,null,"IO13"]
[null,null,"IO14"]
[null,null,"IO15"]
[null,null,"IO16"]

{"sheet":"Devices","index":1,"n_rows":506,"n_cols":9,"rows_kept":506,"cut":false,"hidden":false,"merged":[]}
[null,null,null,null,null,null,null,"Which MCM we assign?","MCM01"]
["PRS3_1ACH_BCN1_A"]
["PRS3_1ACH_BCN1_B"]
["PRS3_1ACH_JPE1"]
["PRS3_1ACH_JR1_PB"]
["PRS3_1ACH_JR1_PB_LT"]
["PRS3_1BCH_BCN1_A"]
["PRS3_1BCH_BCN1_B"]
["PRS3_1BCH_JPE1"]
["PRS3_1BCH_JR1_PB"]
["PRS3_1BCH_JR1_PB_LT"]
["PRS3_2A_BCN1_A"]
["PRS3_2A_DISC"]
["PRS3_2A_FIOM1"]
["PRS3_2A_JPE1"]
["PRS3_2A_JR1_PB"]
["PRS3_2A_JR1_PB_LT"]
["PRS3_2A_VFD1"]
["PRS3_2B_BCN1_A"]
["PRS3_2B_DISC"]
["PRS3_2B_FIO1"]
["PRS3_2B_JPE1"]
["PRS3_2B_JR1_PB"]
["PRS3_2B_JR1_PB_LT"]
["PRS3_2B_VFD1"]
["PRS3_3A_BCN1_A"]
["PRS3_3A_BCN1_B"]
["PRS3_3A_DISC"]
["PRS3_3A_JPE1"]
["PRS3_3A_JPE2"]
["PRS3_3A_JR1_PB"]
["PRS3_3A_JR1_PB_LT"]
["PRS3_3A_VFD1"]
["PRS3_3B_BCN1_A"]
["PRS3_3B_BCN1_B"]
["PRS3_3B_DISC"]
["PRS3_3B_JPE1"]
["PRS3_3B_JPE2"]
["PRS3_3B_JR1_PB"]
["PRS3_3B_JR1_PB_LT"]
{"$rows_left_out":467}
{"sheet":"Instructions","index":2,"n_rows":116,"n_cols":2,"rows_kept":116,"cut":false,"hidden":false,"merged":[]}
[]
["1. ","Put all device tags to cell A2"]
[]
[]
[]
[]
[]
[]
[]
[]
[]
[]
[]
[]
[]
[]
[]
[]
[]
[]
[]
[]
[]
[]
[]
[]
[]
[]
[]
[]
[]
[]
[]
[]
[]
[]
["2.","In cell I1 write MCM number"]
[]
[]
[]
{"$rows_left_out":77}
{"sheet":"IO Assignment MCM04","index":3,"n_rows":755,"n_cols":11,"rows_kept":755,"cut":false,"hidden":false,"merged":[]}
["Controller name","Signal type","Address name","Assigned device","Unassigned Device",null,null,null,null,null,"MCM04_DESC_v2"]
["PRS3_2A_VFD1","I0","PRS3_2A_VFD1_I0","PRS3_2A_VFD1_DISC"]
["PRS3_2A_VFD1","I1","PRS3_2A_VFD1_I1"]
["PRS3_2A_VFD1","I2","PRS3_2A_VFD1_I2","PRS3_2A_JPE1"]
["PRS3_2A_VFD1","I3","PRS3_2A_VFD1_I3"]
["PRS3_2A_VFD1","IO0","PRS3_2A_VFD1_IO0"]
["PRS3_2A_VFD1","IO1","PRS3_2A_VFD1_IO1"]
["PRS3_2A_VFD1","SI0","PRS3_2A_VFD1_SI0"]
["PRS3_2A_VFD1","SI1","PRS3_2A_VFD1_SI1"]
["PRS3_2A_VFD1","SI2","PRS3_2A_VFD1_SI2"]
["PRS3_2A_VFD1","SI3","PRS3_2A_VFD1_SI3"]
["PRS3_2A_VFD1","SO0","PRS3_2A_VFD1_SO0"]
["PRS3_2B_VFD1","I0","PRS3_2B_VFD1_I0","PRS3_2B_VFD1_DISC"]
["PRS3_2B_VFD1","I1","PRS3_2B_VFD1_I1"]
["PRS3_2B_VFD1","I2","PRS3_2B_VFD1_I2","PRS3_2B_JPE1"]
["PRS3_2B_VFD1","I3","PRS3_2B_VFD1_I3"]
["PRS3_2B_VFD1","IO0","PRS3_2B_VFD1_IO0"]
["PRS3_2B_VFD1","IO1","PRS3_2B_VFD1_IO1"]
["PRS3_2B_VFD1","SI0","PRS3_2B_VFD1_SI0"]
["PRS3_2B_VFD1","SI1","PRS3_2B_VFD1_SI1"]
["PRS3_2B_VFD1","SI2","PRS3_2B_VFD1_SI2"]
["PRS3_2B_VFD1","SI3","PRS3_2B_VFD1_SI3"]
["PRS3_2B_VFD1","SO0","PRS3_2B_VFD1_SO0"]
["PRS3_3A_VFD1","I0","PRS3_3A_VFD1_I0","PRS3_3A_VFD1_DISC"]
["PRS3_3A_VFD1","I1","PRS3_3A_VFD1_I1"]
["PRS3_3A_VFD1","I2","PRS3_3A_VFD1_I2","PRS3_3A_JPE1"]
["PRS3_3A_VFD1","I3","PRS3_3A_VFD1_I3","PRS3_3A_JPE2"]
["PRS3_3A_VFD1","IO0","PRS3_3A_VFD1_IO0","PRS3_3A_BCN1_A"]
["PRS3_3A_VFD1","IO1","PRS3_3A_VFD1_IO1","PRS3_3A_BCN1_B"]
["PRS3_3A_VFD1","SI0","PRS3_3A_VFD1_SI0"]
["PRS3_3A_VFD1","SI1","PRS3_3A_VFD1_SI1"]
["PRS3_3A_VFD1","SI2","PRS3_3A_VFD1_SI2"]
["PRS3_3A_VFD1","SI3","PRS3_3A_VFD1_SI3"]
["PRS3_3A_VFD1","SO0","PRS3_3A_VFD1_SO0"]
["PRS3_3B_VFD1","I0","PRS3_3B_VFD1_I0","PRS3_3B_VFD1_DISC"]
["PRS3_3B_VFD1","I1","PRS3_3B_VFD1_I1"]
["PRS3_3B_VFD1","I2","PRS3_3B_VFD1_I2","PRS3_3B_JPE1"]
["PRS3_3B_VFD1","I3","PRS3_3B_VFD1_I3","PRS3_3B_JPE2"]
["PRS3_3B_VFD1","IO0","PRS3_3B_VFD1_IO0","PRS3_3B_BCN1_A"]
["PRS3_3B_VFD1","IO1","PRS3_3B_VFD1_IO1","PRS3_3B_BCN1_B"]
{"$rows_left_out":716}
{"sheet":"NETWORK","index":4,"n_rows":199,"n_cols":18,"rows_kept":199,"cut":false,"hidden":false,"merged":[[109,9,113,9]]}
["DPM","DPM_IP","Name","PartNumber","IP"]
["PRS3_5_DPM1","11.200.1.2","PRS4_1_VFD1","35S-6D5-P111","11.200.1.30",null,null,null,"HP",null,null,null,null,"PRS3_5_DPM1",null,"LOOP","PORT 1","PORT 2"]
["PRS3_5_DPM1","11.200.1.2","PRS4_2_VFD1","35S-6D4-P111","11.200.1.31",null,null,null,{"$f":"VLOOKUP(D2,'Part number'!$A$1:$B$13,2,0)","v":7.5},null,null,null,null,"PS11_7_DPM1",null,"MCM04"]
["PRS3_5_DPM1","11.200.1.2","PRS3_2B_VFD1","35S-6D2-P101","11.200.1.32",null,null,null,{"$f":"VLOOKUP(D3,'Part number'!$A$1:$B$13,2,0)","v":5},null,null,null,null,"PS10_2_DPM1",null,"PS10_2_DPM1",{"$f":"_xlfn.CONCAT(\"FROM \",P3,\" TO \", P4)","v":"FROM MCM04 TO PS10_2_DPM1"},{"$f":"_xlfn.CONCAT(\"FROM \",P4,\" TO \", P5)","v":"FROM PS10_2_DPM1 TO VSA_DPM3"}]
["PRS3_5_DPM1","11.200.1.2","PRS3_3B_VFD1","35S-6D2-P101","11.200.1.33",null,null,null,{"$f":"VLOOKUP(D4,'Part number'!$A$1:$B$13,2,0)","v":2},null,null,null,null,"FL1034_2_DPM1",null,"VSA_DPM3",{"$f":"_xlfn.CONCAT(\"FROM \",P4,\" TO \", P5)","v":"FROM PS10_2_DPM1 TO VSA_DPM3"},{"$f":"_xlfn.CONCAT(\"FROM \",P5,\" TO \", P6)","v":"FROM VSA_DPM3 TO VSA_DPM2"}]
["PRS3_5_DPM1","11.200.1.2","PRS3_2A_VFD1","35S-6D3-P101","11.200.1.34",null,null,null,{"$f":"VLOOKUP(D5,'Part number'!$A$1:$B$13,2,0)","v":2},null,null,null,null,"FL3016_2_DPM1",null,"VSA_DPM2","FROM VSA_DPM3 TO VSA_DPM2","FROM VSA_DPM2 TO FL1034_2_DPM1"]
["PRS3_5_DPM1","11.200.1.2","PRS3_3A_VFD1","35S-6D2-P101","11.200.1.35",null,null,null,{"$f":"VLOOKUP(D6,'Part number'!$A$1:$B$13,2,0)","v":3},null,null,null,null,"VSA_DPM1",null,"FL1034_2_DPM1","FROM VSA_DPM2 TO FL1034_2_DPM1","FROM FL1034_2_DPM1 TO VSA_DPM1"]
["PRS3_5_DPM1","11.200.1.2","PRS3_5_VFD1","35S-6D2-P101","11.200.1.36",null,null,null,{"$f":"VLOOKUP(D7,'Part number'!$A$1:$B$13,2,0)","v":2},null,null,null,null,"VSA_DPM2",null,"VSA_DPM1","FROM FL1034_2_DPM1 TO VSA_DPM1","FROM VSA_DPM1 TO VSC_DPM1"]
["PRS3_5_DPM1","11.200.1.2","PRS3_6_MDR1","MDR","11.200.1.230",null,null,null,{"$f":"VLOOKUP(D8,'Part number'!$A$1:$B$13,2,0)","v":2},null,null,null,null,"VSA_DPM3",null,"VSC_DPM1","FROM VSA_DPM1 TO VSC_DPM1","FROM VSC_DPM1 TO FL3016_2_DPM1"]
["PRS3_5_DPM1","11.200.1.2","PS11_1_VFD1","35S-6D4-P111","11.200.1.37",null,null,null,"MDR",null,null,null,null,"VSC_DPM1",null,"FL3016_2_DPM1","FROM VSC_DPM1 TO FL3016_2_DPM1","FROM FL3016_2_DPM1 TO VSC_DPM2"]
["PRS3_5_DPM1","11.200.1.2","PS11_2_VFD1","35S-6D4-P111","11.200.1.38",null,null,null,{"$f":"VLOOKUP(D10,'Part number'!$A$1:$B$13,2,0)","v":5},null,null,null,null,"VSC_DPM2",null,"VSC_DPM2","FROM FL3016_2_DPM1 TO VSC_DPM2","FROM VSC_DPM2 TO VSC_DPM3"]
["PRS3_5_DPM1","11.200.1.2","PS11_3_VFD1","35S-6D6-P111","11.200.1.39",null,null,null,{"$f":"VLOOKUP(D11,'Part number'!$A$1:$B$13,2,0)","v":5},null,null,null,null,"VSC_DPM3",null,"VSC_DPM3","FROM VSC_DPM2 TO VSC_DPM3","FROM VSC_DPM3 TO PS11_7_DPM1"]
["PRS3_5_DPM1","11.200.1.2","PS11_4_VFD1","35S-6D6-P111","11.200.1.40",null,null,null,{"$f":"VLOOKUP(D12,'Part number'!$A$1:$B$13,2,0)","v":10},null,null,null,null,null,null,"PS11_7_DPM1","FROM VSC_DPM3 TO PS11_7_DPM1","FROM PS11_7_DPM1 TO PRS3_5_DPM1"]
["PRS3_5_DPM1","11.200.1.2","PRS3_2A_FIO1","5032-8IOLM12DR","11.200.1.41",null,null,null,{"$f":"VLOOKUP(D13,'Part number'!$A$1:$B$13,2,0)","v":10},null,null,null,null,null,null,"PRS3_5_DPM1","FROM PS11_7_DPM1 TO PRS3_5_DPM1","FROM PRS3_5_DPM1 TO MCM04"]
["PRS3_5_DPM1","11.200.1.2","PRS3_2B_FIO1","5032-8IOLM12DR","11.200.1.42",null,null,null,{"$f":"VLOOKUP(D15,'Part number'!$A$1:$B$13,2,0)","v":"FIO"},null,null,null,null,null,null,"MCM04"]
["PRS3_5_DPM1","11.200.1.2","PRS3_4CH_FIO1","5032-8IOLM12DR","11.200.1.43",null,null,null,{"$f":"VLOOKUP(D16,'Part number'!$A$1:$B$13,2,0)","v":"FIO"}]
["PRS3_5_DPM1","11.200.1.2","PRS4_2_FIO1","5032-8IOLM12DR","11.200.1.44",null,null,null,{"$f":"VLOOKUP(D17,'Part number'!$A$1:$B$13,2,0)","v":"FIO"}]
["PRS3_5_DPM1","11.200.1.2","PS11_1_FIO1","5032-8IOLM12DR","11.200.1.45",null,null,null,{"$f":"VLOOKUP(D18,'Part number'!$A$1:$B$13,2,0)","v":"FIO"},null,null,null,null,null,null,"MCM04"]
["PRS3_5_DPM1","11.200.1.2","PS11_3_FIO1","5032-8IOLM12DR","11.200.1.46",null,null,null,{"$f":"VLOOKUP(D19,'Part number'!$A$1:$B$13,2,0)","v":"FIO"},null,null,null,null,null,null,"PS10_2_DPM1","FROM MCM04 TO PS10_2_DPM1","FROM PS10_2_DPM1 TO VSA_DPM3"]
["PRS3_5_DPM1","11.200.1.2","PS11_4_FIO1","5032-8IOLM12DR","11.200.1.47",null,null,null,{"$f":"VLOOKUP(D20,'Part number'!$A$1:$B$13,2,0)","v":"FIO"},null,null,null,null,null,null,"VSA_DPM3","FROM PS10_2_DPM1 TO VSA_DPM3","FROM VSA_DPM3 TO VSA_DPM2"]
["PS11_7_DPM1","11.200.1.3","PS11_6_VFD1","35S-6D6-P111","11.200.1.48",null,null,null,"FIO",null,null,null,null,null,null,"VSA_DPM2","FROM VSA_DPM3 TO VSA_DPM2","FROM VSA_DPM2 TO FL1034_2_DPM1"]
["PS11_7_DPM1","11.200.1.3","PS11_7_VFD1","25B-D030N104","11.200.1.49",null,null,null,{"$f":"VLOOKUP(D21,'Part number'!$A$1:$B$13,2,0)","v":10},null,null,null,null,null,null,"FL1034_2_DPM1","FROM VSA_DPM2 TO FL1034_2_DPM1","FROM FL1034_2_DPM1 TO VSA_DPM1"]
["PS11_7_DPM1","11.200.1.3","PS11_8_VFD1","25B-D024N104","11.200.1.50",null,null,null,{"$f":"VLOOKUP(D22,'Part number'!$A$1:$B$13,2,0)","v":20},null,null,null,null,null,null,"VSA_DPM1","FROM FL1034_2_DPM1 TO VSA_DPM1","FROM VSA_DPM1 TO VSC_DPM1"]
["PS11_7_DPM1","11.200.1.3","PS11_9_VFD1","25B-D024N104","11.200.1.51",null,null,null,{"$f":"VLOOKUP(D23,'Part number'!$A$1:$B$13,2,0)","v":15},null,null,null,null,null,null,"VSC_DPM1","FROM VSA_DPM1 TO VSC_DPM1","FROM VSC_DPM1 TO FL3016_2_DPM1"]
["PS11_7_DPM1","11.200.1.3","PS11_11_VFD1","25B-D024N104","11.200.1.52",null,null,null,{"$f":"VLOOKUP(D24,'Part number'!$A$1:$B$13,2,0)","v":15},null,null,null,null,null,null,"FL3016_2_DPM1","FROM VSC_DPM1 TO FL3016_2_DPM1","FROM FL3016_2_DPM1 TO VSC_DPM2"]
["PS11_7_DPM1","11.200.1.3","PS11_7_FIO1","5032-8IOLM12DR","11.200.1.53",null,null,null,{"$f":"VLOOKUP(D25,'Part number'!$A$1:$B$13,2,0)","v":15},null,null,null,null,null,null,"VSC_DPM2","FROM FL3016_2_DPM1 TO VSC_DPM2","FROM VSC_DPM2 TO VSC_DPM3"]
["PS11_7_DPM1","11.200.1.3","PS11_8_SIO1","0980SSL3131-121-007D-202","11.200.1.54",null,null,null,{"$f":"VLOOKUP(D26,'Part number'!$A$1:$B$13,2,0)","v":"FIO"},null,null,null,null,null,null,"VSC_DPM3","FROM VSC_DPM2 TO VSC_DPM3","FROM VSC_DPM3 TO PS11_7_DPM1"]
["PS11_7_DPM1","11.200.1.3","PS11_11_FIO1","5032-8IOLM12DR","11.200.1.55",null,null,null,"SIO",null,null,null,null,null,null,"PS11_7_DPM1","FROM VSC_DPM3 TO PS11_7_DPM1","FROM PS11_7_DPM1 TO PRS3_5_DPM1"]
["PS11_7_DPM1","11.200.1.3","PS11_11_FIO2","5032-8IOLM12DR","11.200.1.93",null,null,null,{"$f":"VLOOKUP(D28,'Part number'!$A$1:$B$13,2,0)","v":"FIO"},null,null,null,null,null,null,"PRS3_5_DPM1","FROM PS11_7_DPM1 TO PRS3_5_DPM1","FROM PRS3_5_DPM1 TO MCM04"]
["PS11_7_DPM1","11.200.1.3","PS11_11_FIO3","5032-8IOLM12DR","11.200.1.94",null,null,null,{"$f":"VLOOKUP(D29,'Part number'!$A$1:$B$13,2,0)","v":"FIO"},"add","2025-05-19",null,null,null,null,"MCM04"]
["PS11_7_DPM1","11.200.1.3","PDP9_FIO1","5032-8IOLM12DR","11.200.1.220",null,null,null,{"$f":"VLOOKUP(D30,'Part number'!$A$1:$B$13,2,0)","v":"FIO"},"add","2025-05-19"]
["PS11_7_DPM1","11.200.1.3","PDP9_PMM1","1420-V2-ENT","11.200.1.221",null,null,null,{"$f":"VLOOKUP(D31,'Part number'!$A$1:$B$13,2,0)","v":"FIO"},"ADDED","2025-05-25"]
["PS11_7_DPM1","11.200.1.3","PDP10_FIO1","5032-8IOLM12DR","11.200.1.222",null,null,null,"PMM","ADDED","2025-05-26"]
["PS11_7_DPM1","11.200.1.3","PDP10_PMM1","1420-V2-ENT","11.200.1.223",null,null,null,"FIO","ADDED","2025-05-27"]
["PS10_2_DPM1","11.200.1.4","PS10_1_VFD1","35S-6D4-P111","11.200.1.56",null,null,null,"PMM","ADDED","2025-05-28"]
["PS10_2_DPM1","11.200.1.4","PS10_2_VFD1","25B-D024N104","11.200.1.57",null,null,null,{"$f":"VLOOKUP(D35,'Part number'!$A$1:$B$13,2,0)","v":5}]
["PS10_2_DPM1","11.200.1.4","PS10_3_VFD1","25B-D024N104","11.200.1.58",null,null,null,{"$f":"VLOOKUP(D36,'Part number'!$A$1:$B$13,2,0)","v":15}]
["PS10_2_DPM1","11.200.1.4","PS10_5_VFD1","25B-D024N104","11.200.1.59",null,null,null,{"$f":"VLOOKUP(D37,'Part number'!$A$1:$B$13,2,0)","v":15}]
["PS10_2_DPM1","11.200.1.4","ULC5_1_ST1","PIONEER","11.200.1.60",null,null,null,{"$f":"VLOOKUP(D38,'Part number'!$A$1:$B$13,2,0)","v":15}]
["PS10_2_DPM1","11.200.1.4","ULC5_3_VFD1","35S-6D2-P101","11.200.1.61",null,null,null,{"$f":"VLOOKUP(D39,'Part number'!$A$1:$B$13,2,0)","v":"TIPPER"}]
{"$rows_left_out":160}
{"sheet":"Part number","index":5,"n_rows":13,"n_cols":2,"rows_kept":13,"cut":false,"hidden":false,"merged":[]}
["PART NUMBER","HP"]
["35S-6D2-P101",2]
["35S-6D3-P101",3]
["35S-6D4-P111",5]
["35S-6D5-P111",7.5]
["35S-6D6-P111",10]
["25B-D024N104",15]
["25B-D030N104",20]
["25B-D043N114 ",30]
["CALJAN","EXTENDO"]
["PIONEER","TIPPER"]
["ZMX-3DE2500HF-Q7-AMZCHD","ZMX"]
["5032-8IOLM12DR","FIO"]

{"sheet":"MCM04_DESC","index":6,"n_rows":755,"n_cols":9,"rows_kept":755,"cut":false,"hidden":false,"merged":[[26,8,30,8],[1,8,5,8],[6,8,10,8],[11,8,15,8],[16,8,20,8],[21,8,25,8],[86,8,90,8],[31,8,35,8],[36,8,40,8],[41,8,45,8],[46,8,50,8],[51,8,55,8],[56,8,60,8],[61,8,65,8],[66,8,70,8],[71,8,75,8],[76,8,80,8],[81,8,85,8]]}
["TAGNAME","ADDR","TERM","TERMDESC","DESCA","DESCB",null,"CONTROLLERS"]
["PRS3_2A_VFD1","PRS3_2A_VFD1_I0","I0",null,"PRS3_2A_VFD1_DISC","DISCONNECT AUX",null,"PRS3_2A_VFD1",600]
["PRS3_2A_VFD1","PRS3_2A_VFD1_I1","I1",null,"SPARE",null,null,"PRS3_2B_VFD1"]
["PRS3_2A_VFD1","PRS3_2A_VFD1_I2","I2",null,"PRS3_2A_JPE1","JAM PHOTOEYE",null,"PRS3_3A_VFD1"]
["PRS3_2A_VFD1","PRS3_2A_VFD1_I3","I3",null,"SPARE",null,null,"PRS3_3B_VFD1"]
["PRS3_2A_VFD1","PRS3_2A_VFD1_IO0","IO0",null,"SPARE"]
["PRS3_2A_VFD1","PRS3_2A_VFD1_IO1","IO1",null,"SPARE",null,null,"PRS3_5_VFD1",601]
["PRS3_2A_VFD1","PRS3_2A_VFD1_SI0","SI0",null,"SPARE",null,null,"PRS4_1_VFD1"]
["PRS3_2A_VFD1","PRS3_2A_VFD1_SI1","SI1",null,"SPARE",null,null,"PRS4_2_VFD1"]
["PRS3_2A_VFD1","PRS3_2A_VFD1_SI2","SI2",null,"SPARE",null,null,"PS10_1_VFD1"]
["PRS3_2A_VFD1","PRS3_2A_VFD1_SI3","SI3",null,"SPARE"]
["PRS3_2A_VFD1","PRS3_2A_VFD1_SO0","SO0",null,"SPARE",null,null,"PS10_2_VFD1",602]
["PRS3_2B_VFD1","PRS3_2B_VFD1_I0","I0",null,"PRS3_2B_VFD1_DISC","DISCONNECT AUX",null,"PS10_3_VFD1"]
["PRS3_2B_VFD1","PRS3_2B_VFD1_I1","I1",null,"SPARE",null,null,"PS10_5_VFD1"]
["PRS3_2B_VFD1","PRS3_2B_VFD1_I2","I2",null,"PRS3_2B_JPE1","JAM PHOTOEYE",null,"PS10_5_SIO1"]
["PRS3_2B_VFD1","PRS3_2B_VFD1_I3","I3",null,"SPARE"]
["PRS3_2B_VFD1","PRS3_2B_VFD1_IO0","IO0",null,"SPARE",null,null,"PS11_1_VFD1",603]
["PRS3_2B_VFD1","PRS3_2B_VFD1_IO1","IO1",null,"SPARE",null,null,"PS11_2_VFD1"]
["PRS3_2B_VFD1","PRS3_2B_VFD1_SI0","SI0",null,"SPARE",null,null,"PS11_3_VFD1"]
["PRS3_2B_VFD1","PRS3_2B_VFD1_SI1","SI1",null,"SPARE",null,null,"PS11_4_VFD1"]
["PRS3_2B_VFD1","PRS3_2B_VFD1_SI2","SI2",null,"SPARE"]
["PRS3_2B_VFD1","PRS3_2B_VFD1_SI3","SI3",null,"SPARE",null,null,"PS11_6_VFD1",604]
["PRS3_2B_VFD1","PRS3_2B_VFD1_SO0","SO0",null,"SPARE",null,null,"PS11_7_VFD1"]
["PRS3_3A_VFD1","PRS3_3A_VFD1_I0","I0",null,"PRS3_3A_VFD1_DISC","DISCONNECT AUX",null,"PS11_8_VFD1"]
["PRS3_3A_VFD1","PRS3_3A_VFD1_I1","I1",null,"SPARE",null,null,"PS11_9_VFD1"]
["PRS3_3A_VFD1","PRS3_3A_VFD1_I2","I2",null,"PRS3_3A_JPE1","JAM PHOTOEYE"]
["PRS3_3A_VFD1","PRS3_3A_VFD1_I3","I3",null,"PRS3_3A_JPE2","JAM PHOTOEYE",null,"PS11_11_VFD1",605]
["PRS3_3A_VFD1","PRS3_3A_VFD1_IO0","IO0",null,"PRS3_3A_BCN1_A","AMBER BEACON LIGHT",null,"PS11_8_SIO1"]
["PRS3_3A_VFD1","PRS3_3A_VFD1_IO1","IO1",null,"PRS3_3A_BCN1_B","BLUE BEACON LIGHT",null,"PS11_8_FIOH1"]
["PRS3_3A_VFD1","PRS3_3A_VFD1_SI0","SI0",null,"SPARE",null,null,"ULC5_3_VFD1"]
["PRS3_3A_VFD1","PRS3_3A_VFD1_SI1","SI1",null,"SPARE"]
["PRS3_3A_VFD1","PRS3_3A_VFD1_SI2","SI2",null,"SPARE",null,null,"ULC6_3_VFD1",606]
["PRS3_3A_VFD1","PRS3_3A_VFD1_SI3","SI3",null,"SPARE",null,null,"ULC7_3_VFD1"]
["PRS3_3A_VFD1","PRS3_3A_VFD1_SO0","SO0",null,"SPARE",null,null,"ULC8_3_VFD1"]
["PRS3_3B_VFD1","PRS3_3B_VFD1_I0","I0",null,"PRS3_3B_VFD1_DISC","DISCONNECT AUX",null,"PRS3_2A_FIO1"]
["PRS3_3B_VFD1","PRS3_3B_VFD1_I1","I1",null,"SPARE"]
["PRS3_3B_VFD1","PRS3_3B_VFD1_I2","I2",null,"PRS3_3B_JPE1","JAM PHOTOEYE",null,"PRS3_2B_FIO1",607]
["PRS3_3B_VFD1","PRS3_3B_VFD1_I3","I3",null,"PRS3_3B_JPE2","JAM PHOTOEYE",null,"PRS3_4CH_FIO1"]
["PRS3_3B_VFD1","PRS3_3B_VFD1_IO0","IO0",null,"PRS3_3B_BCN1_A","AMBER BEACON LIGHT",null,"PRS4_2_FIO1"]
["PRS3_3B_VFD1","PRS3_3B_VFD1_IO1","IO1",null,"PRS3_3B_BCN1_B","BLUE BEACON LIGHT",null,"PS10_1_FIO1"]
{"$rows_left_out":716}
{"sheet":"MCM04_DESC_v2","index":7,"n_rows":2212,"n_cols":22,"rows_kept":2212,"cut":false,"hidden":false,"merged":[[61,6,65,6],[66,6,70,6],[71,6,75,6],[76,6,80,6],[31,6,35,6],[36,6,40,6],[41,6,45,6],[46,6,50,6],[51,6,55,6],[56,6,60,6],[26,6,30,6],[1,6,5,6],[6,6,10,6],[11,6,15,6],[16,6,20,6],[21,6,25,6]]}
["TAGNAME","TERM","DESCA","DESCB",null,"CONTROLLERS"]
["PRS3_2A_VFD1","I0","PRS3_2A_VFD1_DISC","DISCONNECT AUX",null,"PRS3_2A_VFD1",600,null,null,{"$f":"_xlfn.CONCAT(F2,\"/\",F3,\"/\",F4,\"/\",F5)","v":"PRS3_2A_VFD1/PRS3_2B_VFD1/PRS3_3A_VFD1/PRS3_3B_VFD1"},null,null,null,null,null,600,"PRS3_2A_VFD1/PRS3_2B_VFD1/PRS3_3A_VFD1/PRS3_3B_VFD1"]
["PRS3_2A_VFD1","I1","SPARE",null,null,"PRS3_2B_VFD1",null,null,null,null,null,null,null,null,null,601,"PRS3_5_VFD1/PRS4_1_VFD1/PRS4_2_VFD1/PS10_1_VFD1"]
["PRS3_2A_VFD1","I2","PRS3_2A_JPE1","JAM PHOTOEYE",null,"PRS3_3A_VFD1",null,null,null,null,null,null,null,null,null,602,"PS10_2_VFD1/PS10_3_VFD1/PS10_5_VFD1/PS10_5_SIO1"]
["PRS3_2A_VFD1","I3","SPARE",null,null,"PRS3_3B_VFD1",null,null,null,null,null,null,null,null,null,603,"PS11_1_VFD1/PS11_2_VFD1/PS11_3_VFD1/PS11_4_VFD1"]
["PRS3_2A_VFD1","IO0","SPARE",null,null,null,null,null,null,null,null,null,null,null,null,604,"PS11_6_VFD1/PS11_7_VFD1/PS11_8_VFD1/PS11_9_VFD1"]
["PRS3_2A_VFD1","IO1","SPARE",null,null,"PRS3_5_VFD1",601,null,null,{"$f":"_xlfn.CONCAT(F7,\"/\",F8,\"/\",F9,\"/\",F10)","v":"PRS3_5_VFD1/PRS4_1_VFD1/PRS4_2_VFD1/PS10_1_VFD1"},null,null,null,null,null,605,"PS11_11_VFD1/PS11_8_SIO1/PS11_8_FIOH1/ULC5_3_VFD1"]
["PRS3_2A_VFD1","SI0","SPARE",null,null,"PRS4_1_VFD1",null,null,null,null,null,null,null,null,null,606,"ULC6_3_VFD1/ULC7_3_VFD1/ULC8_3_VFD1/PRS3_2A_FIO1"]
["PRS3_2A_VFD1","SI1","SPARE",null,null,"PRS4_2_VFD1",null,null,null,null,null,null,null,null,null,607,"PRS3_2B_FIO1/PRS3_4CH_FIO1/PRS4_2_FIO1/PS10_1_FIO1"]
["PRS3_2A_VFD1","SI2","SPARE",null,null,"PS10_1_VFD1",null,null,null,null,null,null,null,null,null,608,"PS10_1_FIOH1/PS10_1_FIOH2/PS10_5_FIO1/PS10_5_FIO2"]
["PRS3_2A_VFD1","SI3","SPARE",null,null,null,null,null,null,null,null,null,null,null,null,609,"PS10_5_FIOH1/PS10_5_FIOH2/PS10_5_FIOH3/PS10_5_FIOH4"]
["PRS3_2A_VFD1","SO0","SPARE",null,null,"PS10_2_VFD1",602,null,null,{"$f":"_xlfn.CONCAT(F12,\"/\",F13,\"/\",F14,\"/\",F15)","v":"PS10_2_VFD1/PS10_3_VFD1/PS10_5_VFD1/PS10_5_SIO1"},null,null,null,null,null,610,"PS11_1_FIO1/PS11_1_FIOH1/PS11_11_FIO1/PS11_11_FIO2"]
["PRS3_2B_VFD1","I0","PRS3_2B_VFD1_DISC","DISCONNECT AUX",null,"PS10_3_VFD1",null,null,null,null,null,null,null,null,null,611,"PS11_11_FIO3/PS11_11_FIOH1/PS11_11_FIOH2/PS11_11_FIOH3"]
["PRS3_2B_VFD1","I1","SPARE",null,null,"PS10_5_VFD1",null,null,null,null,null,null,null,null,null,612,"PS11_11_FIOH4/PS11_11_FIOH5/PS11_11_FIOH6/PS11_3_FIO1"]
["PRS3_2B_VFD1","I2","PRS3_2B_JPE1","JAM PHOTOEYE",null,"PS10_5_SIO1",null,null,null,null,null,null,null,null,null,613,"PS11_4_FIO1/PS11_7_FIO1/FL1014_FIOH1/S011020_FIOH1"]
["PRS3_2B_VFD1","I3","SPARE",null,null,null,null,null,null,null,null,null,null,null,null,614,"FL1022_FIOH1/FL1026_FIOH1/FL1034_FIOH1/S011040_FIOH1"]
["PRS3_2B_VFD1","IO0","SPARE",null,null,"PS11_1_VFD1",603,null,null,{"$f":"_xlfn.CONCAT(F17,\"/\",F18,\"/\",F19,\"/\",F20)","v":"PS11_1_VFD1/PS11_2_VFD1/PS11_3_VFD1/PS11_4_VFD1"},null,null,null,null,null,615,"S013010_FIOH1/FL3016_FIOH1/S013018_FIOH1/FL3024_FIOH1"]
["PRS3_2B_VFD1","IO1","SPARE",null,null,"PS11_2_VFD1"]
["PRS3_2B_VFD1","SI0","SPARE",null,null,"PS11_3_VFD1"]
["PRS3_2B_VFD1","SI1","SPARE",null,null,"PS11_4_VFD1"]
["PRS3_2B_VFD1","SI2","SPARE"]
["PRS3_2B_VFD1","SI3","SPARE",null,null,"PS11_6_VFD1",604,null,null,{"$f":"_xlfn.CONCAT(F22,\"/\",F23,\"/\",F24,\"/\",F25)","v":"PS11_6_VFD1/PS11_7_VFD1/PS11_8_VFD1/PS11_9_VFD1"}]
["PRS3_2B_VFD1","SO0","SPARE",null,null,"PS11_7_VFD1"]
["PRS3_3A_VFD1","I0","PRS3_3A_VFD1_DISC","DISCONNECT AUX",null,"PS11_8_VFD1"]
["PRS3_3A_VFD1","I1","SPARE",null,null,"PS11_9_VFD1"]
["PRS3_3A_VFD1","I2","PRS3_3A_JPE1","JAM PHOTOEYE"]
["PRS3_3A_VFD1","I3","PRS3_3A_JPE2","JAM PHOTOEYE",null,"PS11_11_VFD1",605,null,null,{"$f":"_xlfn.CONCAT(F27,\"/\",F28,\"/\",F29,\"/\",F30)","v":"PS11_11_VFD1/PS11_8_SIO1/PS11_8_FIOH1/ULC5_3_VFD1"}]
["PRS3_3A_VFD1","IO0","PRS3_3A_BCN1_A","AMBER BEACON LIGHT",null,"PS11_8_SIO1"]
["PRS3_3A_VFD1","IO1","PRS3_3A_BCN1_B","BLUE BEACON LIGHT",null,"PS11_8_FIOH1"]
["PRS3_3A_VFD1","SI0","SPARE",null,null,"ULC5_3_VFD1"]
["PRS3_3A_VFD1","SI1","SPARE"]
["PRS3_3A_VFD1","SI2","SPARE",null,null,"ULC6_3_VFD1",606,null,null,{"$f":"_xlfn.CONCAT(F32,\"/\",F33,\"/\",F34,\"/\",F35)","v":"ULC6_3_VFD1/ULC7_3_VFD1/ULC8_3_VFD1/PRS3_2A_FIO1"}]
["PRS3_3A_VFD1","SI3","SPARE",null,null,"ULC7_3_VFD1"]
["PRS3_3A_VFD1","SO0","SPARE",null,null,"ULC8_3_VFD1"]
["PRS3_3B_VFD1","I0","PRS3_3B_VFD1_DISC","DISCONNECT AUX",null,"PRS3_2A_FIO1"]
["PRS3_3B_VFD1","I1","SPARE"]
["PRS3_3B_VFD1","I2","PRS3_3B_JPE1","JAM PHOTOEYE",null,"PRS3_2B_FIO1",607,null,null,{"$f":"_xlfn.CONCAT(F37,\"/\",F38,\"/\",F39,\"/\",F40)","v":"PRS3_2B_FIO1/PRS3_4CH_FIO1/PRS4_2_FIO1/PS10_1_FIO1"}]
["PRS3_3B_VFD1","I3","PRS3_3B_JPE2","JAM PHOTOEYE",null,"PRS3_4CH_FIO1"]
["PRS3_3B_VFD1","IO0","PRS3_3B_BCN1_A","AMBER BEACON LIGHT",null,"PRS4_2_FIO1"]
["PRS3_3B_VFD1","IO1","PRS3_3B_BCN1_B","BLUE BEACON LIGHT",null,"PS10_1_FIO1"]
{"$rows_left_out":2172}