{"text_format":"1","workbook":"xlsx","n_sheets":7,"sheets":["Templates","Devices","Instructions","IO Assignment MCM05","NETWORK","Part Number","MCM05_DESC"],"not_rendered":{"charts":0,"images":10,"macros":1,"external_links":1,"defined_names":5,"comments":0,"pivot_tables":0},"unopened":[],"bounds":{"document_bytes":16777216,"sheet_cells":100000,"rows_first":2000,"rows_last":500,"rows_between":2000,"halvings":0,"cell_chars":16384,"cell_head_chars":4096},"cells_cut":0,"cells_raw":0,"read":"whole","date_system":"1900"}

{"sheet":"Templates","index":0,"n_rows":19,"n_cols":3,"rows_kept":19,"cut":false,"hidden":true,"merged":[]}
[]
["VFD IO TEMPLATE",null,"FIO IO Template"]
["I0",null,"IO00"]
["I1",null,"IO01"]
["I2",null,"IO02"]
["I3",null,"IO03"]
["IO0",null,"IO04"]
["IO1",null,"IO05"]
["SI0",null,"IO06"]
["SI1",null,"IO07"]
["SI2",null,"IO08"]
["SI3",null,"IO09"]
["SO0",null,"IO10"]
[null,null,"IO11"]
[null,null,"IO12"]
[null,null,"IO13"]
[null,null,"IO14"]
[null,null,"IO15"]
[null,null,"IO16"]

{"sheet":"Devices","index":1,"n_rows":390,"n_cols":9,"rows_kept":390,"cut":false,"hidden":false,"merged":[]}
[null,null,null,null,null,null,null,"Which MCM we assign?","MCM05"]
["PRS1_1ACH_BCN1_A"]
["PRS1_1ACH_BCN1_B"]
["PRS1_1ACH_FPE1"]
["PRS1_1BCH_BCN1_A"]
["PRS1_1BCH_BCN1_B"]
["PRS1_1BCH_FPE1"]
["PRS1_2A_BCN1_A"]
["PRS1_2A_DISC"]
["PRS1_2A_JPE1"]
["PRS1_2A_JPE2"]
["PRS1_2A_JR1_PB"]
["PRS1_2A_JR1_PB_LT"]
["PRS1_2A_JR2_PB"]
["PRS1_2A_JR2_PB_LT"]
["PRS1_2A_VFD1"]
["PRS1_2B_BCN1_A"]
["PRS1_2B_DISC"]
["PRS1_2B_JPE1"]
["PRS1_2B_JPE2"]
["PRS1_2B_JR1_PB"]
["PRS1_2B_JR1_PB_LT"]
["PRS1_2B_JR2_PB"]
["PRS1_2B_JR2_PB_LT"]
["PRS1_2B_VFD1"]
["PRS1_3_BCN1_A"]
["PRS1_3_DISC"]
["PRS1_3_FIO1"]
["PRS1_3_JPE1"]
["PRS1_3_JPE2"]
["PRS1_3_JR1_PB"]
["PRS1_3_JR1_PB_LT"]
["PRS1_3_VFD1"]
["PRS1_4_BCN1_A"]
["PRS1_4_BCN1_R"]
["PRS1_4_DISC"]
["PRS1_4_FIO1"]
["PRS1_4_JPE1"]
["PRS1_4_JPE2"]
["PRS1_4_JR1_PB"]
{"$rows_left_out":351}
{"sheet":"Instructions","index":2,"n_rows":116,"n_cols":2,"rows_kept":116,"cut":false,"hidden":false,"merged":[]}
[]
["1. ","Put all device tags to cell A2"]
[]
[]
[]
[]
[]
[]
[]
[]
[]
[]
[]
[]
[]
[]
[]
[]
[]
[]
[]
[]
[]
[]
[]
[]
[]
[]
[]
[]
[]
[]
[]
[]
[]
[]
["2.","In cell I1 write MCM number"]
[]
[]
[]
{"$rows_left_out":77}
{"sheet":"IO Assignment MCM05","index":3,"n_rows":701,"n_cols":11,"rows_kept":701,"cut":false,"hidden":false,"merged":[]}
["Controller name","Signal type","Address name","Assigned device","Unassigned Device",null,null,null,null,null,"MCM05_DESC"]
["PRS1_2A_VFD1","I0","PRS1_2A_VFD1_I0","PRS1_2A_VFD1_DISC"]
["PRS1_2A_VFD1","I1","PRS1_2A_VFD1_I1"]
["PRS1_2A_VFD1","I2","PRS1_2A_VFD1_I2","PRS1_2A_JPE1"]
["PRS1_2A_VFD1","I3","PRS1_2A_VFD1_I3","PRS1_2A_JPE2"]
["PRS1_2A_VFD1","IO0","PRS1_2A_VFD1_IO0"]
["PRS1_2A_VFD1","IO1","PRS1_2A_VFD1_IO1"]
["PRS1_2A_VFD1","SI0","PRS1_2A_VFD1_SI0"]
["PRS1_2A_VFD1","SI1","PRS1_2A_VFD1_SI1"]
["PRS1_2A_VFD1","SI2","PRS1_2A_VFD1_SI2"]
["PRS1_2A_VFD1","SI3","PRS1_2A_VFD1_SI3"]
["PRS1_2A_VFD1","SO0","PRS1_2A_VFD1_SO0"]
["PRS1_2B_VFD1","I0","PRS1_2B_VFD1_I0","PRS1_2B_VFD1_DISC"]
["PRS1_2B_VFD1","I1","PRS1_2B_VFD1_I1"]
["PRS1_2B_VFD1","I2","PRS1_2B_VFD1_I2","PRS1_2B_JPE1"]
["PRS1_2B_VFD1","I3","PRS1_2B_VFD1_I3","PRS1_2B_JPE2"]
["PRS1_2B_VFD1","IO0","PRS1_2B_VFD1_IO0"]
["PRS1_2B_VFD1","IO1","PRS1_2B_VFD1_IO1"]
["PRS1_2B_VFD1","SI0","PRS1_2B_VFD1_SI0"]
["PRS1_2B_VFD1","SI1","PRS1_2B_VFD1_SI1"]
["PRS1_2B_VFD1","SI2","PRS1_2B_VFD1_SI2"]
["PRS1_2B_VFD1","SI3","PRS1_2B_VFD1_SI3"]
["PRS1_2B_VFD1","SO0","PRS1_2B_VFD1_SO0"]
["PRS1_3_VFD1","I0","PRS1_3_VFD1_I0","PRS1_3_VFD1_DISC"]
["PRS1_3_VFD1","I1","PRS1_3_VFD1_I1"]
["PRS1_3_VFD1","I2","PRS1_3_VFD1_I2","PRS1_3_JPE2"]
["PRS1_3_VFD1","I3","PRS1_3_VFD1_I3"]
["PRS1_3_VFD1","IO0","PRS1_3_VFD1_IO0","PRS1_3_JR1_PB"]
["PRS1_3_VFD1","IO1","PRS1_3_VFD1_IO1","PRS1_3_JR1_PB_LT"]
["PRS1_3_VFD1","SI0","PRS1_3_VFD1_SI0"]
["PRS1_3_VFD1","SI1","PRS1_3_VFD1_SI1"]
["PRS1_3_VFD1","SI2","PRS1_3_VFD1_SI2"]
["PRS1_3_VFD1","SI3","PRS1_3_VFD1_SI3"]
["PRS1_3_VFD1","SO0","PRS1_3_VFD1_SO0","PRS1_3_BCN1_A"]
["PRS1_4_VFD1","I0","PRS1_4_VFD1_I0","PRS1_4_VFD1_DISC"]
["PRS1_4_VFD1","I1","PRS1_4_VFD1_I1"]
["PRS1_4_VFD1","I2","PRS1_4_VFD1_I2","PRS1_4_JPE1"]
["PRS1_4_VFD1","I3","PRS1_4_VFD1_I3","PRS1_4_JPE2"]
["PRS1_4_VFD1","IO0","PRS1_4_VFD1_IO0"]
["PRS1_4_VFD1","IO1","PRS1_4_VFD1_IO1"]
{"$rows_left_out":662}
{"sheet":"NETWORK","index":4,"n_rows":176,"n_cols":17,"rows_kept":176,"cut":false,"hidden":false,"merged":[[0,5,0,8],[40,3,49,3],[40,4,49,4],[50,3,59,3],[50,4,59,4],[2,3,15,3],[2,4,15,4],[0,3,0,4],[16,3,39,3],[16,4,39,4],[60,2,175,2],[163,3,175,3],[163,4,175,4],[118,3,140,3],[118,4,140,4],[141,3,162,3],[141,4,162,4],[60,3,80,3],[60,4,80,4],[81,3,101,3],[81,4,101,4],[102,3,117,3],[102,4,117,4]]}
[null,"MCM05",null,"RING",null,"STAR"]
["SLOT0","1756_L83ES","IP","DPM","IP","VFD NAME","TYPE","VFD PART NUMBER","IP"]
["SLOT1","1756_N2",null,"PRS1_3_DPM1","11.200.1.2","PRS2_1_VFD1",7.5,"35S_6D5_P111","11.200.1.30"]
["SLOT2","1756_EN4TR","11.200.1.1",null,null,"PRS1_2A_VFD1",5,"35S_6D4_P111","11.200.1.31"]
["SLOT3","1756_N2",null,null,null,"PRS1_2B_VFD1",3,"35S_6D3_P101","11.200.1.32"]
["SLOT4","1756_N2",null,null,null,"PRS1_3_VFD1",7.5,"35S_6D5_P111","11.200.1.33"]
["SLOT5","1756_IB16",null,null,null,"PRS1_4_VFD1",3,"35S_6D3_P101","11.200.1.34",null,null,"MCM05",null,"PRS1_3_DPM1",null,"PRS1_3_DPM1",{"$f":"_xlfn.CONCAT(P7,\" CONNECTIONS\")","v":"PRS1_3_DPM1 CONNECTIONS"}]
["SLOT6","1756_OB16E",null,null,null,"PRS1_6_VFD1",2,"35S_6D2_P101","11.200.1.35",null,null,null,null,null,null,"PS8_5_DPM1",{"$f":"_xlfn.CONCAT(P8,\" CONNECTIONS\")","v":"PS8_5_DPM1 CONNECTIONS"}]
["SLOT7","1756_IB16S",null,null,null,"PRS1_7_MDR1","PSU","ITOH",null,null,null,null,null,"VSD_DPM3",null,"FL2086_DPM1","FL2086_DPM1 CONNECTIONS"]
["SLOT8","1756_N2",null,null,null,"PS8_9_VFD1",15,"25B_D024N104","11.200.1.36",null,null,null,null,null,null,"FL4070_DPM1","FL4070_DPM1 CONNECTIONS"]
["SLOT9","1756_N2",null,null,null,"PS8_11_VFD1",10,"35S_6D6_P111","11.200.1.37",null,null,null,null,"VSD_DPM1",null,"VSD_DPM1","VSD_DPM1 CONNECTIONS"]
[null,null,null,null,null,"PRS1_1ACH_FIO1","FIO",{"$f":"VLOOKUP(G12,'[1]PART NUMBER'!$A$2:$B$20,2,FALSE)","v":"5032-8IOLM12DR"},"11.200.1.38",null,null,null,null,null,null,"VSD_DPM2","VSD_DPM2 CONNECTIONS"]
[null,null,null,null,null,"PRS1_1BCH_FIO1","FIO",{"$f":"VLOOKUP(G13,'[1]PART NUMBER'!$A$2:$B$20,2,FALSE)","v":"5032-8IOLM12DR"},"11.200.1.39",null,null,null,null,"VSD_DPM2",null,"VSD_DPM3","VSD_DPM3 CONNECTIONS"]
["DPM COUNT",10,null,null,null,"PRS1_4_FIO1","FIO",{"$f":"VLOOKUP(G14,'[1]PART NUMBER'!$A$2:$B$20,2,FALSE)","v":"5032-8IOLM12DR"},"11.200.1.40",null,null,null,null,null,null,"VSB_DPM1","VSB_DPM1 CONNECTIONS"]
["FIO COUNT",53,null,null,null,"PS8_1_FIO1","FIO",{"$f":"VLOOKUP(G15,'[1]PART NUMBER'!$A$2:$B$20,2,FALSE)","v":"5032-8IOLM12DR"},"11.200.1.41",null,null,null,null,"FL4070_DPM1",null,"VSB_DPM2","VSB_DPM2 CONNECTIONS"]
[null,null,null,null,null,"PS8_1_FIO2","FIO",{"$f":"VLOOKUP(G16,'[1]PART NUMBER'!$A$2:$B$20,2,FALSE)","v":"5032-8IOLM12DR"},"11.200.1.42",null,null,null,null,null,null,"VSB_DPM3","VSB_DPM3 CONNECTIONS"]
[null,null,null,"PS8_5_DPM1","11.200.1.3","ULC1_1_VFD1","TIPPER","PIONEER","11.200.1.43",null,null,null,null,"FL2086_DPM1"]
[null,null,null,null,null,"ULC1_3_VFD1",2,"35S_6D2_P101","11.200.1.44"]
[null,null,null,null,null,"ULC2_1_VFD1","TIPPER","PIONEER","11.200.1.45",null,null,null,null,"VSB_DPM3"]
[null,null,null,null,null,"ULC2_3_VFD1",2,"35S_6D2_P101","11.200.1.46"]
[null,null,null,null,null,"ULC3_1_VFD1","TIPPER","PIONEER","11.200.1.47",null,null,null,null,"VSB_DPM1"]
[null,null,null,null,null,"ULC3_3_VFD1",2,"35S_6D2_P101","11.200.1.48"]
[null,null,null,null,null,"ULC4_1_EX1","TIPPER","PIONEER","11.200.1.49",null,null,null,null,"VSB_DPM2"]
[null,null,null,null,null,"ULC4_3_VFD1",2,"35S_6D2_P101","11.200.1.50"]
[null,null,null,null,null,"PS8_1_VFD1",7.5,"35S_6D5_P111","11.200.1.51",null,null,null,null,"PS8_5_DPM1"]
[null,null,null,null,null,"PS8_2_VFD1",10,"35S_6D6_P111","11.200.1.52"]
[null,null,null,null,null,"PS8_4_VFD1",15,"25B_D024N104","11.200.1.53"]
[null,null,null,null,null,"PS8_5_VFD1",15,"25B_D024N104","11.200.1.54"]
[null,null,null,null,null,"PS8_6_VFD1",5,"35S_6D4_P111","11.200.1.55"]
[null,null,null,null,null,"PS8_8_VFD1",7.5,"35S_6D5_P111","11.200.1.56"]
[null,null,null,null,null,"PS9_2_VFD1",7.5,"35S_6D5_P111","11.200.1.57"]
[null,null,null,null,null,"PS9_3_VFD1",7.5,"35S_6D5_P111","11.200.1.58"]
[null,null,null,null,null,"PS8_11_FIO1","FIO",{"$f":"VLOOKUP(G33,'[1]PART NUMBER'!$A$2:$B$20,2,FALSE)","v":"5032-8IOLM12DR"},"11.200.1.59"]
[null,null,null,null,null,"PS8_11_FIO2","FIO",{"$f":"VLOOKUP(G34,'[1]PART NUMBER'!$A$2:$B$20,2,FALSE)","v":"5032-8IOLM12DR"},"11.200.1.60"]
[null,null,null,null,null,"PS8_4_SIO1","SIO","0980SSL3131-121-007D-202","11.200.1.61"]
[null,null,null,null,null,"PS8_5_FIO1","FIO",{"$f":"VLOOKUP(G36,'[1]PART NUMBER'!$A$2:$B$20,2,FALSE)","v":"5032-8IOLM12DR"},"11.200.1.62"]
[null,null,null,null,null,"PS9_3_FIO1","FIO",{"$f":"VLOOKUP(G37,'[1]PART NUMBER'!$A$2:$B$20,2,FALSE)","v":"5032-8IOLM12DR"},"11.200.1.63"]
[null,null,null,null,null,"PS9_3_FIO2","FIO",{"$f":"VLOOKUP(G38,'[1]PART NUMBER'!$A$2:$B$20,2,FALSE)","v":"5032-8IOLM12DR"},"11.200.1.64"]
[null,null,null,null,null,"PS8_9_FIO1","FIO",{"$f":"VLOOKUP(G39,'[1]PART NUMBER'!$A$2:$B$20,2,FALSE)","v":"5032-8IOLM12DR"},"11.200.1.196","ADDED","2025-05-19"]
[null,null,null,null,null,"PDP11_FIO1","FIO",{"$f":"VLOOKUP(G40,'[1]PART NUMBER'!$A$2:$B$20,2,FALSE)","v":"5032-8IOLM12DR"},"11.200.1.197","ADDED ","2025-05-25"]
{"$rows_left_out":137}
{"sheet":"Part Number","index":5,"n_rows":13,"n_cols":2,"rows_kept":13,"cut":false,"hidden":false,"merged":[]}
["HP","PART NUMBER"]
["2HP","35S-6D2-P101"]
["3HP","35S-6D3-P101"]
["5HP","35S-6D4-P111"]
["7.5HP","35S-6D5-P111"]
["10HP","35S-6D6-P111"]
["15HP","25B-D024N104"]
["20HP","25B-D030N104"]
["30HP","25B-D043N114 "]
["EXTENDO","CALJAN"]
["TIPPER","PIONEER"]
["ZMX","ZMX-3DE2500HF-Q7-AMZCHD"]
["FIO","5032-8IOLM12DR"]

{"sheet":"MCM05_DESC","index":6,"n_rows":701,"n_cols":19,"rows_kept":701,"cut":false,"hidden":false,"merged":[[56,8,60,8],[1,8,5,8],[6,8,10,8],[11,8,15,8],[16,8,20,8],[21,8,25,8],[26,8,30,8],[31,8,35,8],[36,8,40,8],[41,8,45,8],[46,8,50,8],[51,8,55,8],[61,8,65,8],[66,8,70,8],[71,8,75,8],[76,8,80,8],[81,8,85,8]]}
["TAGNAME","ADDR","TERM","TERMDESC","DESCA","DESCB",null,"CONTROLLERS"]
["PRS1_2A_VFD1","PRS1_2A_VFD1_I0","I0",null,"PRS1_2A_VFD1_DISC","DISCONNECT AUX",null,"PRS1_2A_VFD1",600,{"$f":"_xlfn.XLOOKUP(H2,NETWORK!$F$3:$F$176,NETWORK!$H$3:$H$176,\"not found\")","v":"35S_6D4_P111"},null,null,{"$f":"_xlfn.CONCAT(H2,\"/\",H3,\"/\",H4,\"/\",H5)","v":"PRS1_2A_VFD1/PRS1_2B_VFD1/PRS1_3_VFD1/PRS1_4_VFD1"},null,null,null,null,null,"PRS1_2A_VFD1/PRS1_2B_VFD1/PRS1_3_VFD1/PRS1_4_VFD1"]
["PRS1_2A_VFD1","PRS1_2A_VFD1_I1","I1",null,"SPARE",null,null,"PRS1_2B_VFD1",null,{"$f":"_xlfn.XLOOKUP(H3,NETWORK!$F$3:$F$176,NETWORK!$H$3:$H$176,\"not found\")","v":"35S_6D3_P101"},null,null,null,null,null,null,null,null,"PRS1_6_VFD1/PRS2_1_VFD1/PS8_1_VFD1/PS8_11_VFD1"]
["PRS1_2A_VFD1","PRS1_2A_VFD1_I2","I2",null,"PRS1_2A_JPE1","JAM PHOTOEYE",null,"PRS1_3_VFD1",null,{"$f":"_xlfn.XLOOKUP(H4,NETWORK!$F$3:$F$176,NETWORK!$H$3:$H$176,\"not found\")","v":"35S_6D5_P111"},null,null,null,null,null,null,null,null,"PS8_2_VFD1/PS8_4_VFD1/PS8_5_VFD1/PS8_6_VFD1"]
["PRS1_2A_VFD1","PRS1_2A_VFD1_I3","I3",null,"PRS1_2A_JPE2","JAM PHOTOEYE",null,"PRS1_4_VFD1",null,{"$f":"_xlfn.XLOOKUP(H5,NETWORK!$F$3:$F$176,NETWORK!$H$3:$H$176,\"not found\")","v":"35S_6D3_P101"},null,null,null,null,null,null,null,null,"PS8_8_VFD1/PS8_9_VFD1/PS9_2_VFD1/PS9_3_VFD1"]
["PRS1_2A_VFD1","PRS1_2A_VFD1_IO0","IO0",null,"SPARE",null,null,null,null,{"$f":"_xlfn.XLOOKUP(H6,NETWORK!$F$3:$F$176,NETWORK!$H$3:$H$176,\"not found\")","v":"not found"},null,null,null,null,null,null,null,null,"ULC1_3_VFD1/ULC2_3_VFD1/ULC3_3_VFD1/ULC4_3_VFD1"]
["PRS1_2A_VFD1","PRS1_2A_VFD1_IO1","IO1",null,"SPARE",null,null,"PRS1_6_VFD1",601,{"$f":"_xlfn.XLOOKUP(H7,NETWORK!$F$3:$F$176,NETWORK!$H$3:$H$176,\"not found\")","v":"35S_6D2_P101"},null,null,{"$f":"_xlfn.CONCAT(H7,\"/\",H8,\"/\",H9,\"/\",H10)","v":"PRS1_6_VFD1/PRS2_1_VFD1/PS8_1_VFD1/PS8_11_VFD1"},null,null,null,null,null,"PRS1_1ACH_FIO1/PRS1_1BCH_FIO1/PRS1_4_FIO1/PS8_1_FIO1"]
["PRS1_2A_VFD1","PRS1_2A_VFD1_SI0","SI0",null,"SPARE",null,null,"PRS2_1_VFD1",null,{"$f":"_xlfn.XLOOKUP(H8,NETWORK!$F$3:$F$176,NETWORK!$H$3:$H$176,\"not found\")","v":"35S_6D5_P111"},null,null,null,null,null,null,null,null,"PS8_1_FIO2/PS8_1_FIOH1/PS8_1_FIOH2/PS8_1_FIOH3"]
["PRS1_2A_VFD1","PRS1_2A_VFD1_SI1","SI1",null,"SPARE",null,null,"PS8_1_VFD1",null,{"$f":"_xlfn.XLOOKUP(H9,NETWORK!$F$3:$F$176,NETWORK!$H$3:$H$176,\"not found\")","v":"35S_6D5_P111"},null,null,null,null,null,null,null,null,"PS8_4_SIO1/PS8_4_FIOH1/PS8_5_FIO1/PS8_9_FIO1"]
["PRS1_2A_VFD1","PRS1_2A_VFD1_SI2","SI2",null,"SPARE",null,null,"PS8_11_VFD1",null,{"$f":"_xlfn.XLOOKUP(H10,NETWORK!$F$3:$F$176,NETWORK!$H$3:$H$176,\"not found\")","v":"35S_6D6_P111"},null,null,null,null,null,null,null,null,"PS8_11_FIO1/PS8_11_FIO2/PS8_11_FIOH1/PS8_11_FIOH2"]
["PRS1_2A_VFD1","PRS1_2A_VFD1_SI3","SI3",null,"SPARE",null,null,null,null,{"$f":"_xlfn.XLOOKUP(H11,NETWORK!$F$3:$F$176,NETWORK!$H$3:$H$176,\"not found\")","v":"not found"},null,null,null,null,null,null,null,null,"PS9_3_FIO1/PS9_3_FIO2/PS9_3_FIOH1/PS9_3_FIOH2"]
["PRS1_2A_VFD1","PRS1_2A_VFD1_SO0","SO0",null,"SPARE",null,null,"PS8_2_VFD1",602,{"$f":"_xlfn.XLOOKUP(H12,NETWORK!$F$3:$F$176,NETWORK!$H$3:$H$176,\"not found\")","v":"35S_6D6_P111"},null,null,{"$f":"_xlfn.CONCAT(H12,\"/\",H13,\"/\",H14,\"/\",H15)","v":"PS8_2_VFD1/PS8_4_VFD1/PS8_5_VFD1/PS8_6_VFD1"},null,null,null,null,null,"FL2074_2_VFD1/FL2078_2_VFD1/FL2086_2_VFD1/FL2090_2_VFD1"]
["PRS1_2B_VFD1","PRS1_2B_VFD1_I0","I0",null,"PRS1_2B_VFD1_DISC","DISCONNECT AUX",null,"PS8_4_VFD1",null,{"$f":"_xlfn.XLOOKUP(H13,NETWORK!$F$3:$F$176,NETWORK!$H$3:$H$176,\"not found\")","v":"25B_D024N104"},null,null,null,null,null,null,null,null,"FL2094_2_VFD1/FL4066_2_VFD1/FL4070_2_VFD1/FL4074_2_VFD1"]
["PRS1_2B_VFD1","PRS1_2B_VFD1_I1","I1",null,"SPARE",null,null,"PS8_5_VFD1",null,{"$f":"_xlfn.XLOOKUP(H14,NETWORK!$F$3:$F$176,NETWORK!$H$3:$H$176,\"not found\")","v":"25B_D024N104"},null,null,null,null,null,null,null,null,"FL4078_2_VFD1/FL4082_2_VFD1/FL2074_FIOH1/S012080_FIOH1"]
["PRS1_2B_VFD1","PRS1_2B_VFD1_I2","I2",null,"PRS1_2B_JPE1","JAM PHOTOEYE",null,"PS8_6_VFD1",null,{"$f":"_xlfn.XLOOKUP(H15,NETWORK!$F$3:$F$176,NETWORK!$H$3:$H$176,\"not found\")","v":"35S_6D4_P111"},null,null,null,null,null,null,null,null,"FL2086_FIOH1/FL2090_FIOH1/S012096_FIOH1/FL4082_FIOH1"]
["PRS1_2B_VFD1","PRS1_2B_VFD1_I3","I3",null,"PRS1_2B_JPE2","JAM PHOTOEYE",null,null,null,{"$f":"_xlfn.XLOOKUP(H16,NETWORK!$F$3:$F$176,NETWORK!$H$3:$H$176,\"not found\")","v":"not found"},null,null,null,null,null,null,null,null,"S014080_FIOH1/FL4074_FIOH1/FL4072_FIOH1/FL4066_FIOH1"]
["PRS1_2B_VFD1","PRS1_2B_VFD1_IO0","IO0",null,"SPARE",null,null,"PS8_8_VFD1",603,{"$f":"_xlfn.XLOOKUP(H17,NETWORK!$F$3:$F$176,NETWORK!$H$3:$H$176,\"not found\")","v":"35S_6D5_P111"},null,null,{"$f":"_xlfn.CONCAT(H17,\"/\",H18,\"/\",H19,\"/\",H20)","v":"PS8_8_VFD1/PS8_9_VFD1/PS9_2_VFD1/PS9_3_VFD1"}]
["PRS1_2B_VFD1","PRS1_2B_VFD1_IO1","IO1",null,"SPARE",null,null,"PS8_9_VFD1",null,{"$f":"_xlfn.XLOOKUP(H18,NETWORK!$F$3:$F$176,NETWORK!$H$3:$H$176,\"not found\")","v":"25B_D024N104"}]
["PRS1_2B_VFD1","PRS1_2B_VFD1_SI0","SI0",null,"SPARE",null,null,"PS9_2_VFD1",null,{"$f":"_xlfn.XLOOKUP(H19,NETWORK!$F$3:$F$176,NETWORK!$H$3:$H$176,\"not found\")","v":"35S_6D5_P111"}]
["PRS1_2B_VFD1","PRS1_2B_VFD1_SI1","SI1",null,"SPARE",null,null,"PS9_3_VFD1",null,{"$f":"_xlfn.XLOOKUP(H20,NETWORK!$F$3:$F$176,NETWORK!$H$3:$H$176,\"not found\")","v":"35S_6D5_P111"}]
["PRS1_2B_VFD1","PRS1_2B_VFD1_SI2","SI2",null,"SPARE",null,null,null,null,{"$f":"_xlfn.XLOOKUP(H21,NETWORK!$F$3:$F$176,NETWORK!$H$3:$H$176,\"not found\")","v":"not found"}]
["PRS1_2B_VFD1","PRS1_2B_VFD1_SI3","SI3",null,"SPARE",null,null,"ULC1_3_VFD1",604,{"$f":"_xlfn.XLOOKUP(H22,NETWORK!$F$3:$F$176,NETWORK!$H$3:$H$176,\"not found\")","v":"35S_6D2_P101"},null,null,{"$f":"_xlfn.CONCAT(H22,\"/\",H23,\"/\",H24,\"/\",H25)","v":"ULC1_3_VFD1/ULC2_3_VFD1/ULC3_3_VFD1/ULC4_3_VFD1"}]
["PRS1_2B_VFD1","PRS1_2B_VFD1_SO0","SO0",null,"SPARE",null,null,"ULC2_3_VFD1",null,{"$f":"_xlfn.XLOOKUP(H23,NETWORK!$F$3:$F$176,NETWORK!$H$3:$H$176,\"not found\")","v":"35S_6D2_P101"}]
["PRS1_3_VFD1","PRS1_3_VFD1_I0","I0",null,"PRS1_3_VFD1_DISC","DISCONNECT AUX",null,"ULC3_3_VFD1",null,{"$f":"_xlfn.XLOOKUP(H24,NETWORK!$F$3:$F$176,NETWORK!$H$3:$H$176,\"not found\")","v":"35S_6D2_P101"}]
["PRS1_3_VFD1","PRS1_3_VFD1_I1","I1",null,"SPARE",null,null,"ULC4_3_VFD1",null,{"$f":"_xlfn.XLOOKUP(H25,NETWORK!$F$3:$F$176,NETWORK!$H$3:$H$176,\"not found\")","v":"35S_6D2_P101"}]
["PRS1_3_VFD1","PRS1_3_VFD1_I2","I2",null,"PRS1_3_JPE2","JAM PHOTOEYE",null,null,null,{"$f":"_xlfn.XLOOKUP(H26,NETWORK!$F$3:$F$176,NETWORK!$H$3:$H$176,\"not found\")","v":"not found"}]
["PRS1_3_VFD1","PRS1_3_VFD1_I3","I3",null,"SPARE",null,null,"PRS1_1ACH_FIO1",605,{"$f":"_xlfn.XLOOKUP(H27,NETWORK!$F$3:$F$176,NETWORK!$H$3:$H$176,\"not found\")","v":"5032-8IOLM12DR"},null,null,{"$f":"_xlfn.CONCAT(H27,\"/\",H28,\"/\",H29,\"/\",H30)","v":"PRS1_1ACH_FIO1/PRS1_1BCH_FIO1/PRS1_4_FIO1/PS8_1_FIO1"}]
["PRS1_3_VFD1","PRS1_3_VFD1_IO0","IO0",null,"PRS1_3_JR1_PB","JAM RESET PUSHBUTTON",null,"PRS1_1BCH_FIO1",null,{"$f":"_xlfn.XLOOKUP(H28,NETWORK!$F$3:$F$176,NETWORK!$H$3:$H$176,\"not found\")","v":"5032-8IOLM12DR"}]
["PRS1_3_VFD1","PRS1_3_VFD1_IO1","IO1",null,"PRS1_3_JR1_PB_LT","JAM RESET PUSHBUTTON LIGHT",null,"PRS1_4_FIO1",null,{"$f":"_xlfn.XLOOKUP(H29,NETWORK!$F$3:$F$176,NETWORK!$H$3:$H$176,\"not found\")","v":"5032-8IOLM12DR"}]
["PRS1_3_VFD1","PRS1_3_VFD1_SI0","SI0",null,"SPARE",null,null,"PS8_1_FIO1",null,{"$f":"_xlfn.XLOOKUP(H30,NETWORK!$F$3:$F$176,NETWORK!$H$3:$H$176,\"not found\")","v":"5032-8IOLM12DR"}]
["PRS1_3_VFD1","PRS1_3_VFD1_SI1","SI1",null,"SPARE",null,null,null,null,{"$f":"_xlfn.XLOOKUP(H31,NETWORK!$F$3:$F$176,NETWORK!$H$3:$H$176,\"not found\")","v":"not found"}]
["PRS1_3_VFD1","PRS1_3_VFD1_SI2","SI2",null,"SPARE",null,null,"PS8_1_FIO2",606,{"$f":"_xlfn.XLOOKUP(H32,NETWORK!$F$3:$F$176,NETWORK!$H$3:$H$176,\"not found\")","v":"5032-8IOLM12DR"},null,null,{"$f":"_xlfn.CONCAT(H32,\"/\",H33,\"/\",H34,\"/\",H35)","v":"PS8_1_FIO2/PS8_1_FIOH1/PS8_1_FIOH2/PS8_1_FIOH3"}]
["PRS1_3_VFD1","PRS1_3_VFD1_SI3","SI3",null,"SPARE",null,null,"PS8_1_FIOH1",null,{"$f":"_xlfn.XLOOKUP(H33,NETWORK!$F$3:$F$176,NETWORK!$H$3:$H$176,\"not found\")","v":"not found"}]
["PRS1_3_VFD1","PRS1_3_VFD1_SO0","SO0",null,"PRS1_3_BCN1_A","AMBER BEACON LIGHT",null,"PS8_1_FIOH2",null,{"$f":"_xlfn.XLOOKUP(H34,NETWORK!$F$3:$F$176,NETWORK!$H$3:$H$176,\"not found\")","v":"not found"}]
["PRS1_4_VFD1","PRS1_4_VFD1_I0","I0",null,"PRS1_4_VFD1_DISC","DISCONNECT AUX",null,"PS8_1_FIOH3",null,{"$f":"_xlfn.XLOOKUP(H35,NETWORK!$F$3:$F$176,NETWORK!$H$3:$H$176,\"not found\")","v":"not found"}]
["PRS1_4_VFD1","PRS1_4_VFD1_I1","I1",null,"SPARE",null,null,null,null,{"$f":"_xlfn.XLOOKUP(H36,NETWORK!$F$3:$F$176,NETWORK!$H$3:$H$176,\"not found\")","v":"not found"}]
["PRS1_4_VFD1","PRS1_4_VFD1_I2","I2",null,"PRS1_4_JPE1","JAM PHOTOEYE",null,"PS8_4_SIO1",607,{"$f":"_xlfn.XLOOKUP(H37,NETWORK!$F$3:$F$176,NETWORK!$H$3:$H$176,\"not found\")","v":"0980SSL3131-121-007D-202"},null,null,{"$f":"_xlfn.CONCAT(H37,\"/\",H38,\"/\",H39,\"/\",H40)","v":"PS8_4_SIO1/PS8_4_FIOH1/PS8_5_FIO1/PS8_9_FIO1"}]
["PRS1_4_VFD1","PRS1_4_VFD1_I3","I3",null,"PRS1_4_JPE2","JAM PHOTOEYE",null,"PS8_4_FIOH1",null,{"$f":"_xlfn.XLOOKUP(H38,NETWORK!$F$3:$F$176,NETWORK!$H$3:$H$176,\"not found\")","v":"not found"}]
["PRS1_4_VFD1","PRS1_4_VFD1_IO0","IO0",null,"SPARE",null,null,"PS8_5_FIO1",null,{"$f":"_xlfn.XLOOKUP(H39,NETWORK!$F$3:$F$176,NETWORK!$H$3:$H$176,\"not found\")","v":"5032-8IOLM12DR"}]
["PRS1_4_VFD1","PRS1_4_VFD1_IO1","IO1",null,"SPARE",null,null,"PS8_9_FIO1",null,{"$f":"_xlfn.XLOOKUP(H40,NETWORK!$F$3:$F$176,NETWORK!$H$3:$H$176,\"not found\")","v":"5032-8IOLM12DR"}]
{"$rows_left_out":661}