{"text_format":"1","workbook":"xlsx","n_sheets":7,"sheets":["Templates","Devices","Instructions","IO Assignment MCM05","NETWORK","Part Number","MCM05_DESC"],"not_rendered":{"charts":0,"images":10,"macros":1,"external_links":1,"defined_names":5,"comments":0,"pivot_tables":0},"unopened":[],"bounds":{"document_bytes":16777216,"sheet_cells":100000,"rows_first":2000,"rows_last":500,"rows_between":2000,"halvings":0,"cell_chars":16384,"cell_head_chars":4096},"cells_cut":0,"cells_raw":0,"read":"whole","date_system":"1900"}

{"sheet":"Templates","index":0,"n_rows":19,"n_cols":3,"rows_kept":19,"cut":false,"hidden":true,"merged":[]}
[]
["VFD IO TEMPLATE",null,"FIO IO Template"]
["I0",null,"IO00"]
["I1",null,"IO01"]
["I2",null,"IO02"]
["I3",null,"IO03"]
["IO0",null,"IO04"]
["IO1",null,"IO05"]
["SI0",null,"IO06"]
["SI1",null,"IO07"]
["SI2",null,"IO08"]
["SI3",null,"IO09"]
["SO0",null,"IO10"]
[null,null,"IO11"]
[null,null,"IO12"]
[null,null,"IO13"]
[null,null,"IO14"]
[null,null,"IO15"]
[null,null,"IO16"]

{"sheet":"Devices","index":1,"n_rows":390,"n_cols":9,"rows_kept":390,"cut":false,"hidden":false,"merged":[]}
[null,null,null,null,null,null,null,"Which MCM we assign?","MCM05"]
["PRS1_1ACH_BCN1_A"]
["PRS1_1ACH_BCN1_B"]
["PRS1_1ACH_FPE1"]
["PRS1_1BCH_BCN1_A"]
["PRS1_1BCH_BCN1_B"]
["PRS1_1BCH_FPE1"]
["PRS1_2A_BCN1_A"]
["PRS1_2A_DISC"]
["PRS1_2A_JPE1"]
["PRS1_2A_JPE2"]
["PRS1_2A_JR1_PB"]
["PRS1_2A_JR1_PB_LT"]
["PRS1_2A_JR2_PB"]
["PRS1_2A_JR2_PB_LT"]
["PRS1_2A_VFD1"]
["PRS1_2B_BCN1_A"]
["PRS1_2B_DISC"]
["PRS1_2B_JPE1"]
["PRS1_2B_JPE2"]
["PRS1_2B_JR1_PB"]
["PRS1_2B_JR1_PB_LT"]
["PRS1_2B_JR2_PB"]
["PRS1_2B_JR2_PB_LT"]
["PRS1_2B_VFD1"]
["PRS1_3_BCN1_A"]
["PRS1_3_DISC"]
["PRS1_3_FIO1"]
["PRS1_3_JPE1"]
["PRS1_3_JPE2"]
["PRS1_3_JR1_PB"]
["PRS1_3_JR1_PB_LT"]
["PRS1_3_VFD1"]
["PRS1_4_BCN1_A"]
["PRS1_4_BCN1_R"]
["PRS1_4_DISC"]
["PRS1_4_FIO1"]
["PRS1_4_JPE1"]
["PRS1_4_JPE2"]
["PRS1_4_JR1_PB"]
["PRS1_4_JR1_PB_LT"]
["PRS1_4_VFD1"]
["PRS1_5CH_FPE1"]
["PRS1_5CH_JPE1"]
["PRS1_6_BCN1_R"]
["PRS1_6_BCN2_R"]
["PRS1_6_DISC"]
["PRS1_6_EPC1"]
["PRS1_6_EPC1_2"]
["PRS1_6_EPC2"]
["PRS1_6_EPC2_2"]
["PRS1_6_JPE1"]
["PRS1_6_JPE2"]
["PRS1_6_S1_PB"]
["PRS1_6_S1_PB_LT"]
["PRS1_6_S2_PB"]
["PRS1_6_S2_PB_LT"]
["PRS1_6_VFD1"]
["PRS2_1_BCN1_A"]
["PRS2_1_BCN1_R"]
["PRS2_1_BCN2_R"]
["PRS2_1_DISC"]
["PRS2_1_EPC1"]
["PRS2_1_EPC1_2"]
["PRS2_1_EPC2"]
["PRS2_1_EPC2_2"]
["PRS2_1_JPE1"]
["PRS2_1_S1_PB"]
["PRS2_1_S1_PB_LT"]
["PRS2_1_S2_PB"]
["PRS2_1_S2_PB_LT"]
["PRS2_1_VFD1"]
["PS8_1_BCN1_A"]
["PS8_1_BCN1_R"]
["PS8_1_BCN2_A"]
["PS8_1_BCN3_A"]
["PS8_1_DISC"]
["PS8_1_ENC1"]
["PS8_1_EPC1"]
["PS8_1_EPC1_2"]
["PS8_1_FIO1"]
["PS8_1_FIO2"]
["PS8_1_FIOH1"]
["PS8_1_FIOH2"]
["PS8_1_FIOH3"]
["PS8_1_FIOH4"]
["PS8_1_JPE1"]
["PS8_1_JPE2"]
["PS8_1_JPE3"]
["PS8_1_JPE4"]
["PS8_1_JPE5"]
["PS8_1_JPE6"]
["PS8_1_JR1_PB"]
["PS8_1_JR1_PB_LT"]
["PS8_1_JR2_PB"]
["PS8_1_JR2_PB_LT"]
["PS8_1_SS1_SPB"]
["PS8_1_SS1_STPB"]
["PS8_1_SS1_STPB_LT"]
["PS8_1_VFD1"]
["PS8_11_BCN1_A"]
["PS8_11_BCN1_R"]
["PS8_11_BCN2_A"]
["PS8_11_BCN3_A"]
["PS8_11_BCN3_B"]
["PS8_11_CH1_BCN1_A"]
["PS8_11_CH1_BCN1_B"]
["PS8_11_CH1_BCN1_G"]
["PS8_11_CH1_FPE1"]
["PS8_11_CH1_FPE2"]
["PS8_11_CH1_JPE1"]
["PS8_11_CH1_S1_PB"]
["PS8_11_CH1_S1_PB_LT"]
["PS8_11_CH2_BCN1_A"]
["PS8_11_CH2_BCN1_B"]
["PS8_11_CH2_BCN1_G"]
["PS8_11_CH2_FPE1"]
["PS8_11_CH2_FPE2"]
["PS8_11_CH2_JPE1"]
["PS8_11_CH2_S1_PB"]
["PS8_11_CH2_S1_PB_LT"]
["PS8_11_CH3_BCN1_A"]
["PS8_11_CH3_BCN1_B"]
["PS8_11_CH3_BCN1_G"]
["PS8_11_CH3_FPE1"]
["PS8_11_CH3_FPE2"]
["PS8_11_CH3_JPE1"]
["PS8_11_CH3_S1_PB"]
["PS8_11_CH3_S1_PB_LT"]
["PS8_11_CH4_BCN1_A"]
["PS8_11_CH4_BCN1_B"]
["PS8_11_CH4_BCN1_G"]
["PS8_11_CH4_FPE1"]
["PS8_11_CH4_FPE2"]
["PS8_11_CH4_JPE1"]
["PS8_11_CH4_S1_PB"]
["PS8_11_CH4_S1_PB_LT"]
["PS8_11_DISC"]
["PS8_11_DIV1_LS1"]
["PS8_11_DIV1_LS2"]
["PS8_11_DIV1_SOL1"]
["PS8_11_DIV1_SOL2"]
["PS8_11_DIV2_LS1"]
["PS8_11_DIV2_LS2"]
["PS8_11_DIV2_SOL1"]
["PS8_11_DIV2_SOL2"]
["PS8_11_DIV3_LS1"]
["PS8_11_DIV3_LS2"]
["PS8_11_DIV3_SOL1"]
["PS8_11_DIV3_SOL2"]
["PS8_11_DIV4_LS1"]
["PS8_11_DIV4_LS2"]
["PS8_11_DIV4_SOL1"]
["PS8_11_DIV4_SOL2"]
["PS8_11_ENC1"]
["PS8_11_EPC1"]
["PS8_11_EPC1_2"]
["PS8_11_FIO1"]
["PS8_11_FIO2"]
["PS8_11_FIOH1"]
["PS8_11_FIOH2"]
["PS8_11_FIOH3"]
["PS8_11_FIOH4"]
["PS8_11_JPE1"]
["PS8_11_JPE2"]
["PS8_11_JPE3"]
["PS8_11_JPE4"]
["PS8_11_JPE5"]
["PS8_11_JPE6"]
["PS8_11_JR1_PB"]
["PS8_11_JR1_PB_LT"]
["PS8_11_JR2_PB"]
["PS8_11_JR2_PB_LT"]
["PS8_11_S1_PB"]
["PS8_11_S1_PB_LT"]
["PS8_11_VFD1"]
["PS8_12CH_FPE1"]
["PS8_2_BCN1_R"]
["PS8_2_BCN2_A"]
["PS8_2_BCN2_R"]
["PS8_2_DISC"]
["PS8_2_ENC1"]
["PS8_2_EPC1"]
["PS8_2_EPC1_2"]
["PS8_2_EPC2"]
["PS8_2_EPC2_2"]
["PS8_2_JPE1"]
["PS8_2_S1_PB"]
["PS8_2_S1_PB_LT"]
["PS8_2_S2_PB"]
["PS8_2_S2_PB_LT"]
["PS8_2_VFD1"]
["PS8_4_BCN1_A"]
["PS8_4_BCN1_R"]
["PS8_4_BCN2_R"]
["PS8_4_DISC"]
["PS8_4_ENC1"]
["PS8_4_EPC1"]
["PS8_4_EPC1_2"]
["PS8_4_EPC2"]
["PS8_4_EPC2_2"]
["PS8_4_JPE1"]
["PS8_4_JPE2"]
["PS8_4_S1_PB"]
["PS8_4_S1_PB_LT"]
["PS8_4_S2_PB"]
["PS8_4_S2_PB_LT"]
["PS8_4_SIO1"]
["PS8_4_VFD1"]
["PS8_5_BCN1_A"]
["PS8_5_BCN1_R"]
["PS8_5_DISC"]
["PS8_5_ENC1"]
["PS8_5_EPC1"]
["PS8_5_EPC1_2"]
["PS8_5_EPC2"]
["PS8_5_EPC2_2"]
["PS8_5_JPE1"]
["PS8_5_S1_PB"]
["PS8_5_S1_PB_LT"]
["PS8_5_S2_PB"]
["PS8_5_S2_PB_LT"]
["PS8_5_SIO1"]
["PS8_5_VFD1"]
["PS8_6_DISC"]
["PS8_6_FIO1"]
["PS8_6_VFD1"]
["PS8_8_DISC"]
["PS8_8_ENC1"]
["PS8_8_JPE1"]
["PS8_8_JPE2"]
["PS8_8_VFD1"]
["PS8_9_BCN1_A"]
["PS8_9_DISC"]
["PS8_9_ENC1"]
["PS8_9_JPE1"]
["PS8_9_JR1_PB"]
["PS8_9_JR1_PB_LT"]
["PS8_9_SIO1"]
["PS8_9_VFD1"]
["PS8-12CH-PS1"]
["PS9_2_BCN1_A"]
["PS9_2_BCN1_R"]
["PS9_2_BCN2_R"]
["PS9_2_DISC"]
["PS9_2_ENC1"]
["PS9_2_EPC1"]
["PS9_2_EPC1_2"]
["PS9_2_EPC2"]
["PS9_2_EPC2_2"]
["PS9_2_JPE1"]
["PS9_2_JPE2"]
["PS9_2_S1_PB"]
["PS9_2_S1_PB_LT"]
["PS9_2_S2_PB"]
["PS9_2_S2_PB_LT"]
["PS9_2_VFD1"]
["PS9_3_BCN1_A"]
["PS9_3_BCN2_A"]
["PS9_3_BCN2_B"]
["PS9_3_BCN2_R"]
["PS9_3_DISC"]
["PS9_3_EPC1"]
["PS9_3_EPC1_2"]
["PS9_3_FIO1"]
["PS9_3_FIO2"]
["PS9_3_FIOH1"]
["PS9_3_FIOH2"]
["PS9_3_FIOH3"]
["PS9_3_FIOH4"]
["PS9_3_JPE1"]
["PS9_3_JPE3"]
["PS9_3_JPE4"]
["PS9_3_JPE5"]
["PS9_3_JR1_PB"]
["PS9_3_JR1_PB_LT"]
["PS9_3_S1_PB"]
["PS9_3_S1_PB_LT"]
["PS9_3_VFD1"]
["PS9_3CH1_BCN1_A"]
["PS9_3CH1_BCN1_B"]
["PS9_3CH1_BCN1_G"]
["PS9_3CH1_FPE1"]
["PS9_3CH1_FPE2"]
["PS9_3CH1_JPE1"]
["PS9_3CH1_S1_PB"]
["PS9_3CH1_S1_PB_LT"]
["PS9_3CH2_BCN1_A"]
["PS9_3CH2_BCN1_B"]
["PS9_3CH2_BCN1_G"]
["PS9_3CH2_FPE1"]
["PS9_3CH2_FPE2"]
["PS9_3CH2_JPE1"]
["PS9_3CH2_S1_PB"]
["PS9_3CH2_S1_PB_LT"]
["PS9_3CH3_JPE1"]
["PS9_3CH4_BCN1_A"]
["PS9_3CH4_BCN1_B"]
["PS9_3CH4_BCN1_G"]
["PS9_3CH4_FPE1"]
["PS9_3CH4_FPE2"]
["PS9_3CH4_JPE1"]
["PS9_3CH4_S1_PB"]
["PS9_3CH4_S1_PB_LT"]
["PS9_3CH6_BCN1_A"]
["PS9_3CH6_BCN1_B"]
["PS9_3CH6_BCN1_G"]
["PS9_3CH6_FPE1"]
["PS9_3CH6_FPE2"]
["PS9_3CH6_S1_PB"]
["PS9_3CH6_S1_PB_LT"]
["PS9_3DIV1_LS1"]
["PS9_3DIV1_LS2"]
["PS9_3DIV1_SOL1"]
["PS9_3DIV1_SOL2"]
["PS9_3DIV2_LS1"]
["PS9_3DIV2_LS2"]
["PS9_3DIV2_SOL1"]
["PS9_3DIV2_SOL2"]
["PS9_3DIV3_LS1"]
["PS9_3DIV3_LS2"]
["PS9_3DIV3_SOL1"]
["PS9_3DIV3_SOL2"]
["PS9_3DIV4_LS1"]
["PS9_3DIV4_LS2"]
["PS9_3DIV4_SOL1"]
["PS9_3DIV4_SOL2"]
["PS9_4CH_FPE1"]
["PS9-3-PS1"]
["ULC1_3_BCN1_A"]
["ULC1_3_BCN1_R"]
["ULC1_3_DISC"]
["ULC1_3_ENC1"]
["ULC1_3_EPC1"]
["ULC1_3_EPC1_2"]
["ULC1_3_EPC2"]
["ULC1_3_EPC2_2"]
["ULC1_3_JPE1"]
["ULC1_3_JPE2"]
["ULC1_3_JR1_PB"]
["ULC1_3_JR1_PB_LT"]
["ULC1_3_SS1_SPB"]
["ULC1_3_SS1_STPB"]
["ULC1_3_SS1_STPB_LT"]
["ULC1_3_SS2_SPB"]
["ULC1_3_SS2_STPB"]
["ULC1_3_SS2_STPB_LT"]
["ULC1_3_VFD1"]
["ULC2_3_BCN1_A"]
["ULC2_3_BCN1_R"]
["ULC2_3_DISC"]
["ULC2_3_ENC1"]
["ULC2_3_EPC1"]
["ULC2_3_EPC1_2"]
["ULC2_3_JPE1"]
["ULC2_3_JPE2"]
["ULC2_3_JR1_PB"]
["ULC2_3_JR1_PB_LT"]
["ULC2_3_SS1_SPB"]
["ULC2_3_SS1_STPB"]
["ULC2_3_SS1_STPB_LT"]
["ULC2_3_VFD1"]
["ULC3_3_BCN1_A"]
["ULC3_3_BCN1_R"]
["ULC3_3_DISC"]
["ULC3_3_ENC1"]
["ULC3_3_EPC1"]
["ULC3_3_EPC1_2"]
["ULC3_3_JPE1"]
["ULC3_3_JPE2"]
["ULC3_3_JR1_PB"]
["ULC3_3_JR1_PB_LT"]
["ULC3_3_SS1_SPB"]
["ULC3_3_SS1_STPB"]
["ULC3_3_SS1_STPB_LT"]
["ULC3_3_VFD1"]
["ULC4_3_BCN1_A"]
["ULC4_3_BCN1_R"]
["ULC4_3_DISC"]
["ULC4_3_ENC1"]
["ULC4_3_EPC1"]
["ULC4_3_EPC1_2"]
["ULC4_3_JPE1"]
["ULC4_3_JPE2"]
["ULC4_3_JR1_PB"]
["ULC4_3_JR1_PB_LT"]
["ULC4_3_SS1_SPB"]
["ULC4_3_SS1_STPB"]
["ULC4_3_SS1_STPB_LT"]
["ULC4_3_VFD1"]

{"sheet":"Instructions","index":2,"n_rows":116,"n_cols":2,"rows_kept":116,"cut":false,"hidden":false,"merged":[]}
[]
["1. ","Put all device tags to cell A2"]
[]
[]
[]
[]
[]
[]
[]
[]
[]
[]
[]
[]
[]
[]
[]
[]
[]
[]
[]
[]
[]
[]
[]
[]
[]
[]
[]
[]
[]
[]
[]
[]
[]
[]
["2.","In cell I1 write MCM number"]
[]
[]
[]
[]
[]
[]
[]
[]
[]
["3. ","Click on \"Add Disconnects\" button. "]
[]
[]
[]
[]
[]
[]
[]
[]
[]
["4. ","Replace all _VFD1_DISC with _DISC. Without this point it will generate IO points for _VFD1_DISC device"]
[]
[]
[]
[]
[]
[]
[]
[]
[]
[]
[]
["5. ","Click on \"Split SS station\". This will split all _SS to SS_STPB, SS_SPB and SS_STPB_LT"]
[]
[]
[]
[]
[]
[]
[]
[]
["6. ","Click on \"Split start PB\". This will split all _S and _JR to _S_PB, _S_PB_LT, JR_PB and JR_PB_LT"]
[]
[]
[]
[]
[]
[]
[]
[]
["7.","Click on \"Duplicate EPC Tag\". This will add duplicate for all EPC and add _2 to copy"]
[]
[]
[]
[]
[]
[]
[]
[]
[]
["8.","Click on \"Create Assignment table template\". This will add new sheet with name \"IO Assignment MCM01 and fill with VFD and FIO names and their adresses"]
[]
[]
[]
[]
[]
[]
[]
[]
[]
["9.","Click on \"Assign Devices to VFD\". This will add device tags to correspond VFD IO. Works for Disc, TPE, JPE, EPC, ENC"]
[]
[]
[]
[]
[]
[]
[]
[]
["10. ","All Unassigned Pushbuttons and lights fill manually and all devices, that couldn't filled to VFD also will be here."]

{"sheet":"IO Assignment MCM05","index":3,"n_rows":701,"n_cols":11,"rows_kept":701,"cut":false,"hidden":false,"merged":[]}
["Controller name","Signal type","Address name","Assigned device","Unassigned Device",null,null,null,null,null,"MCM05_DESC"]
["PRS1_2A_VFD1","I0","PRS1_2A_VFD1_I0","PRS1_2A_VFD1_DISC"]
["PRS1_2A_VFD1","I1","PRS1_2A_VFD1_I1"]
["PRS1_2A_VFD1","I2","PRS1_2A_VFD1_I2","PRS1_2A_JPE1"]
["PRS1_2A_VFD1","I3","PRS1_2A_VFD1_I3","PRS1_2A_JPE2"]
["PRS1_2A_VFD1","IO0","PRS1_2A_VFD1_IO0"]
["PRS1_2A_VFD1","IO1","PRS1_2A_VFD1_IO1"]
["PRS1_2A_VFD1","SI0","PRS1_2A_VFD1_SI0"]
["PRS1_2A_VFD1","SI1","PRS1_2A_VFD1_SI1"]
["PRS1_2A_VFD1","SI2","PRS1_2A_VFD1_SI2"]
["PRS1_2A_VFD1","SI3","PRS1_2A_VFD1_SI3"]
["PRS1_2A_VFD1","SO0","PRS1_2A_VFD1_SO0"]
["PRS1_2B_VFD1","I0","PRS1_2B_VFD1_I0","PRS1_2B_VFD1_DISC"]
["PRS1_2B_VFD1","I1","PRS1_2B_VFD1_I1"]
["PRS1_2B_VFD1","I2","PRS1_2B_VFD1_I2","PRS1_2B_JPE1"]
["PRS1_2B_VFD1","I3","PRS1_2B_VFD1_I3","PRS1_2B_JPE2"]
["PRS1_2B_VFD1","IO0","PRS1_2B_VFD1_IO0"]
["PRS1_2B_VFD1","IO1","PRS1_2B_VFD1_IO1"]
["PRS1_2B_VFD1","SI0","PRS1_2B_VFD1_SI0"]
["PRS1_2B_VFD1","SI1","PRS1_2B_VFD1_SI1"]
["PRS1_2B_VFD1","SI2","PRS1_2B_VFD1_SI2"]
["PRS1_2B_VFD1","SI3","PRS1_2B_VFD1_SI3"]
["PRS1_2B_VFD1","SO0","PRS1_2B_VFD1_SO0"]
["PRS1_3_VFD1","I0","PRS1_3_VFD1_I0","PRS1_3_VFD1_DISC"]
["PRS1_3_VFD1","I1","PRS1_3_VFD1_I1"]
["PRS1_3_VFD1","I2","PRS1_3_VFD1_I2","PRS1_3_JPE2"]
["PRS1_3_VFD1","I3","PRS1_3_VFD1_I3"]
["PRS1_3_VFD1","IO0","PRS1_3_VFD1_IO0","PRS1_3_JR1_PB"]
["PRS1_3_VFD1","IO1","PRS1_3_VFD1_IO1","PRS1_3_JR1_PB_LT"]
["PRS1_3_VFD1","SI0","PRS1_3_VFD1_SI0"]
["PRS1_3_VFD1","SI1","PRS1_3_VFD1_SI1"]
["PRS1_3_VFD1","SI2","PRS1_3_VFD1_SI2"]
["PRS1_3_VFD1","SI3","PRS1_3_VFD1_SI3"]
["PRS1_3_VFD1","SO0","PRS1_3_VFD1_SO0","PRS1_3_BCN1_A"]
["PRS1_4_VFD1","I0","PRS1_4_VFD1_I0","PRS1_4_VFD1_DISC"]
["PRS1_4_VFD1","I1","PRS1_4_VFD1_I1"]
["PRS1_4_VFD1","I2","PRS1_4_VFD1_I2","PRS1_4_JPE1"]
["PRS1_4_VFD1","I3","PRS1_4_VFD1_I3","PRS1_4_JPE2"]
["PRS1_4_VFD1","IO0","PRS1_4_VFD1_IO0"]
["PRS1_4_VFD1","IO1","PRS1_4_VFD1_IO1"]
["PRS1_4_VFD1","SI0","PRS1_4_VFD1_SI0"]
["PRS1_4_VFD1","SI1","PRS1_4_VFD1_SI1"]
["PRS1_4_VFD1","SI2","PRS1_4_VFD1_SI2"]
["PRS1_4_VFD1","SI3","PRS1_4_VFD1_SI3"]
["PRS1_4_VFD1","SO0","PRS1_4_VFD1_SO0"]
["PRS1_6_VFD1","I0","PRS1_6_VFD1_I0","PRS1_6_VFD1_DISC"]
["PRS1_6_VFD1","I1","PRS1_6_VFD1_I1"]
["PRS1_6_VFD1","I2","PRS1_6_VFD1_I2","PRS1_6_JPE1"]
["PRS1_6_VFD1","I3","PRS1_6_VFD1_I3","PRS1_6_JPE2"]
["PRS1_6_VFD1","IO0","PRS1_6_VFD1_IO0"]
["PRS1_6_VFD1","IO1","PRS1_6_VFD1_IO1"]
["PRS1_6_VFD1","SI0","PRS1_6_VFD1_SI0","PRS1_6_EPC1"]
["PRS1_6_VFD1","SI1","PRS1_6_VFD1_SI1","PRS1_6_EPC1_2"]
["PRS1_6_VFD1","SI2","PRS1_6_VFD1_SI2","PRS1_6_EPC2"]
["PRS1_6_VFD1","SI3","PRS1_6_VFD1_SI3","PRS1_6_EPC2_2"]
["PRS1_6_VFD1","SO0","PRS1_6_VFD1_SO0"]
["PRS2_1_VFD1","I0","PRS2_1_VFD1_I0","PRS2_1_VFD1_DISC"]
["PRS2_1_VFD1","I1","PRS2_1_VFD1_I1"]
["PRS2_1_VFD1","I2","PRS2_1_VFD1_I2","PRS2_1_JPE1"]
["PRS2_1_VFD1","I3","PRS2_1_VFD1_I3"]
["PRS2_1_VFD1","IO0","PRS2_1_VFD1_IO0"]
["PRS2_1_VFD1","IO1","PRS2_1_VFD1_IO1"]
["PRS2_1_VFD1","SI0","PRS2_1_VFD1_SI0","PRS2_1_EPC1"]
["PRS2_1_VFD1","SI1","PRS2_1_VFD1_SI1","PRS2_1_EPC1_2"]
["PRS2_1_VFD1","SI2","PRS2_1_VFD1_SI2","PRS2_1_EPC2"]
["PRS2_1_VFD1","SI3","PRS2_1_VFD1_SI3","PRS2_1_EPC2_2"]
["PRS2_1_VFD1","SO0","PRS2_1_VFD1_SO0"]
["PS8_1_VFD1","I0","PS8_1_VFD1_I0","PS8_1_VFD1_DISC"]
["PS8_1_VFD1","I1","PS8_1_VFD1_I1","PS8_1_ENC1"]
["PS8_1_VFD1","I2","PS8_1_VFD1_I2","PS8_1_JPE1"]
["PS8_1_VFD1","I3","PS8_1_VFD1_I3","PS8_1_JPE2"]
["PS8_1_VFD1","IO0","PS8_1_VFD1_IO0"]
["PS8_1_VFD1","IO1","PS8_1_VFD1_IO1"]
["PS8_1_VFD1","SI0","PS8_1_VFD1_SI0","PS8_1_EPC1"]
["PS8_1_VFD1","SI1","PS8_1_VFD1_SI1","PS8_1_EPC1_2"]
["PS8_1_VFD1","SI2","PS8_1_VFD1_SI2"]
["PS8_1_VFD1","SI3","PS8_1_VFD1_SI3"]
["PS8_1_VFD1","SO0","PS8_1_VFD1_SO0"]
["PS8_11_VFD1","I0","PS8_11_VFD1_I0","PS8_11_VFD1_DISC"]
["PS8_11_VFD1","I1","PS8_11_VFD1_I1","PS8_11_ENC1"]
["PS8_11_VFD1","I2","PS8_11_VFD1_I2","PS8_11_CH1_JPE1"]
["PS8_11_VFD1","I3","PS8_11_VFD1_I3","PS8_11_CH2_JPE1"]
["PS8_11_VFD1","IO0","PS8_11_VFD1_IO0","PS8_12CH_FPE1"]
["PS8_11_VFD1","IO1","PS8_11_VFD1_IO1","PS8_12CH-PS1"]
["PS8_11_VFD1","SI0","PS8_11_VFD1_SI0","PS8_11_EPC1"]
["PS8_11_VFD1","SI1","PS8_11_VFD1_SI1","PS8_11_EPC1_2"]
["PS8_11_VFD1","SI2","PS8_11_VFD1_SI2"]
["PS8_11_VFD1","SI3","PS8_11_VFD1_SI3"]
["PS8_11_VFD1","SO0","PS8_11_VFD1_SO0","PS8_11_BCN2_A"]
["PS8_2_VFD1","I0","PS8_2_VFD1_I0","PS8_2_VFD1_DISC"]
["PS8_2_VFD1","I1","PS8_2_VFD1_I1","PS8_2_ENC1"]
["PS8_2_VFD1","I2","PS8_2_VFD1_I2","PS8_2_JPE1"]
["PS8_2_VFD1","I3","PS8_2_VFD1_I3","PS8_2_JPE2","2025-06-08"]
["PS8_2_VFD1","IO0","PS8_2_VFD1_IO0","PS8_2_BCN2_A"]
["PS8_2_VFD1","IO1","PS8_2_VFD1_IO1","PS8_2_BCN2_R"]
["PS8_2_VFD1","SI0","PS8_2_VFD1_SI0","PS8_2_EPC1"]
["PS8_2_VFD1","SI1","PS8_2_VFD1_SI1","PS8_2_EPC1_2"]
["PS8_2_VFD1","SI2","PS8_2_VFD1_SI2","PS8_2_EPC2"]
["PS8_2_VFD1","SI3","PS8_2_VFD1_SI3","PS8_2_EPC2_2"]
["PS8_2_VFD1","SO0","PS8_2_VFD1_SO0"]
["PS8_4_VFD1","I0","PS8_4_VFD1_I0","PS8_4_VFD1_DISC"]
["PS8_5_VFD1","I0","PS8_5_VFD1_I0","PS8_5_VFD1_DISC"]
["PS8_6_VFD1","I0","PS8_6_VFD1_I0","PS8_6_VFD1_DISC"]
["PS8_6_VFD1","I1","PS8_6_VFD1_I1"]
["PS8_6_VFD1","I2","PS8_6_VFD1_I2"]
["PS8_6_VFD1","I3","PS8_6_VFD1_I3"]
["PS8_6_VFD1","IO0","PS8_6_VFD1_IO0"]
["PS8_6_VFD1","IO1","PS8_6_VFD1_IO1"]
["PS8_6_VFD1","SI0","PS8_6_VFD1_SI0","PS8_5_EPC1"]
["PS8_6_VFD1","SI1","PS8_6_VFD1_SI1","PS8_5_EPC1_2"]
["PS8_6_VFD1","SI2","PS8_6_VFD1_SI2","PS8_5_EPC2"]
["PS8_6_VFD1","SI3","PS8_6_VFD1_SI3","PS8_5_EPC2_2"]
["PS8_6_VFD1","SO0","PS8_6_VFD1_SO0"]
["PS8_8_VFD1","I0","PS8_8_VFD1_I0","PS8_8_VFD1_DISC"]
["PS8_8_VFD1","I1","PS8_8_VFD1_I1","PS8_8_ENC1"]
["PS8_8_VFD1","I2","PS8_8_VFD1_I2","PS8_8_JPE1"]
["PS8_8_VFD1","I3","PS8_8_VFD1_I3","PS8_8_JPE2"]
["PS8_8_VFD1","IO0","PS8_8_VFD1_IO0"]
["PS8_8_VFD1","IO1","PS8_8_VFD1_IO1"]
["PS8_8_VFD1","SI0","PS8_8_VFD1_SI0"]
["PS8_8_VFD1","SI1","PS8_8_VFD1_SI1"]
["PS8_8_VFD1","SI2","PS8_8_VFD1_SI2"]
["PS8_8_VFD1","SI3","PS8_8_VFD1_SI3"]
["PS8_8_VFD1","SO0","PS8_8_VFD1_SO0"]
["PS8_9_VFD1","I0","PS8_9_VFD1_I0","PS8_9_VFD1_DISC"]
["PS9_2_VFD1","I0","PS9_2_VFD1_I0","PS9_2_VFD1_DISC"]
["PS9_2_VFD1","I1","PS9_2_VFD1_I1","PS9_2_ENC1"]
["PS9_2_VFD1","I2","PS9_2_VFD1_I2","PS9_2_JPE1"]
["PS9_2_VFD1","I3","PS9_2_VFD1_I3","PS9_2_JPE2"]
["PS9_2_VFD1","IO0","PS9_2_VFD1_IO0"]
["PS9_2_VFD1","IO1","PS9_2_VFD1_IO1",null,null,null,null,null," "]
["PS9_2_VFD1","SI0","PS9_2_VFD1_SI0","PS9_2_EPC1"]
["PS9_2_VFD1","SI1","PS9_2_VFD1_SI1","PS9_2_EPC1_2"]
["PS9_2_VFD1","SI2","PS9_2_VFD1_SI2","PS9_2_EPC2"]
["PS9_2_VFD1","SI3","PS9_2_VFD1_SI3","PS9_2_EPC2_2"]
["PS9_2_VFD1","SO0","PS9_2_VFD1_SO0"]
["PS9_3_VFD1","I0","PS9_3_VFD1_I0","PS9_3_VFD1_DISC"]
["PS9_3_VFD1","I1","PS9_3_VFD1_I1","PS9_3_ENC1"]
["PS9_3_VFD1","I2","PS9_3_VFD1_I2","PS9_3_JPE1"]
["PS9_3_VFD1","I3","PS9_3_VFD1_I3","PS9_3_JPE2"]
["PS9_3_VFD1","IO0","PS9_3_VFD1_IO0","PS9_3_BCN2_A"]
["PS9_3_VFD1","IO1","PS9_3_VFD1_IO1","PS9_3_BCN2_B"]
["PS9_3_VFD1","SI0","PS9_3_VFD1_SI0","PS9_3_EPC1"]
["PS9_3_VFD1","SI1","PS9_3_VFD1_SI1","PS9_3_EPC1_2"]
["PS9_3_VFD1","SI2","PS9_3_VFD1_SI2"]
["PS9_3_VFD1","SI3","PS9_3_VFD1_SI3"]
["PS9_3_VFD1","SO0","PS9_3_VFD1_SO0","PS9_3_BCN2_R"]
["ULC1_3_VFD1","I0","ULC1_3_VFD1_I0","ULC1_3_VFD1_DISC"]
["ULC1_3_VFD1","I1","ULC1_3_VFD1_I1","ULC1_3_ENC1"]
["ULC1_3_VFD1","I2","ULC1_3_VFD1_I2","ULC1_3_JPE1"]
["ULC1_3_VFD1","I3","ULC1_3_VFD1_I3","ULC1_3_JPE2"]
["ULC1_3_VFD1","IO0","ULC1_3_VFD1_IO0"]
["ULC1_3_VFD1","IO1","ULC1_3_VFD1_IO1"]
["ULC1_3_VFD1","SI0","ULC1_3_VFD1_SI0","ULC1_3_EPC1"]
["ULC1_3_VFD1","SI1","ULC1_3_VFD1_SI1","ULC1_3_EPC1_2"]
["ULC1_3_VFD1","SI2","ULC1_3_VFD1_SI2","ULC1_3_EPC2"]
["ULC1_3_VFD1","SI3","ULC1_3_VFD1_SI3","ULC1_3_EPC2_2"]
["ULC1_3_VFD1","SO0","ULC1_3_VFD1_SO0"]
["ULC2_3_VFD1","I0","ULC2_3_VFD1_I0","ULC2_3_VFD1_DISC"]
["ULC2_3_VFD1","I1","ULC2_3_VFD1_I1","ULC2_3_ENC1"]
["ULC2_3_VFD1","I2","ULC2_3_VFD1_I2","ULC2_3_JPE1"]
["ULC2_3_VFD1","I3","ULC2_3_VFD1_I3","ULC2_3_JPE2"]
["ULC2_3_VFD1","IO0","ULC2_3_VFD1_IO0"]
["ULC2_3_VFD1","IO1","ULC2_3_VFD1_IO1"]
["ULC2_3_VFD1","SI0","ULC2_3_VFD1_SI0","ULC2_3_EPC1"]
["ULC2_3_VFD1","SI1","ULC2_3_VFD1_SI1","ULC2_3_EPC1_2"]
["ULC2_3_VFD1","SI2","ULC2_3_VFD1_SI2"]
["ULC2_3_VFD1","SI3","ULC2_3_VFD1_SI3"]
["ULC2_3_VFD1","SO0","ULC2_3_VFD1_SO0"]
["ULC3_3_VFD1","I0","ULC3_3_VFD1_I0","ULC3_3_VFD1_DISC"]
["ULC3_3_VFD1","I1","ULC3_3_VFD1_I1","ULC3_3_ENC1"]
["ULC3_3_VFD1","I2","ULC3_3_VFD1_I2","ULC3_3_JPE1"]
["ULC3_3_VFD1","I3","ULC3_3_VFD1_I3","ULC3_3_JPE2"]
["ULC3_3_VFD1","IO0","ULC3_3_VFD1_IO0"]
["ULC3_3_VFD1","IO1","ULC3_3_VFD1_IO1"]
["ULC3_3_VFD1","SI0","ULC3_3_VFD1_SI0","ULC3_3_EPC1"]
["ULC3_3_VFD1","SI1","ULC3_3_VFD1_SI1","ULC3_3_EPC1_2"]
["ULC3_3_VFD1","SI2","ULC3_3_VFD1_SI2"]
["ULC3_3_VFD1","SI3","ULC3_3_VFD1_SI3"]
["ULC3_3_VFD1","SO0","ULC3_3_VFD1_SO0"]
["ULC4_3_VFD1","I0","ULC4_3_VFD1_I0","ULC4_3_VFD1_DISC"]
["ULC4_3_VFD1","I1","ULC4_3_VFD1_I1","ULC4_3_ENC1"]
["ULC4_3_VFD1","I2","ULC4_3_VFD1_I2","ULC4_3_JPE1"]
["ULC4_3_VFD1","I3","ULC4_3_VFD1_I3","ULC4_3_JPE2"]
["ULC4_3_VFD1","IO0","ULC4_3_VFD1_IO0"]
["ULC4_3_VFD1","IO1","ULC4_3_VFD1_IO1"]
["ULC4_3_VFD1","SI0","ULC4_3_VFD1_SI0","ULC4_3_EPC1"]
["ULC4_3_VFD1","SI1","ULC4_3_VFD1_SI1","ULC4_3_EPC1_2"]
["ULC4_3_VFD1","SI2","ULC4_3_VFD1_SI2"]
["ULC4_3_VFD1","SI3","ULC4_3_VFD1_SI3"]
["ULC4_3_VFD1","SO0","ULC4_3_VFD1_SO0"]
["PRS1_1ACH_FIO1","IO00","PRS1_3_FIO1_IO00","PRS1_1ACH_BCN1_A"]
["PRS1_1ACH_FIO1","IO01","PRS1_3_FIO1_IO01","PRS1_1ACH_BCN1_B"]
["PRS1_1ACH_FIO1","IO02","PRS1_3_FIO1_IO02","PRS1_1ACH_FPE1"]
["PRS1_1ACH_FIO1","IO03","PRS1_3_FIO1_IO03"]
["PRS1_1ACH_FIO1","IO04","PRS1_3_FIO1_IO04","PRS1_2A_BCN1_A"]
["PRS1_1ACH_FIO1","IO05","PRS1_3_FIO1_IO05"]
["PRS1_1ACH_FIO1","IO06","PRS1_3_FIO1_IO06","PRS1_2A_JR1_PB"]
["PRS1_1ACH_FIO1","IO07","PRS1_3_FIO1_IO07","PRS1_2A_JR1_PB_LT"]
["PRS1_1ACH_FIO1","IO08","PRS1_3_FIO1_IO08","PRS1_2A_JR2_PB"]
["PRS1_1ACH_FIO1","IO09","PRS1_3_FIO1_IO09","PRS1_2A_JR2_PB_LT"]
["PRS1_1ACH_FIO1","IO10","PRS1_3_FIO1_IO10","PRS1_3_JPE1"]
["PRS1_1ACH_FIO1","IO11","PRS1_3_FIO1_IO11"]
["PRS1_1ACH_FIO1","IO12","PRS1_3_FIO1_IO12"]
["PRS1_1ACH_FIO1","IO13","PRS1_3_FIO1_IO13"]
["PRS1_1ACH_FIO1","IO14","PRS1_3_FIO1_IO14"]
["PRS1_1ACH_FIO1","IO15","PRS1_3_FIO1_IO15"]
["PRS1_1BCH_FIO1","IO00","PRS1_3_FIO1_IO00","PRS1_1BCH_BCN1_A"]
["PRS1_1BCH_FIO1","IO01","PRS1_3_FIO1_IO01","PRS1_1BCH_BCN1_B"]
["PRS1_1BCH_FIO1","IO02","PRS1_3_FIO1_IO02","PRS1_1BCH_FPE1"]
["PRS1_1BCH_FIO1","IO03","PRS1_3_FIO1_IO03"]
["PRS1_1BCH_FIO1","IO04","PRS1_3_FIO1_IO04","PRS1_2B_BCN1_A"]
["PRS1_1BCH_FIO1","IO05","PRS1_3_FIO1_IO05"]
["PRS1_1BCH_FIO1","IO06","PRS1_3_FIO1_IO06","PRS1_2B_JR1_PB"]
["PRS1_1BCH_FIO1","IO07","PRS1_3_FIO1_IO07","PRS1_2B_JR1_PB_LT"]
["PRS1_1BCH_FIO1","IO08","PRS1_3_FIO1_IO08","PRS1_2B_JR2_PB"]
["PRS1_1BCH_FIO1","IO09","PRS1_3_FIO1_IO09","PRS1_2B_JR2_PB_LT"]
["PRS1_1BCH_FIO1","IO10","PRS1_3_FIO1_IO10"]
["PRS1_1BCH_FIO1","IO11","PRS1_3_FIO1_IO11"]
["PRS1_1BCH_FIO1","IO12","PRS1_3_FIO1_IO12"]
["PRS1_1BCH_FIO1","IO13","PRS1_3_FIO1_IO13"]
["PRS1_1BCH_FIO1","IO14","PRS1_3_FIO1_IO14"]
["PRS1_1BCH_FIO1","IO15","PRS1_3_FIO1_IO15"]
["PRS1_4_FIO1","IO00","PRS1_4_FIO1_IO00","PRS1_4_BCN1_A"]
["PRS1_4_FIO1","IO01","PRS1_4_FIO1_IO01","PRS1_4_BCN1_B"]
["PRS1_4_FIO1","IO02","PRS1_4_FIO1_IO02","PRS1_4_JR1_PB"]
["PRS1_4_FIO1","IO03","PRS1_4_FIO1_IO03","PRS1_4_JR1_PB_LT"]
["PRS1_4_FIO1","IO04","PRS1_4_FIO1_IO04","PRS1_5CH_FPE1"]
["PRS1_4_FIO1","IO05","PRS1_4_FIO1_IO05"]
["PRS1_4_FIO1","IO06","PRS1_4_FIO1_IO06","PRS1_5CH_FPE2"]
["PRS1_4_FIO1","IO07","PRS1_4_FIO1_IO07"]
["PRS1_4_FIO1","IO08","PRS1_4_FIO1_IO08","PRS1_6_BCN1_R"]
["PRS1_4_FIO1","IO09","PRS1_4_FIO1_IO09"]
["PRS1_4_FIO1","IO10","PRS1_4_FIO1_IO10","PRS1_6_BCN2_R"]
["PRS1_4_FIO1","IO11","PRS1_4_FIO1_IO11"]
["PRS1_4_FIO1","IO12","PRS1_4_FIO1_IO12","PRS1_6_S1_PB"]
["PRS1_4_FIO1","IO13","PRS1_4_FIO1_IO13","PRS1_6_S1_PB_LT"]
["PRS1_4_FIO1","IO14","PRS1_4_FIO1_IO14","PRS1_6_S2_PB"]
["PRS1_4_FIO1","IO15","PRS1_4_FIO1_IO15","PRS1_6_S2_PB_LT"]
["PS8_1_FIO1","IO00","PS8_1_FIO1_IO00","PRS2_1_BCN1_A"]
["PS8_1_FIO1","IO01","PS8_1_FIO1_IO01","PRS2_1_BCN1_R"]
["PS8_1_FIO1","IO02","PS8_1_FIO1_IO02","PRS2_1_BCN2_R"]
["PS8_1_FIO1","IO03","PS8_1_FIO1_IO03","PS8_1_JPE4"]
["PS8_1_FIO1","IO04","PS8_1_FIO1_IO04","PS8_1_JPE5"]
["PS8_1_FIO1","IO05","PS8_1_FIO1_IO05","PS8_1_JPE6"]
["PS8_1_FIO1","IO06","PS8_1_FIO1_IO06","PRS2_1_S1_PB"]
["PS8_1_FIO1","IO07","PS8_1_FIO1_IO07","PRS2_1_S1_PB_LT"]
["PS8_1_FIO1","IO08","PS8_1_FIO1_IO08","PRS2_1_S2_PB"]
["PS8_1_FIO1","IO09","PS8_1_FIO1_IO09","PRS2_1_S2_PB_LT"]
["PS8_1_FIO1","IO10","PS8_1_FIO1_IO10","PS8_1_BCN1_A"]
["PS8_1_FIO1","IO11","PS8_1_FIO1_IO11","PS8_1_BCN1_R"]
["PS8_1_FIO1","IO12","PS8_1_FIO1_IO12","PS8_1_FIOH1"]
["PS8_1_FIO1","IO13","PS8_1_FIO1_IO13"]
["PS8_1_FIO1","IO14","PS8_1_FIO1_IO14","PS8_1_FIOH2"]
["PS8_1_FIO1","IO15","PS8_1_FIO1_IO15"]
["PS8_1_FIO2","IO00","PS8_1_FIO2_IO00","ULC3_3_BCN1_A"]
["PS8_1_FIO2","IO01","PS8_1_FIO2_IO01","ULC3_3_BCN1_R"]
["PS8_1_FIO2","IO02","PS8_1_FIO2_IO02","ULC3_3_JR1_PB"]
["PS8_1_FIO2","IO03","PS8_1_FIO2_IO03","ULC3_3_JR1_PB_LT"]
["PS8_1_FIO2","IO04","PS8_1_FIO2_IO04","ULC3_3_SS1_STPB"]
["PS8_1_FIO2","IO05","PS8_1_FIO2_IO05","ULC3_3_SS1_STPB_LT"]
["PS8_1_FIO2","IO06","PS8_1_FIO2_IO06","ULC3_3_SS1_SPB"]
["PS8_1_FIO2","IO07","PS8_1_FIO2_IO07"]
["PS8_1_FIO2","IO08","PS8_1_FIO2_IO08","ULC4_3_BCN1_A"]
["PS8_1_FIO2","IO09","PS8_1_FIO2_IO09","ULC4_3_BCN1_R"]
["PS8_1_FIO2","IO10","PS8_1_FIO2_IO10","ULC4_3_JR1_PB"]
["PS8_1_FIO2","IO11","PS8_1_FIO2_IO11","ULC4_3_JR1_PB_LT"]
["PS8_1_FIO2","IO12","PS8_1_FIO2_IO12"]
["PS8_1_FIO2","IO13","PS8_1_FIO2_IO13"]
["PS8_1_FIO2","IO14","PS8_1_FIO2_IO14","PS8_1_FIOH3"]
["PS8_1_FIO2","IO15","PS8_1_FIO2_IO15"]
["PS8_1_FIOH1","IO00","PS8_1_FIOH1_IO00","PS8_1_BCN2_A"]
["PS8_1_FIOH1","IO01","PS8_1_FIOH1_IO01"]
["PS8_1_FIOH1","IO02","PS8_1_FIOH1_IO02","PS8_1_BCN3_A"]
["PS8_1_FIOH1","IO03","PS8_1_FIOH1_IO03"]
["PS8_1_FIOH1","IO04","PS8_1_FIOH1_IO04","PS8_1_JR1_PB"]
["PS8_1_FIOH1","IO05","PS8_1_FIOH1_IO05","PS8_1_JR1_PB_LT"]
["PS8_1_FIOH1","IO06","PS8_1_FIOH1_IO06","PS8_1_JR2_PB"]
["PS8_1_FIOH1","IO07","PS8_1_FIOH1_IO07","PS8_1_JR2_PB_LT"]
["PS8_1_FIOH1","IO08","PS8_1_FIOH1_IO08","PS8_1_SS1_STPB"]
["PS8_1_FIOH1","IO09","PS8_1_FIOH1_IO09","PS8_1_SS1_STPB_LT"]
["PS8_1_FIOH1","IO10","PS8_1_FIOH1_IO10","PS8_1_SS1_SPB"]
["PS8_1_FIOH1","IO11","PS8_1_FIOH1_IO11"]
["PS8_1_FIOH1","IO12","PS8_1_FIOH1_IO12","ULC1_3_BCN1_A"]
["PS8_1_FIOH1","IO13","PS8_1_FIOH1_IO13","ULC1_3_BCN1_R"]
["PS8_1_FIOH1","IO14","PS8_1_FIOH1_IO14","ULC1_3_JR1_PB"]
["PS8_1_FIOH1","IO15","PS8_1_FIOH1_IO15","ULC1_3_JR1_PB_LT"]
["PS8_1_FIOH2","IO00","PS8_1_FIOH2_IO00","ULC1_3_SS1_STPB"]
["PS8_1_FIOH2","IO01","PS8_1_FIOH2_IO01","ULC1_3_SS1_STPB_LT"]
["PS8_1_FIOH2","IO02","PS8_1_FIOH2_IO02","ULC1_3_SS1_SPB"]
["PS8_1_FIOH2","IO03","PS8_1_FIOH2_IO03"]
["PS8_1_FIOH2","IO04","PS8_1_FIOH2_IO04","ULC1_3_SS2_STPB"]
["PS8_1_FIOH2","IO05","PS8_1_FIOH2_IO05","ULC1_3_SS2_STPB_LT"]
["PS8_1_FIOH2","IO06","PS8_1_FIOH2_IO06","ULC1_3_SS2_SPB"]
["PS8_1_FIOH2","IO07","PS8_1_FIOH2_IO07"]
["PS8_1_FIOH2","IO08","PS8_1_FIOH2_IO08","ULC2_3_SS1_STPB"]
["PS8_1_FIOH2","IO09","PS8_1_FIOH2_IO09","ULC2_3_SS1_STPB_LT"]
["PS8_1_FIOH2","IO10","PS8_1_FIOH2_IO10","ULC2_3_SS1_SPB"]
["PS8_1_FIOH2","IO11","PS8_1_FIOH2_IO11"]
["PS8_1_FIOH2","IO12","PS8_1_FIOH2_IO12","ULC2_3_BCN1_A"]
["PS8_1_FIOH2","IO13","PS8_1_FIOH2_IO13","ULC2_3_BCN1_R"]
["PS8_1_FIOH2","IO14","PS8_1_FIOH2_IO14","ULC2_3_JR1_PB"]
["PS8_1_FIOH2","IO15","PS8_1_FIOH2_IO15","ULC2_3_JR1_PB_LT"]
["PS8_1_FIOH3","IO00","PS8_1_FIOH3_IO00","ULC4_3_SS1_STPB"]
["PS8_1_FIOH3","IO01","PS8_1_FIOH3_IO01","ULC4_3_SS1_STPB_LT"]
["PS8_1_FIOH3","IO02","PS8_1_FIOH3_IO02","ULC4_3_SS1_SPB"]
["PS8_1_FIOH3","IO03","PS8_1_FIOH3_IO03"]
["PS8_1_FIOH3","IO04","PS8_1_FIOH3_IO04","PS8_2_S1_PB"]
["PS8_1_FIOH3","IO05","PS8_1_FIOH3_IO05","PS8_2_S1_PB_LT"]
["PS8_1_FIOH3","IO06","PS8_1_FIOH3_IO06","PS8_2_S2_PB"]
["PS8_1_FIOH3","IO07","PS8_1_FIOH3_IO07","PS8_2_S2_PB_LT"]
["PS8_1_FIOH3","IO08","PS8_1_FIOH3_IO08"]
["PS8_1_FIOH3","IO09","PS8_1_FIOH3_IO09"]
["PS8_1_FIOH3","IO10","PS8_1_FIOH3_IO10"]
["PS8_1_FIOH3","IO11","PS8_1_FIOH3_IO11"]
["PS8_1_FIOH3","IO12","PS8_1_FIOH3_IO12"]
["PS8_1_FIOH3","IO13","PS8_1_FIOH3_IO13"]
["PS8_1_FIOH3","IO14","PS8_1_FIOH3_IO14"]
["PS8_1_FIOH3","IO15","PS8_1_FIOH3_IO15"]
["PS8_4_SIO1","SI0",{"$f":"_xlfn.CONCAT(A320,\"_\",B320)","v":"PS8_4_SIO1_SI0"},"PS8_4_EPC1"]
["PS8_4_SIO1","SI1",{"$f":"_xlfn.CONCAT(A321,\"_\",B321)","v":"PS8_4_SIO1_SI1"},"PS8_4_EPC1_2"]
["PS8_4_SIO1","SI2","PS8_4_SIO1_SI2","PS8_4_EPC2"]
["PS8_4_SIO1","SI3","PS8_4_SIO1_SI3","PS8_4_EPC2_2"]
["PS8_4_SIO1","SI4","PS8_4_SIO1_SI4","PS8_4_EPC3",null,null,null,null," "]
["PS8_4_SIO1","SI5","PS8_4_SIO1_SI5","PS8_4_EPC3_2"]
["PS8_4_SIO1","SI6","PS8_4_SIO1_SI6","PS8_4_EPC4"]
["PS8_4_SIO1","SI7","PS8_4_SIO1_SI7","PS8_4_EPC4_2"]
["PS8_4_SIO1","SO0",{"$f":"_xlfn.CONCAT(A328,\"_\",B328)","v":"PS8_4_SIO1_SO0"},"PS8_4_VFD1_STO"]
["PS8_4_SIO1","SO1","PS8_4_SIO1_SO1"]
["PS8_4_SIO1","SO2","PS8_4_SIO1_SO2","PS8_5_VFD1_STO"]
["PS8_4_SIO1","SO3","PS8_4_SIO1_SO3"]
["PS8_4_SIO1","IO0","PS8_4_SIO1_IO0"]
["PS8_4_SIO1","IO1","PS8_4_SIO1_IO1"]
["PS8_4_SIO1","IO2","PS8_4_SIO1_IO2"]
["PS8_4_SIO1","IO3","PS8_4_SIO1_IO3"]
["PS8_4_FIOH1","IO00","PS8_4_FIOH1_IO00","PS8_4_BCN1_A"]
["PS8_4_FIOH1","IO01","PS8_4_FIOH1_IO01","PS8_4_BCN1_R"]
["PS8_4_FIOH1","IO02","PS8_4_FIOH1_IO02","PS8_4_BCN2_R",null,null,null,null," "]
["PS8_4_FIOH1","IO03","PS8_4_FIOH1_IO03"]
["PS8_4_FIOH1","IO04","PS8_4_FIOH1_IO04","PS8_4_S1_PB"]
["PS8_4_FIOH1","IO05","PS8_4_FIOH1_IO05","PS8_4_S1_PB_LT"]
["PS8_4_FIOH1","IO06","PS8_4_FIOH1_IO06","PS8_4_S2_PB"]
["PS8_4_FIOH1","IO07","PS8_4_FIOH1_IO07","PS8_4_S2_PB_LT"]
["PS8_4_FIOH1","IO08","PS8_4_FIOH1_IO08","PS8_4_ENC1"]
["PS8_4_FIOH1","IO09","PS8_4_FIOH1_IO09"]
["PS8_4_FIOH1","IOH10","PS8_4_FIOH1_IO10","PS8_4_JPE1"]
["PS8_4_FIOH1","IOH11","PS8_4_FIOH1_IO11"]
["PS8_4_FIOH1","IOH12","PS8_4_FIOH1_IO12","PS8_4_JPE2"]
["PS8_4_FIOH1","IOH13","PS8_4_FIOH1_IO13"]
["PS8_4_FIOH1","IOH14","PS8_4_FIOH1_IO14","PS8_2_BCN1_R"]
["PS8_4_FIOH1","IOH15","PS8_4_FIOH1_IO15","PS8_2_BCN1_H"]
["PS8_5_FIO1","IO00","PS8_5_FIO1_IO00","PS8_5_BCN1_A"]
["PS8_5_FIO1","IO01","PS8_5_FIO1_IO01","PS8_5_BCN1_R"]
["PS8_5_FIO1","IO02","PS8_5_FIO1_IO02","PS8_5_S1_PB"]
["PS8_5_FIO1","IO03","PS8_5_FIO1_IO03","PS8_5_S1_PB_LT"]
["PS8_5_FIO1","IO04","PS8_5_FIO1_IO04","PS8_5_S2_PB"]
["PS8_5_FIO1","IO05","PS8_5_FIO1_IO05","PS8_5_S2_PB_LT"]
["PS8_5_FIO1","IO06","PS8_5_FIO1_IO06","PS9_2_BCN1_A"]
["PS8_5_FIO1","IO07","PS8_5_FIO1_IO07","PS9_2_BCN1_R"]
["PS8_5_FIO1","IO08","PS8_5_FIO1_IO08","PS9_2_BCN2_R"]
["PS8_5_FIO1","IO09","PS8_5_FIO1_IO09"]
["PS8_5_FIO1","IO10","PS8_5_FIO1_IO10","PS9_2_S1_PB"]
["PS8_5_FIO1","IO11","PS8_5_FIO1_IO11","PS9_2_S1_PB_LT"]
["PS8_5_FIO1","IO12","PS8_5_FIO1_IO12","PS9_2_S2_PB"]
["PS8_5_FIO1","IO13","PS8_5_FIO1_IO13","PS9_2_S2_PB_LT"]
["PS8_5_FIO1","IO14","PS8_5_FIO1_IO14","PS8_5_ENC1"]
["PS8_5_FIO1","IO15","PS8_5_FIO1_IO15","PS8_5_JPE1"]
["PS8_9_FIO1","IO00","PS8_9_FIO1_IO00","PS8_9_ENC1"]
["PS8_9_FIO1","IO01","PS8_9_FIO1_IO01"]
["PS8_9_FIO1","IO02","PS8_9_FIO1_IO02","PS8_9_JPE1"]
["PS8_9_FIO1","IO03","PS8_9_FIO1_IO03"]
["PS8_9_FIO1","IO04","PS8_9_FIO1_IO04","PS8_9_JR1_PB"]
["PS8_9_FIO1","IO05","PS8_9_FIO1_IO05","PS8_9_JR1_PB_LT"]
["PS8_9_FIO1","IO06","PS8_9_FIO1_IO06","PS8_9_BCN1_A"]
["PS8_9_FIO1","IO07","PS8_9_FIO1_IO07","PS8_9_BCN1_H"]
["PS8_9_FIO1","IO08","PS8_9_FIO1_IO08"]
["PS8_9_FIO1","IO09","PS8_9_FIO1_IO09"]
["PS8_9_FIO1","IO10","PS8_9_FIO1_IO10"]
["PS8_9_FIO1","IO11","PS8_9_FIO1_IO11"]
["PS8_9_FIO1","IO12","PS8_9_FIO1_IO12"]
["PS8_9_FIO1","IO13","PS8_9_FIO1_IO13"]
["PS8_9_FIO1","IO14","PS8_9_FIO1_IO14"]
["PS8_9_FIO1","IO15","PS8_9_FIO1_IO15"]
["PS8_11_FIO1","IO00","PS8_11_FIO1_IO00","PS8_11_JPE1"]
["PS8_11_FIO1","IO01","PS8_11_FIO1_IO01","PS8_11_JPE2"]
["PS8_11_FIO1","IO02","PS8_11_FIO1_IO02","PS8_11_JPE3"]
["PS8_11_FIO1","IO03","PS8_11_FIO1_IO03","PS8_11_JPE4"]
["PS8_11_FIO1","IO04","PS8_11_FIO1_IO04","PS8_11_BCN1_A"]
["PS8_11_FIO1","IO05","PS8_11_FIO1_IO05","PS8_11_BCN1_R"]
["PS8_11_FIO1","IO06","PS8_11_FIO1_IO06","PS8_11_JR1_PB"]
["PS8_11_FIO1","IO07","PS8_11_FIO1_IO07","PS8_11_JR1_PB_LT"]
["PS8_11_FIO1","IO08","PS8_11_FIO1_IO08","PS8_11_JR2_PB"]
["PS8_11_FIO1","IO09","PS8_11_FIO1_IO09","PS8_11_JR2_PB_LT"]
["PS8_11_FIO1","IO10","PS8_11_FIO1_IO10","PS8_11_S1_PB"]
["PS8_11_FIO1","IO11","PS8_11_FIO1_IO11","PS8_11_S1_PB_LT"]
["PS8_11_FIO1","IO12","PS8_11_FIO1_IO12","PS8_11_BCN3_A"]
["PS8_11_FIO1","IO13","PS8_11_FIO1_IO13","PS8_11_BCN3_B"]
["PS8_11_FIO1","IO14","PS8_11_FIO1_IO14","PS8_11_FIOH1"]
["PS8_11_FIO1","IO15","PS8_11_FIO1_IO15"]
["PS8_11_FIO2","IO00","PS8_11_FIO2_IO00","PS8_11_CH3_BCN1_A"]
["PS8_11_FIO2","IO01","PS8_11_FIO2_IO01","PS8_11_CH3_BCN1_B"]
["PS8_11_FIO2","IO02","PS8_11_FIO2_IO02","PS8_11_CH3_BCN1_G"]
["PS8_11_FIO2","IO03","PS8_11_FIO2_IO03","PS8_11_CH3_FPE1"]
["PS8_11_FIO2","IO04","PS8_11_FIO2_IO04","PS8_11_CH3_FPE2"]
["PS8_11_FIO2","IO05","PS8_11_FIO2_IO05","PS8_11_CH3_JPE1"]
["PS8_11_FIO2","IO06","PS8_11_FIO2_IO06","PS8_11_CH3_S1_PB"]
["PS8_11_FIO2","IO07","PS8_11_FIO2_IO07","PS8_11_CH3_S1_PB_LT"]
["PS8_11_FIO2","IO08","PS8_11_FIO2_IO08","PS8_11_CH4_BCN1_A"]
["PS8_11_FIO2","IO09","PS8_11_FIO2_IO09","PS8_11_CH4_BCN1_B"]
["PS8_11_FIO2","IO10","PS8_11_FIO2_IO10","PS8_11_CH4_BCN1_G"]
["PS8_11_FIO2","IO11","PS8_11_FIO2_IO11","PS8_11_CH4_FPE1"]
["PS8_11_FIO2","IO12","PS8_11_FIO2_IO12","PS8_11_CH4_FPE2"]
["PS8_11_FIO2","IO13","PS8_11_FIO2_IO13","PS8_11_CH4_JPE1"]
["PS8_11_FIO2","IO14","PS8_11_FIO2_IO14","PS8_11_FIOH2"]
["PS8_11_FIO2","IO15","PS8_11_FIO2_IO15"]
["PS8_11_FIOH1","IO00","PS8_11_FIOH1_IO00","PS8_11_CH1_BCN1_A"]
["PS8_11_FIOH1","IO01","PS8_11_FIOH1_IO01","PS8_11_CH1_BCN1_B"]
["PS8_11_FIOH1","IO02","PS8_11_FIOH1_IO02","PS8_11_CH1_BCN1_G"]
["PS8_11_FIOH1","IO03","PS8_11_FIOH1_IO03","PS8_11_CH1_FPE1"]
["PS8_11_FIOH1","IO04","PS8_11_FIOH1_IO04","PS8_11_CH1_FPE2"]
["PS8_11_FIOH1","IO05","PS8_11_FIOH1_IO05","PS8_11_CH1_S1_PB"]
["PS8_11_FIOH1","IO06","PS8_11_FIOH1_IO06","PS8_11_CH1_S1_PB_LT"]
["PS8_11_FIOH1","IO07","PS8_11_FIOH1_IO07","PS8_11_CH2_BCN1_A"]
["PS8_11_FIOH1","IO08","PS8_11_FIOH1_IO08","PS8_11_CH2_BCN1_B"]
["PS8_11_FIOH1","IO09","PS8_11_FIOH1_IO09","PS8_11_CH2_BCN1_G"]
["PS8_11_FIOH1","IO10","PS8_11_FIOH1_IO10","PS8_11_CH2_FPE1"]
["PS8_11_FIOH1","IO11","PS8_11_FIOH1_IO11","PS8_11_CH2_FPE2"]
["PS8_11_FIOH1","IO12","PS8_11_FIOH1_IO12","PS8_11_CH2_S1_PB"]
["PS8_11_FIOH1","IO13","PS8_11_FIOH1_IO13","PS8_11_CH2_S1_PB_LT"]
["PS8_11_FIOH1","IO14","PS8_11_FIOH1_IO14","PS8_11_CH4_S1_PB"]
["PS8_11_FIOH1","IO15","PS8_11_FIOH1_IO15","PS8_11_CH4_S1_PB_LT"]
["PS8_11_FIOH2","IO00","PS8_11_FIOH2_IO00","PS8_11_DIV1_PX1"]
["PS8_11_FIOH2","IO01","PS8_11_FIOH2_IO01","PS8_11_DIV1_PX2"]
["PS8_11_FIOH2","IO02","PS8_11_FIOH2_IO02","PS8_11_DIV1_SOL1"]
["PS8_11_FIOH2","IO03","PS8_11_FIOH2_IO03","PS8_11_DIV1_SOL2"]
["PS8_11_FIOH2","IO04","PS8_11_FIOH2_IO04","PS8_11_DIV2_PX1"]
["PS8_11_FIOH2","IO05","PS8_11_FIOH2_IO05","PS8_11_DIV2_PX2"]
["PS8_11_FIOH2","IO06","PS8_11_FIOH2_IO06","PS8_11_DIV2_SOL1"]
["PS8_11_FIOH2","IO07","PS8_11_FIOH2_IO07","PS8_11_DIV2_SOL2"]
["PS8_11_FIOH2","IO08","PS8_11_FIOH2_IO08","PS8_11_DIV3_PX1"]
["PS8_11_FIOH2","IO09","PS8_11_FIOH2_IO09","PS8_11_DIV3_PX2"]
["PS8_11_FIOH2","IO10","PS8_11_FIOH2_IO10","PS8_11_DIV3_SOL1"]
["PS8_11_FIOH2","IO11","PS8_11_FIOH2_IO11","PS8_11_DIV3_SOL2"]
["PS8_11_FIOH2","IO12","PS8_11_FIOH2_IO12","PS8_11_DIV4_PX1"]
["PS8_11_FIOH2","IO13","PS8_11_FIOH2_IO13","PS8_11_DIV4_PX2"]
["PS8_11_FIOH2","IO14","PS8_11_FIOH2_IO14","PS8_11_DIV4_SOL1"]
["PS8_11_FIOH2","IO15","PS8_11_FIOH2_IO15","PS8_11_DIV4_SOL2"]
["PS9_3_FIO1","IO00","PS9_3_FIO1_IO00","PS9_3_BCN1_A"]
["PS9_3_FIO1","IO01","PS9_3_FIO1_IO01"]
["PS9_3_FIO1","IO02","PS9_3_FIO1_IO02","PS9_3_JR1_PB"]
["PS9_3_FIO1","IO03","PS9_3_FIO1_IO03","PS9_3_JR1_PB_LT"]
["PS9_3_FIO1","IO04","PS9_3_FIO1_IO04","PS9_3CH1_BCN1_A"]
["PS9_3_FIO1","IO05","PS9_3_FIO1_IO05","PS9_3CH1_BCN1_B"]
["PS9_3_FIO1","IO06","PS9_3_FIO1_IO06","PS9_3CH1_BCN1_G"]
["PS9_3_FIO1","IO07","PS9_3_FIO1_IO07","PS9_3_JPE3"]
["PS9_3_FIO1","IO08","PS9_3_FIO1_IO08","PS9_3CH1_S1_PB"]
["PS9_3_FIO1","IO09","PS9_3_FIO1_IO09","PS9_3CH1_S1_PB_LT"]
["PS9_3_FIO1","IO10","PS9_3_FIO1_IO10","PS9_3CH2_BCN1_A"]
["PS9_3_FIO1","IO11","PS9_3_FIO1_IO11","PS9_3CH2_BCN1_B"]
["PS9_3_FIO1","IO12","PS9_3_FIO1_IO12","PS9_3CH2_BCN1_G"]
["PS9_3_FIO1","IO13","PS9_3_FIO1_IO13"]
["PS9_3_FIO1","IO14","PS9_3_FIO1_IO14","PS9_3_FIOH1"]
["PS9_3_FIO1","IO15","PS9_3_FIO1_IO15"]
["PS9_3_FIO2","IO00","PS9_3_FIO2_IO00","PS9_3CH3_BCN1_A"]
["PS9_3_FIO2","IO01","PS9_3_FIO2_IO01","PS9_3CH3_BCN1_B"]
["PS9_3_FIO2","IO02","PS9_3_FIO2_IO02","PS9_3CH3_BCN1_G"]
["PS9_3_FIO2","IO03","PS9_3_FIO2_IO03","PS9_3CH3_JPE1"]
["PS9_3_FIO2","IO04","PS9_3_FIO2_IO04","PS9_3CH3_FPE1"]
["PS9_3_FIO2","IO05","PS9_3_FIO2_IO05","PS9_3CH3_FPE2"]
["PS9_3_FIO2","IO06","PS9_3_FIO2_IO06","PS9_3_S1_PB"]
["PS9_3_FIO2","IO07","PS9_3_FIO2_IO07","PS9_3_S1_PB_LT"]
["PS9_3_FIO2","IO08","PS9_3_FIO2_IO08","PS9_3CH3_S1_PB"]
["PS9_3_FIO2","IO09","PS9_3_FIO2_IO09","PS9_3CH3_S1_PB_LT"]
["PS9_3_FIO2","IO10","PS9_3_FIO2_IO10","PS9_3CH4_BCN1_A"]
["PS9_3_FIO2","IO11","PS9_3_FIO2_IO11","PS9_3CH4_BCN1_B"]
["PS9_3_FIO2","IO12","PS9_3_FIO2_IO12","PS9_3CH4_BCN1_G"]
["PS9_3_FIO2","IO13","PS9_3_FIO2_IO13"]
["PS9_3_FIO2","IO14","PS9_3_FIO2_IO14","PS9_3_FIOH2"]
["PS9_3_FIO2","IO15","PS9_3_FIO2_IO15"]
["PS9_3_FIOH1","IO00","PS9_3_FIOH1_IO00","PS9_3CH1_FPE1"]
["PS9_3_FIOH1","IO01","PS9_3_FIOH1_IO01","PS9_3CH1_FPE2"]
["PS9_3_FIOH1","IO02","PS9_3_FIOH1_IO02","PS9_3CH1_JPE1"]
["PS9_3_FIOH1","IO03","PS9_3_FIOH1_IO03","PS9_3CH2_JPE1"]
["PS9_3_FIOH1","IO04","PS9_3_FIOH1_IO04","PS9_3CH2_FPE1"]
["PS9_3_FIOH1","IO05","PS9_3_FIOH1_IO05","PS9_3CH2_FPE2"]
["PS9_3_FIOH1","IO06","PS9_3_FIOH1_IO06","PS9_3CH2_S1_PB"]
["PS9_3_FIOH1","IO07","PS9_3_FIOH1_IO07","PS9_3CH2_S1_PB_LT"]
["PS9_3_FIOH1","IO08","PS9_3_FIOH1_IO08","PS9_3DIV1_PX1"]
["PS9_3_FIOH1","IO09","PS9_3_FIOH1_IO09","PS9_3DIV1_PX2"]
["PS9_3_FIOH1","IO10","PS9_3_FIOH1_IO10","PS9_3DIV1_SOL1"]
["PS9_3_FIOH1","IO11","PS9_3_FIOH1_IO11","PS9_3DIV1_SOL2"]
["PS9_3_FIOH1","IO12","PS9_3_FIOH1_IO12","PS9_3DIV2_PX1"]
["PS9_3_FIOH1","IO13","PS9_3_FIOH1_IO13","PS9_3DIV2_PX2"]
["PS9_3_FIOH1","IO14","PS9_3_FIOH1_IO14","PS9_3DIV2_SOL1"]
["PS9_3_FIOH1","IO15","PS9_3_FIOH1_IO15","PS9_3DIV2_SOL2"]
["PS9_3_FIOH2","IO00","PS9_3_FIOH2_IO00","PS9_3CH4_FPE1"]
["PS9_3_FIOH2","IO01","PS9_3_FIOH2_IO01","PS9_3CH4_FPE2"]
["PS9_3_FIOH2","IO02","PS9_3_FIOH2_IO02","PS9_3CH4_JPE1"]
["PS9_3_FIOH2","IO03","PS9_3_FIOH2_IO03","PS9_3CH4_S1_PB"]
["PS9_3_FIOH2","IO04","PS9_3_FIOH2_IO04","PS9_3CH4_S1_PB_LT"]
["PS9_3_FIOH2","IO05","PS9_3_FIOH2_IO05","PS9_3DIV3_PX1"]
["PS9_3_FIOH2","IO06","PS9_3_FIOH2_IO06","PS9_3DIV3_PX2"]
["PS9_3_FIOH2","IO07","PS9_3_FIOH2_IO07","PS9_3DIV3_SOL1"]
["PS9_3_FIOH2","IO08","PS9_3_FIOH2_IO08","PS9_3DIV3_SOL2"]
["PS9_3_FIOH2","IO09","PS9_3_FIOH2_IO09","PS9_3DIV4_PX1"]
["PS9_3_FIOH2","IO10","PS9_3_FIOH2_IO10","PS9_3DIV4_PX2"]
["PS9_3_FIOH2","IO11","PS9_3_FIOH2_IO11","PS9_3DIV4_SOL1"]
["PS9_3_FIOH2","IO12","PS9_3_FIOH2_IO12","PS9_3DIV4_SOL2"]
["PS9_3_FIOH2","IO13","PS9_3_FIOH2_IO13","PS9_4CH_FPE1"]
["PS9_3_FIOH2","IO14","PS9_3_FIOH2_IO14","PS9_3_PS1"]
["PS9_3_FIOH2","IO15","PS9_3_FIOH2_IO15"]
["FL2074_2_VFD1","I0","FL2074_2_VFD1_I0","FL2074_2_DISC"]
["FL2074_2_VFD1","I1","FL2074_2_VFD1_I1"]
["FL2074_2_VFD1","I2","FL2074_2_VFD1_I2","FL2074_2_PE1"]
["FL2074_2_VFD1","I3","FL2074_2_VFD1_I3","FL2074_3CH_PE1"]
["FL2074_2_VFD1","IO0","FL2074_2_VFD1_IO0","FL2074_2_JR2_PB"]
["FL2074_2_VFD1","IO1","FL2074_2_VFD1_IO1","FL2074_2_JR2_PB_LT"]
["FL2074_2_VFD1","SI0","FL2074_2_VFD1_SI0"]
["FL2074_2_VFD1","SI1","FL2074_2_VFD1_SI1"]
["FL2074_2_VFD1","SI2","FL2074_2_VFD1_SI2"]
["FL2074_2_VFD1","SI3","FL2074_2_VFD1_SI3"]
["FL2074_2_VFD1","SO0","FL2074_2_VFD1_SO0","FL2074_BCN2_B"]
["FL2078_2_VFD1","I0","FL2078_2_VFD1_I0","FL2078_2_DISC"]
["FL2078_2_VFD1","I1","FL2078_2_VFD1_I1"]
["FL2078_2_VFD1","I2","FL2078_2_VFD1_I2","FL2078_2_PE1"]
["FL2078_2_VFD1","I3","FL2078_2_VFD1_I3","FL2078_3CH_PE1"]
["FL2078_2_VFD1","IO0","FL2078_2_VFD1_IO0","FL2078_2_JR2_PB"]
["FL2078_2_VFD1","IO1","FL2078_2_VFD1_IO1","FL2078_2_JR2_PB_LT"]
["FL2078_2_VFD1","SI0","FL2078_2_VFD1_SI0"]
["FL2078_2_VFD1","SI1","FL2078_2_VFD1_SI1"]
["FL2078_2_VFD1","SI2","FL2078_2_VFD1_SI2"]
["FL2078_2_VFD1","SI3","FL2078_2_VFD1_SI3"]
["FL2078_2_VFD1","SO0","FL2078_2_VFD1_SO0","FL2078_BCN2_B"]
["FL2086_2_VFD1","I0","FL2086_2_VFD1_I0","FL2086_2_DISC"]
["FL2086_2_VFD1","I1","FL2086_2_VFD1_I1"]
["FL2086_2_VFD1","I2","FL2086_2_VFD1_I2","FL2086_2_PE1"]
["FL2086_2_VFD1","I3","FL2086_2_VFD1_I3","FL2086_3CH_PE1"]
["FL2086_2_VFD1","IO0","FL2086_2_VFD1_IO0","FL2086_2_JR2_PB"]
["FL2086_2_VFD1","IO1","FL2086_2_VFD1_IO1","FL2086_2_JR2_PB_LT"]
["FL2086_2_VFD1","SI0","FL2086_2_VFD1_SI0"]
["FL2086_2_VFD1","SI1","FL2086_2_VFD1_SI1"]
["FL2086_2_VFD1","SI2","FL2086_2_VFD1_SI2"]
["FL2086_2_VFD1","SI3","FL2086_2_VFD1_SI3"]
["FL2086_2_VFD1","SO0","FL2086_2_VFD1_SO0","FL2086_BCN2_B"]
["FL2090_2_VFD1","I0","FL2090_2_VFD1_I0","FL2090_2_DISC"]
["FL2090_2_VFD1","I1","FL2090_2_VFD1_I1"]
["FL2090_2_VFD1","I2","FL2090_2_VFD1_I2","FL2090_2_PE1"]
["FL2090_2_VFD1","I3","FL2090_2_VFD1_I3","FL2090_3CH_PE1"]
["FL2090_2_VFD1","IO0","FL2090_2_VFD1_IO0","FL2090_2_JR2_PB"]
["FL2090_2_VFD1","IO1","FL2090_2_VFD1_IO1","FL2090_2_JR2_PB_LT"]
["FL2090_2_VFD1","SI0","FL2090_2_VFD1_SI0"]
["FL2090_2_VFD1","SI1","FL2090_2_VFD1_SI1"]
["FL2090_2_VFD1","SI2","FL2090_2_VFD1_SI2"]
["FL2090_2_VFD1","SI3","FL2090_2_VFD1_SI3"]
["FL2090_2_VFD1","SO0","FL2090_2_VFD1_SO0","FL2090_BCN2_B"]
["FL2094_2_VFD1","I0","FL2094_2_VFD1_I0","FL2094_2_DISC"]
["FL2094_2_VFD1","I1","FL2094_2_VFD1_I1"]
["FL2094_2_VFD1","I2","FL2094_2_VFD1_I2","FL2094_2_PE1"]
["FL2094_2_VFD1","I3","FL2094_2_VFD1_I3","FL2094_3CH_PE1"]
["FL2094_2_VFD1","IO0","FL2094_2_VFD1_IO0","FL2094_2_JR2_PB"]
["FL2094_2_VFD1","IO1","FL2094_2_VFD1_IO1","FL2094_2_JR2_PB_LT"]
["FL2094_2_VFD1","SI0","FL2094_2_VFD1_SI0"]
["FL2094_2_VFD1","SI1","FL2094_2_VFD1_SI1"]
["FL2094_2_VFD1","SI2","FL2094_2_VFD1_SI2"]
["FL2094_2_VFD1","SI3","FL2094_2_VFD1_SI3"]
["FL2094_2_VFD1","SO0","FL2094_2_VFD1_SO0","FL2094_BCN2_B"]
["FL4066_2_VFD1","I0","FL4066_2_VFD1_I0","FL4066_2_DISC"]
["FL4066_2_VFD1","I1","FL4066_2_VFD1_I1"]
["FL4066_2_VFD1","I2","FL4066_2_VFD1_I2","FL4066_2_PE1"]
["FL4066_2_VFD1","I3","FL4066_2_VFD1_I3","FL4066_3CH_PE1"]
["FL4066_2_VFD1","IO0","FL4066_2_VFD1_IO0","FL4066_2_JR2_PB"]
["FL4066_2_VFD1","IO1","FL4066_2_VFD1_IO1","FL4066_2_JR2_PB_LT"]
["FL4066_2_VFD1","SI0","FL4066_2_VFD1_SI0"]
["FL4066_2_VFD1","SI1","FL4066_2_VFD1_SI1"]
["FL4066_2_VFD1","SI2","FL4066_2_VFD1_SI2"]
["FL4066_2_VFD1","SI3","FL4066_2_VFD1_SI3"]
["FL4066_2_VFD1","SO0","FL4066_2_VFD1_SO0","FL4066_BCN2_B"]
["FL4070_2_VFD1","I0","FL4070_2_VFD1_I0","FL4070_2_DISC"]
["FL4070_2_VFD1","I1","FL4070_2_VFD1_I1"]
["FL4070_2_VFD1","I2","FL4070_2_VFD1_I2","FL4070_2_PE1"]
["FL4070_2_VFD1","I3","FL4070_2_VFD1_I3","FL4070_3CH_PE1"]
["FL4070_2_VFD1","IO0","FL4070_2_VFD1_IO0","FL4070_2_JR2_PB"]
["FL4070_2_VFD1","IO1","FL4070_2_VFD1_IO1","FL4070_2_JR2_PB_LT"]
["FL4070_2_VFD1","SI0","FL4070_2_VFD1_SI0"]
["FL4070_2_VFD1","SI1","FL4070_2_VFD1_SI1"]
["FL4070_2_VFD1","SI2","FL4070_2_VFD1_SI2"]
["FL4070_2_VFD1","SI3","FL4070_2_VFD1_SI3"]
["FL4070_2_VFD1","SO0","FL4070_2_VFD1_SO0","FL4070_BCN2_B"]
["FL4074_2_VFD1","I0","FL4074_2_VFD1_I0","FL4074_2_DISC"]
["FL4074_2_VFD1","I1","FL4074_2_VFD1_I1"]
["FL4074_2_VFD1","I2","FL4074_2_VFD1_I2","FL4074_2_PE1"]
["FL4074_2_VFD1","I3","FL4074_2_VFD1_I3","FL4074_3CH_PE1"]
["FL4074_2_VFD1","IO0","FL4074_2_VFD1_IO0","FL4074_2_JR2_PB"]
["FL4074_2_VFD1","IO1","FL4074_2_VFD1_IO1","FL4074_2_JR2_PB_LT"]
["FL4074_2_VFD1","SI0","FL4074_2_VFD1_SI0"]
["FL4074_2_VFD1","SI1","FL4074_2_VFD1_SI1"]
["FL4074_2_VFD1","SI2","FL4074_2_VFD1_SI2"]
["FL4074_2_VFD1","SI3","FL4074_2_VFD1_SI3"]
["FL4074_2_VFD1","SO0","FL4074_2_VFD1_SO0","FL4074_BCN2_B"]
["FL4078_2_VFD1","I0","FL4078_2_VFD1_I0","FL4078_2_DISC"]
["FL4078_2_VFD1","I1","FL4078_2_VFD1_I1"]
["FL4078_2_VFD1","I2","FL4078_2_VFD1_I2","FL4078_2_PE1"]
["FL4078_2_VFD1","I3","FL4078_2_VFD1_I3","FL4078_3CH_PE1"]
["FL4078_2_VFD1","IO0","FL4078_2_VFD1_IO0","FL4078_2_JR2_PB"]
["FL4078_2_VFD1","IO1","FL4078_2_VFD1_IO1","FL4078_2_JR2_PB_LT"]
["FL4078_2_VFD1","SI0","FL4078_2_VFD1_SI0"]
["FL4078_2_VFD1","SI1","FL4078_2_VFD1_SI1"]
["FL4078_2_VFD1","SI2","FL4078_2_VFD1_SI2"]
["FL4078_2_VFD1","SI3","FL4078_2_VFD1_SI3"]
["FL4078_2_VFD1","SO0","FL4078_2_VFD1_SO0","FL4078_BCN2_B"]
["FL4082_2_VFD1","I0","FL4082_2_VFD1_I0","FL4082_2_DISC"]
["FL4082_2_VFD1","I1","FL4082_2_VFD1_I1"]
["FL4082_2_VFD1","I2","FL4082_2_VFD1_I2","FL4082_2_PE1"]
["FL4082_2_VFD1","I3","FL4082_2_VFD1_I3","FL4082_3CH_PE1"]
["FL4082_2_VFD1","IO0","FL4082_2_VFD1_IO0","FL4082_2_JR2_PB"]
["FL4082_2_VFD1","IO1","FL4082_2_VFD1_IO1","FL4082_2_JR2_PB_LT"]
["FL4082_2_VFD1","SI0","FL4082_2_VFD1_SI0"]
["FL4082_2_VFD1","SI1","FL4082_2_VFD1_SI1"]
["FL4082_2_VFD1","SI2","FL4082_2_VFD1_SI2"]
["FL4082_2_VFD1","SI3","FL4082_2_VFD1_SI3"]
["FL4082_2_VFD1","SO0","FL4082_2_VFD1_SO0","FL4082_BCN2_B"]
["FL2074_FIOH1","IO0",{"$f":"_xlfn.CONCAT(A622,\"_\",B622)","v":"FL2074_FIOH1_IO0"},"FL2074_2_BCN1_A"]
["FL2074_FIOH1","IO1",{"$f":"_xlfn.CONCAT(A623,\"_\",B623)","v":"FL2074_FIOH1_IO1"},"FL2074_2_BCN1_B"]
["FL2074_FIOH1","IO2","FL2074_FIOH1_IO2","FL2074_2_JR1_PB"]
["FL2074_FIOH1","IO3","FL2074_FIOH1_IO3","FL2074_2_JR1_PB_LT"]
["FL2074_FIOH1","IO4","FL2074_FIOH1_IO4","FL2074_1CH_PE1"]
["FL2074_FIOH1","IO5","FL2074_FIOH1_IO5"]
["FL2074_FIOH1","IO6","FL2074_FIOH1_IO6"]
["FL2074_FIOH1","IO7","FL2074_FIOH1_IO7"]
["S012080_FIOH1","IO0","S012080_FIOH1_IO0","FL2078_2_BCN1_A"]
["S012080_FIOH1","IO1","S012080_FIOH1_IO1","FL2078_2_BCN1_B"]
["S012080_FIOH1","IO2","S012080_FIOH1_IO2","FL2078_2_JR1_PB"]
["S012080_FIOH1","IO3","S012080_FIOH1_IO3","FL2078_2_JR1_PB_LT"]
["S012080_FIOH1","IO4","S012080_FIOH1_IO4","FL2078_1CH_PE1"]
["S012080_FIOH1","IO5","S012080_FIOH1_IO5"]
["S012080_FIOH1","IO6","S012080_FIOH1_IO6"]
["S012080_FIOH1","IO7","S012080_FIOH1_IO7"]
["FL2086_FIOH1","IO0","FL2086_FIOH1_IO0","FL2086_2_BCN1_A"]
["FL2086_FIOH2","IO1","FL2086_FIOH2_IO1","FL2086_2_BCN1_B"]
["FL2086_FIOH3","IO2","FL2086_FIOH3_IO2","FL2086_2_JR1_PB"]
["FL2086_FIOH4","IO3","FL2086_FIOH4_IO3","FL2086_2_JR1_PB_LT"]
["FL2086_FIOH5","IO4","FL2086_FIOH5_IO4","FL2086_1CH_PE1"]
["FL2086_FIOH6","IO5","FL2086_FIOH6_IO5"]
["FL2086_FIOH7","IO6","FL2086_FIOH7_IO6"]
["FL2086_FIOH8","IO7","FL2086_FIOH8_IO7"]
["FL2090_FIOH1","IO0","FL2090_FIOH1_IO0","FL2090_2_BCN1_A"]
["FL2090_FIOH1","IO1","FL2090_FIOH1_IO1","FL2090_2_BCN1_B"]
["FL2090_FIOH1","IO2","FL2090_FIOH1_IO2","FL2090_2_JR1_PB"]
["FL2090_FIOH1","IO3","FL2090_FIOH1_IO3","FL2090_2_JR1_PB_LT"]
["FL2090_FIOH1","IO4","FL2090_FIOH1_IO4","FL2090_1CH_PE1"]
["FL2090_FIOH1","IO5","FL2090_FIOH1_IO5"]
["FL2090_FIOH1","IO6","FL2090_FIOH1_IO6"]
["FL2090_FIOH1","IO7","FL2090_FIOH1_IO7"]
["S012096_FIOH1","IO0","S012096_FIOH1_IO0","FL2094_2_BCN1_A"]
["S012096_FIOH1","IO1","S012096_FIOH1_IO1","FL2094_2_BCN1_B"]
["S012096_FIOH1","IO2","S012096_FIOH1_IO2","FL2094_2_JR1_PB"]
["S012096_FIOH1","IO3","S012096_FIOH1_IO3","FL2094_2_JR1_PB_LT"]
["S012096_FIOH1","IO4","S012096_FIOH1_IO4","FL2094_1CH_PE1"]
["S012096_FIOH1","IO5","S012096_FIOH1_IO5"]
["S012096_FIOH1","IO6","S012096_FIOH1_IO6"]
["S012096_FIOH1","IO7","S012096_FIOH1_IO7"]
["FL4066_FIOH1","IO0","FL4066_FIOH1_IO0","FL4066_2_BCN1_A"]
["FL4066_FIOH1","IO1","FL4066_FIOH1_IO1","FL4066_2_BCN1_B"]
["FL4066_FIOH1","IO2","FL4066_FIOH1_IO2","FL4066_2_JR1_PB"]
["FL4066_FIOH1","IO3","FL4066_FIOH1_IO3","FL4066_2_JR1_PB_LT"]
["FL4066_FIOH1","IO4","FL4066_FIOH1_IO4","FL4066_1CH_PE1"]
["FL4066_FIOH1","IO5","FL4066_FIOH1_IO5"]
["FL4066_FIOH1","IO6","FL4066_FIOH1_IO6"]
["FL4066_FIOH1","IO7","FL4066_FIOH1_IO7"]
["S014072_FIOH1","IO0","S014072_FIOH1_IO0","FL4070_2_BCN1_A"]
["S014072_FIOH1","IO1","S014072_FIOH1_IO1","FL4070_2_BCN1_B"]
["S014072_FIOH1","IO2","S014072_FIOH1_IO2","FL4070_2_JR1_PB"]
["S014072_FIOH1","IO3","S014072_FIOH1_IO3","FL4070_2_JR1_PB_LT"]
["S014072_FIOH1","IO4","S014072_FIOH1_IO4","FL4070_1CH_PE1"]
["S014072_FIOH1","IO5","S014072_FIOH1_IO5"]
["S014072_FIOH1","IO6","S014072_FIOH1_IO6"]
["S014072_FIOH1","IO7","S014072_FIOH1_IO7"]
["FL4074_FIOH1","IO0","FL4074_FIOH1_IO0","FL4074_2_BCN1_A"]
["FL4074_FIOH1","IO1","FL4074_FIOH1_IO1","FL4074_2_BCN1_B"]
["FL4074_FIOH1","IO2","FL4074_FIOH1_IO2","FL4074_2_JR1_PB"]
["FL4074_FIOH1","IO3","FL4074_FIOH1_IO3","FL4074_2_JR1_PB_LT"]
["FL4074_FIOH1","IO4","FL4074_FIOH1_IO4","FL4074_1CH_PE1"]
["FL4074_FIOH1","IO5","FL4074_FIOH1_IO5"]
["FL4074_FIOH1","IO6","FL4074_FIOH1_IO6"]
["FL4074_FIOH1","IO7","FL4074_FIOH1_IO7"]
["S014080_FIOH1","IO0","S014080_FIOH1_IO0","FL4078_2_BCN1_A"]
["S014080_FIOH1","IO1",{"$f":"_xlfn.CONCAT(A687,\"_\",B687)","v":"S014080_FIOH1_IO1"},"FL4078_2_BCN1_B"]
["S014080_FIOH1","IO2","S014080_FIOH1_IO2","FL4078_2_JR1_PB"]
["S014080_FIOH1","IO3","S014080_FIOH1_IO3","FL4078_2_JR1_PB_LT"]
["S014080_FIOH1","IO4","S014080_FIOH1_IO4","FL4078_1CH_PE1"]
["S014080_FIOH1","IO5","S014080_FIOH1_IO5"]
["S014080_FIOH1","IO6","S014080_FIOH1_IO6"]
["S014080_FIOH1","IO7","S014080_FIOH1_IO7"]
["FL4082_FIOH1","IO0","FL4082_FIOH1_IO0","FL4082_2_BCN1_A"]
["FL4082_FIOH1","IO1","FL4082_FIOH1_IO1","FL4082_2_BCN1_B"]
["FL4082_FIOH1","IO2","FL4082_FIOH1_IO2","FL4082_2_JR1_PB"]
["FL4082_FIOH1","IO3","FL4082_FIOH1_IO3","FL4082_2_JR1_PB_LT"]
["FL4082_FIOH1","IO4","FL4082_FIOH1_IO4","FL4082_1CH_PE1"]
["FL4082_FIOH1","IO5","FL4082_FIOH1_IO5"]
["FL4082_FIOH1","IO6","FL4082_FIOH1_IO6"]
["FL4082_FIOH1","IO7","FL4082_FIOH1_IO7"]

{"sheet":"NETWORK","index":4,"n_rows":176,"n_cols":17,"rows_kept":176,"cut":false,"hidden":false,"merged":[[0,5,0,8],[40,3,49,3],[40,4,49,4],[50,3,59,3],[50,4,59,4],[2,3,15,3],[2,4,15,4],[0,3,0,4],[16,3,39,3],[16,4,39,4],[60,2,175,2],[163,3,175,3],[163,4,175,4],[118,3,140,3],[118,4,140,4],[141,3,162,3],[141,4,162,4],[60,3,80,3],[60,4,80,4],[81,3,101,3],[81,4,101,4],[102,3,117,3],[102,4,117,4]]}
[null,"MCM05",null,"RING",null,"STAR"]
["SLOT0","1756_L83ES","IP","DPM","IP","VFD NAME","TYPE","VFD PART NUMBER","IP"]
["SLOT1","1756_N2",null,"PRS1_3_DPM1","11.200.1.2","PRS2_1_VFD1",7.5,"35S_6D5_P111","11.200.1.30"]
["SLOT2","1756_EN4TR","11.200.1.1",null,null,"PRS1_2A_VFD1",5,"35S_6D4_P111","11.200.1.31"]
["SLOT3","1756_N2",null,null,null,"PRS1_2B_VFD1",3,"35S_6D3_P101","11.200.1.32"]
["SLOT4","1756_N2",null,null,null,"PRS1_3_VFD1",7.5,"35S_6D5_P111","11.200.1.33"]
["SLOT5","1756_IB16",null,null,null,"PRS1_4_VFD1",3,"35S_6D3_P101","11.200.1.34",null,null,"MCM05",null,"PRS1_3_DPM1",null,"PRS1_3_DPM1",{"$f":"_xlfn.CONCAT(P7,\" CONNECTIONS\")","v":"PRS1_3_DPM1 CONNECTIONS"}]
["SLOT6","1756_OB16E",null,null,null,"PRS1_6_VFD1",2,"35S_6D2_P101","11.200.1.35",null,null,null,null,null,null,"PS8_5_DPM1",{"$f":"_xlfn.CONCAT(P8,\" CONNECTIONS\")","v":"PS8_5_DPM1 CONNECTIONS"}]
["SLOT7","1756_IB16S",null,null,null,"PRS1_7_MDR1","PSU","ITOH",null,null,null,null,null,"VSD_DPM3",null,"FL2086_DPM1","FL2086_DPM1 CONNECTIONS"]
["SLOT8","1756_N2",null,null,null,"PS8_9_VFD1",15,"25B_D024N104","11.200.1.36",null,null,null,null,null,null,"FL4070_DPM1","FL4070_DPM1 CONNECTIONS"]
["SLOT9","1756_N2",null,null,null,"PS8_11_VFD1",10,"35S_6D6_P111","11.200.1.37",null,null,null,null,"VSD_DPM1",null,"VSD_DPM1","VSD_DPM1 CONNECTIONS"]
[null,null,null,null,null,"PRS1_1ACH_FIO1","FIO",{"$f":"VLOOKUP(G12,'[1]PART NUMBER'!$A$2:$B$20,2,FALSE)","v":"5032-8IOLM12DR"},"11.200.1.38",null,null,null,null,null,null,"VSD_DPM2","VSD_DPM2 CONNECTIONS"]
[null,null,null,null,null,"PRS1_1BCH_FIO1","FIO",{"$f":"VLOOKUP(G13,'[1]PART NUMBER'!$A$2:$B$20,2,FALSE)","v":"5032-8IOLM12DR"},"11.200.1.39",null,null,null,null,"VSD_DPM2",null,"VSD_DPM3","VSD_DPM3 CONNECTIONS"]
["DPM COUNT",10,null,null,null,"PRS1_4_FIO1","FIO",{"$f":"VLOOKUP(G14,'[1]PART NUMBER'!$A$2:$B$20,2,FALSE)","v":"5032-8IOLM12DR"},"11.200.1.40",null,null,null,null,null,null,"VSB_DPM1","VSB_DPM1 CONNECTIONS"]
["FIO COUNT",53,null,null,null,"PS8_1_FIO1","FIO",{"$f":"VLOOKUP(G15,'[1]PART NUMBER'!$A$2:$B$20,2,FALSE)","v":"5032-8IOLM12DR"},"11.200.1.41",null,null,null,null,"FL4070_DPM1",null,"VSB_DPM2","VSB_DPM2 CONNECTIONS"]
[null,null,null,null,null,"PS8_1_FIO2","FIO",{"$f":"VLOOKUP(G16,'[1]PART NUMBER'!$A$2:$B$20,2,FALSE)","v":"5032-8IOLM12DR"},"11.200.1.42",null,null,null,null,null,null,"VSB_DPM3","VSB_DPM3 CONNECTIONS"]
[null,null,null,"PS8_5_DPM1","11.200.1.3","ULC1_1_VFD1","TIPPER","PIONEER","11.200.1.43",null,null,null,null,"FL2086_DPM1"]
[null,null,null,null,null,"ULC1_3_VFD1",2,"35S_6D2_P101","11.200.1.44"]
[null,null,null,null,null,"ULC2_1_VFD1","TIPPER","PIONEER","11.200.1.45",null,null,null,null,"VSB_DPM3"]
[null,null,null,null,null,"ULC2_3_VFD1",2,"35S_6D2_P101","11.200.1.46"]
[null,null,null,null,null,"ULC3_1_VFD1","TIPPER","PIONEER","11.200.1.47",null,null,null,null,"VSB_DPM1"]
[null,null,null,null,null,"ULC3_3_VFD1",2,"35S_6D2_P101","11.200.1.48"]
[null,null,null,null,null,"ULC4_1_EX1","TIPPER","PIONEER","11.200.1.49",null,null,null,null,"VSB_DPM2"]
[null,null,null,null,null,"ULC4_3_VFD1",2,"35S_6D2_P101","11.200.1.50"]
[null,null,null,null,null,"PS8_1_VFD1",7.5,"35S_6D5_P111","11.200.1.51",null,null,null,null,"PS8_5_DPM1"]
[null,null,null,null,null,"PS8_2_VFD1",10,"35S_6D6_P111","11.200.1.52"]
[null,null,null,null,null,"PS8_4_VFD1",15,"25B_D024N104","11.200.1.53"]
[null,null,null,null,null,"PS8_5_VFD1",15,"25B_D024N104","11.200.1.54"]
[null,null,null,null,null,"PS8_6_VFD1",5,"35S_6D4_P111","11.200.1.55"]
[null,null,null,null,null,"PS8_8_VFD1",7.5,"35S_6D5_P111","11.200.1.56"]
[null,null,null,null,null,"PS9_2_VFD1",7.5,"35S_6D5_P111","11.200.1.57"]
[null,null,null,null,null,"PS9_3_VFD1",7.5,"35S_6D5_P111","11.200.1.58"]
[null,null,null,null,null,"PS8_11_FIO1","FIO",{"$f":"VLOOKUP(G33,'[1]PART NUMBER'!$A$2:$B$20,2,FALSE)","v":"5032-8IOLM12DR"},"11.200.1.59"]
[null,null,null,null,null,"PS8_11_FIO2","FIO",{"$f":"VLOOKUP(G34,'[1]PART NUMBER'!$A$2:$B$20,2,FALSE)","v":"5032-8IOLM12DR"},"11.200.1.60"]
[null,null,null,null,null,"PS8_4_SIO1","SIO","0980SSL3131-121-007D-202","11.200.1.61"]
[null,null,null,null,null,"PS8_5_FIO1","FIO",{"$f":"VLOOKUP(G36,'[1]PART NUMBER'!$A$2:$B$20,2,FALSE)","v":"5032-8IOLM12DR"},"11.200.1.62"]
[null,null,null,null,null,"PS9_3_FIO1","FIO",{"$f":"VLOOKUP(G37,'[1]PART NUMBER'!$A$2:$B$20,2,FALSE)","v":"5032-8IOLM12DR"},"11.200.1.63"]
[null,null,null,null,null,"PS9_3_FIO2","FIO",{"$f":"VLOOKUP(G38,'[1]PART NUMBER'!$A$2:$B$20,2,FALSE)","v":"5032-8IOLM12DR"},"11.200.1.64"]
[null,null,null,null,null,"PS8_9_FIO1","FIO",{"$f":"VLOOKUP(G39,'[1]PART NUMBER'!$A$2:$B$20,2,FALSE)","v":"5032-8IOLM12DR"},"11.200.1.196","ADDED","2025-05-19"]
[null,null,null,null,null,"PDP11_FIO1","FIO",{"$f":"VLOOKUP(G40,'[1]PART NUMBER'!$A$2:$B$20,2,FALSE)","v":"5032-8IOLM12DR"},"11.200.1.197","ADDED ","2025-05-25"]
[null,null,null,"FL2086_DPM1","11.200.1.4","FL2074_2_VFD1",5,"35S_6D4_P111","11.200.1.65"]
[null,null,null,null,null,"FL2074_4_EX1","EXTENDO","CALJAN","11.200.1.66"]
[null,null,null,null,null,"FL2078_2_VFD1",5,"35S_6D4_P111","11.200.1.67"]
[null,null,null,null,null,"FL2078_4_EX1","EXTENDO","CALJAN","11.200.1.68"]
[null,null,null,null,null,"FL2086_2_VFD1",5,"35S_6D4_P111","11.200.1.69"]
[null,null,null,null,null,"FL2086_4_EX1","EXTENDO","CALJAN","11.200.1.70"]
[null,null,null,null,null,"FL2090_2_VFD1",5,"35S_6D4_P111","11.200.1.71"]
[null,null,null,null,null,"FL2090_4_EX1","EXTENDO","CALJAN","11.200.1.72"]
[null,null,null,null,null,"FL2094_2_VFD1",5,"35S_6D4_P111","11.200.1.73"]
[null,null,null,null,null,"FL2094_4_EX1","EXTENDO","CALJAN","11.200.1.74"]
[null,null,null,"FL4070_DPM1","11.200.1.5","FL4082_2_VFD1",5,"35S_6D4_P111","11.200.1.75"]
[null,null,null,null,null,"FL4082_4_EX1","EXTENDO","CALJAN","11.200.1.76"]
[null,null,null,null,null,"FL4078_2_VFD1",5,"35S_6D4_P111","11.200.1.77"]
[null,null,null,null,null,"FL4078_4_EX1","EXTENDO","CALJAN","11.200.1.78"]
[null,null,null,null,null,"FL4074_2_VFD1",5,"35S_6D4_P111","11.200.1.79"]
[null,null,null,null,null,"FL4074_4_EX1","EXTENDO","CALJAN","11.200.1.80"]
[null,null,null,null,null,"FL4070_2_VFD1",5,"35S_6D4_P111","11.200.1.81"]
[null,null,null,null,null,"FL4070_4_EX1","EXTENDO","CALJAN","11.200.1.82"]
[null,null,null,null,null,"FL4066_2_VFD1",5,"35S_6D4_P111","11.200.1.83"]
[null,null,null,null,null,"FL4066_4_EX1","EXTENDO","CALJAN","11.200.1.84"]
[null,null,"Updated Part Number 5-28","VSD_DPM1","11.200.1.6","S014003_ZMX1","ZMX","ZMX-3DE2500HF-Q7-AMZCHD","11.200.1.85"]
[null,null,null,null,null,"S014005_ZMX1","ZMX","ZMX-3DE2500HF-Q7-AMZCHD","11.200.1.86"]
[null,null,null,null,null,"S014007_ZMX1","ZMX","ZMX-3DE2500HF-Q7-AMZCHD","11.200.1.87"]
[null,null,null,null,null,"S014009_ZMX1","ZMX","ZMX-3DE2500HF-Q7-AMZCHD","11.200.1.88"]
[null,null,null,null,null,"S014011_ZMX1","ZMX","ZMX-3DE2500HF-Q7-AMZCHD","11.200.1.89"]
[null,null,null,null,null,"S014013_ZMX1","ZMX","ZMX-3DE2500HF-Q7-AMZCHD","11.200.1.90"]
[null,null,null,null,null,"S014015_ZMX1","ZMX","ZMX-3DE2500HF-Q7-AMZCHD","11.200.1.91"]
[null,null,null,null,null,"S014017_ZMX1","ZMX","ZMX-3DE2500HF-Q7-AMZCHD","11.200.1.92"]
[null,null,null,null,null,"S014021_ZMX1","ZMX","ZMX-3DE2500HF-Q7-AMZCHD","11.200.1.93"]
[null,null,null,null,null,"S014023_ZMX1","ZMX","ZMX-3DE2500HF-Q7-AMZCHD","11.200.1.94"]
[null,null,null,null,null,"S014025_ZMX1","ZMX","ZMX-3DE2500HF-Q7-AMZCHD","11.200.1.95"]
[null,null,null,null,null,"S014029_ZMX1","ZMX","ZMX-3DE2500HF-Q7-AMZCHD","11.200.1.96"]
[null,null,null,null,null,"S014031_ZMX1","ZMX","ZMX-3DE2500HF-Q7-AMZCHD","11.200.1.97"]
[null,null,null,null,null,"VSD_DPM1_FIO1","FIO","5032-8IOLM12DR","11.200.1.98"]
[null,null,null,null,null,"VSD_DPM1_FIO2","FIO","5032-8IOLM12DR","11.200.1.99"]
[null,null,null,null,null,"VSD_DPM1_FIO3","FIO","5032-8IOLM12DR","11.200.1.100"]
[null,null,null,null,null,"VSD_DPM1_FIO4","FIO","5032-8IOLM12DR","11.200.1.101"]
[null,null,null,null,null,"VSD_DPM1_FIO5","FIO","5032-8IOLM12DR","11.200.1.102"]
[null,null,null,null,null,"VSD_DPM1_FIO6","FIO","5032-8IOLM12DR","11.200.1.103"]
[null,null,null,null,null,"VSD_DPM1_FIO7","FIO","5032-8IOLM12DR","11.200.1.104"]
[null,null,null,null,null,"VSD_DPM1_FIO8","FIO","5032-8IOLM12DR","11.200.1.105"]
[null,null,null,"VSD_DPM2","11.200.1.7","S014037_ZMX1","ZMX","ZMX-3DE2500HF-Q7-AMZCHD","11.200.1.106"]
[null,null,null,null,null,"S014039_ZMX1","ZMX","ZMX-3DE2500HF-Q7-AMZCHD","11.200.1.107"]
[null,null,null,null,null,"S014041_ZMX1","ZMX","ZMX-3DE2500HF-Q7-AMZCHD","11.200.1.108"]
[null,null,null,null,null,"S014043_ZMX1","ZMX","ZMX-3DE2500HF-Q7-AMZCHD","11.200.1.109"]
[null,null,null,null,null,"S014045_ZMX1","ZMX","ZMX-3DE2500HF-Q7-AMZCHD","11.200.1.110"]
[null,null,null,null,null,"S014047_ZMX1","ZMX","ZMX-3DE2500HF-Q7-AMZCHD","11.200.1.111"]
[null,null,null,null,null,"S014049_ZMX1","ZMX","ZMX-3DE2500HF-Q7-AMZCHD","11.200.1.112"]
[null,null,null,null,null,"S014053_ZMX1","ZMX","ZMX-3DE2500HF-Q7-AMZCHD","11.200.1.113"]
[null,null,null,null,null,"S014055_ZMX1","ZMX","ZMX-3DE2500HF-Q7-AMZCHD","11.200.1.114"]
[null,null,null,null,null,"S014057_ZMX1","ZMX","ZMX-3DE2500HF-Q7-AMZCHD","11.200.1.115"]
[null,null,null,null,null,"S014061_ZMX1","ZMX","ZMX-3DE2500HF-Q7-AMZCHD","11.200.1.116"]
[null,null,null,null,null,"S014063_ZMX1","ZMX","ZMX-3DE2500HF-Q7-AMZCHD","11.200.1.117"]
[null,null,null,null,null,"VSD_DPM2_FIO1","FIO","5032-8IOLM12DR","11.200.1.118"]
[null,null,null,null,null,"VSD_DPM2_FIO2","FIO","5032-8IOLM12DR","11.200.1.119"]
[null,null,null,null,null,"VSD_DPM2_FIO3","FIO","5032-8IOLM12DR","11.200.1.120"]
[null,null,null,null,null,"VSD_DPM2_FIO4","FIO","5032-8IOLM12DR","11.200.1.121"]
[null,null,null,null,null,"VSD_DPM2_FIO5","FIO","5032-8IOLM12DR","11.200.1.122"]
[null,null,null,null,null,"VSD_DPM2_FIO6","FIO","5032-8IOLM12DR","11.200.1.123"]
[null,null,null,null,null,"VSD_DPM2_FIO7","FIO","5032-8IOLM12DR","11.200.1.124"]
[null,null,null,null,null,"VSD_DPM2_FIO8","FIO","5032-8IOLM12DR","11.200.1.125"]
[null,null,null,null,null,"S014033_ZMX1","ZMX","ZMX-3DE2500HF-Q7-AMZCHD","11.200.1.202","ADDED","2025-06-13"]
[null,null,null,"VSD_DPM3","11.200.1.8","S014065_ZMX1","ZMX","ZMX-3DE2500HF-Q7-AMZCHD","11.200.1.126"]
[null,null,null,null,null,"S014069_ZMX1","ZMX","ZMX-3DE2500HF-Q7-AMZCHD","11.200.1.127"]
[null,null,null,null,null,"S014071_ZMX1","ZMX","ZMX-3DE2500HF-Q7-AMZCHD","11.200.1.128"]
[null,null,null,null,null,"S014073_ZMX1","ZMX","ZMX-3DE2500HF-Q7-AMZCHD","11.200.1.129"]
[null,null,null,null,null,"S014077_ZMX1","ZMX","ZMX-3DE2500HF-Q7-AMZCHD","11.200.1.130"]
[null,null,null,null,null,"S014079_ZMX1","ZMX","ZMX-3DE2500HF-Q7-AMZCHD","11.200.1.131"]
[null,null,null,null,null,"S014081_ZMX1","ZMX","ZMX-3DE2500HF-Q7-AMZCHD","11.200.1.132"]
[null,null,null,null,null,"VSD_DPM3_FIO1","FIO","5032-8IOLM12DR","11.200.1.133"]
[null,null,null,null,null,"VSD_DPM3_FIO2","FIO","5032-8IOLM12DR","11.200.1.134"]
[null,null,null,null,null,"VSD_DPM3_FIO3","FIO","5032-8IOLM12DR","11.200.1.135"]
[null,null,null,null,null,"VSD_DPM3_FIO4","FIO","5032-8IOLM12DR","11.200.1.136"]
[null,null,null,null,null,"VSD_DPM3_FIO5","FIO","5032-8IOLM12DR","11.200.1.137"]
[null,null,null,null,null,"VSD_DPM3_FIO6","FIO","5032-8IOLM12DR","11.200.1.138"]
[null,null,null,null,null,"PDP14_FIO1","FIO","5032-8IOLM12DR","11.200.1.199","ADDED ","2025-05-25"]
[null,null,null,null,null,"PDP14_PMM1","PMM","1420-V2-ENT","11.200.1.200","ADDED ","2025-05-25"]
[null,null,null,null,null,"S014075_ZMX1","ZMX","ZMX-3DE2500HF-Q7-AMZCHD","11.200.1.201","ADDED","2025-06-12"]
[null,null,null,"VSB_DPM1","11.200.1.9","S012001_ZMX1","ZMX","ZMX-3DE2500HF-Q7-AMZCHD","11.200.1.139"]
[null,null,null,null,null,"S012003_ZMX1","ZMX","ZMX-3DE2500HF-Q7-AMZCHD","11.200.1.140"]
[null,null,null,null,null,"S012005_ZMX1","ZMX","ZMX-3DE2500HF-Q7-AMZCHD","11.200.1.141"]
[null,null,null,null,null,"S012007_ZMX1","ZMX","ZMX-3DE2500HF-Q7-AMZCHD","11.200.1.142"]
[null,null,null,null,null,"S012009_ZMX1","ZMX","ZMX-3DE2500HF-Q7-AMZCHD","11.200.1.143"]
[null,null,null,null,null,"S012011_ZMX1","ZMX","ZMX-3DE2500HF-Q7-AMZCHD","11.200.1.144"]
[null,null,null,null,null,"S012013_ZMX1","ZMX","ZMX-3DE2500HF-Q7-AMZCHD","11.200.1.145"]
[null,null,null,null,null,"S012015_ZMX1","ZMX","ZMX-3DE2500HF-Q7-AMZCHD","11.200.1.146"]
[null,null,null,null,null,"S012019_ZMX1","ZMX","ZMX-3DE2500HF-Q7-AMZCHD","11.200.1.147"]
[null,null,null,null,null,"S012021_ZMX1","ZMX","ZMX-3DE2500HF-Q7-AMZCHD","11.200.1.148"]
[null,null,null,null,null,"S012023_ZMX1","ZMX","ZMX-3DE2500HF-Q7-AMZCHD","11.200.1.149"]
[null,null,null,null,null,"S012025_ZMX1","ZMX","ZMX-3DE2500HF-Q7-AMZCHD","11.200.1.150"]
[null,null,null,null,null,"S012027_ZMX1","ZMX","ZMX-3DE2500HF-Q7-AMZCHD","11.200.1.151"]
[null,null,null,null,null,"S012029_ZMX1","ZMX","ZMX-3DE2500HF-Q7-AMZCHD","11.200.1.152"]
[null,null,null,null,null,"S012031_ZMX1","ZMX","ZMX-3DE2500HF-Q7-AMZCHD","11.200.1.153"]
[null,null,null,null,null,"VSB_DPM1_FIO1","FIO","5032-8IOLM12DR","11.200.1.154"]
[null,null,null,null,null,"VSB_DPM1_FIO2","FIO","5032-8IOLM12DR","11.200.1.155"]
[null,null,null,null,null,"VSB_DPM1_FIO3","FIO","5032-8IOLM12DR","11.200.1.156"]
[null,null,null,null,null,"VSB_DPM1_FIO4","FIO","5032-8IOLM12DR","11.200.1.157"]
[null,null,null,null,null,"VSB_DPM1_FIO5","FIO","5032-8IOLM12DR","11.200.1.158"]
[null,null,null,null,null,"VSB_DPM1_FIO6","FIO","5032-8IOLM12DR","11.200.1.159"]
[null,null,null,null,null,"VSB_DPM1_FIO7","FIO","5032-8IOLM12DR","11.200.1.160"]
[null,null,null,null,null,"VSB_DPM1_FIO8","FIO","5032-8IOLM12DR","11.200.1.161"]
[null,null,null,"VSB_DPM2","11.200.1.10","S012037_ZMX1","ZMX","ZMX-3DE2500HF-Q7-AMZCHD","11.200.1.162"]
[null,null,null,null,null,"S012039_ZMX1","ZMX","ZMX-3DE2500HF-Q7-AMZCHD","11.200.1.163"]
[null,null,null,null,null,"S012041_ZMX1","ZMX","ZMX-3DE2500HF-Q7-AMZCHD","11.200.1.164"]
[null,null,null,null,null,"S012043_ZMX1","ZMX","ZMX-3DE2500HF-Q7-AMZCHD","11.200.1.165"]
[null,null,null,null,null,"S012045_ZMX1","ZMX","ZMX-3DE2500HF-Q7-AMZCHD","11.200.1.166"]
[null,null,null,null,null,"S012047_ZMX1","ZMX","ZMX-3DE2500HF-Q7-AMZCHD","11.200.1.167"]
[null,null,null,null,null,"S012049_ZMX1","ZMX","ZMX-3DE2500HF-Q7-AMZCHD","11.200.1.168"]
[null,null,null,null,null,"S012053_ZMX1","ZMX","ZMX-3DE2500HF-Q7-AMZCHD","11.200.1.169"]
[null,null,null,null,null,"S012055_ZMX1","ZMX","ZMX-3DE2500HF-Q7-AMZCHD","11.200.1.170"]
[null,null,null,null,null,"S012057_ZMX1","ZMX","ZMX-3DE2500HF-Q7-AMZCHD","11.200.1.171"]
[null,null,null,null,null,"S012059_ZMX1","ZMX","ZMX-3DE2500HF-Q7-AMZCHD","11.200.1.172"]
[null,null,null,null,null,"S012061_ZMX1","ZMX","ZMX-3DE2500HF-Q7-AMZCHD","11.200.1.173"]
[null,null,null,null,null,"S012063_ZMX1","ZMX","ZMX-3DE2500HF-Q7-AMZCHD","11.200.1.174"]
[null,null,null,null,null,"VSB_DPM2_FIO1","FIO","5032-8IOLM12DR","11.200.1.175"]
[null,null,null,null,null,"VSB_DPM2_FIO2","FIO","5032-8IOLM12DR","11.200.1.176"]
[null,null,null,null,null,"VSB_DPM2_FIO3","FIO","5032-8IOLM12DR","11.200.1.177"]
[null,null,null,null,null,"VSB_DPM2_FIO4","FIO","5032-8IOLM12DR","11.200.1.178"]
[null,null,null,null,null,"VSB_DPM2_FIO5","FIO","5032-8IOLM12DR","11.200.1.179"]
[null,null,null,null,null,"VSB_DPM2_FIO6","FIO","5032-8IOLM12DR","11.200.1.180"]
[null,null,null,null,null,"VSB_DPM2_FIO7","FIO","5032-8IOLM12DR","11.200.1.181"]
[null,null,null,null,null,"VSB_DPM2_FIO8","FIO","5032-8IOLM12DR","11.200.1.182"]
[null,null,null,null,null,"PDP11_PMM1","PMM","1420-V2-ENT","11.200.1.198","ADDED ","2025-05-25"]
[null,null,null,"VSB_DPM3","11.200.1.11","S012065_ZMX1","ZMX","ZMX-3DE2500HF-Q7-AMZCHD","11.200.1.183"]
[null,null,null,null,null,"S012069_ZMX1","ZMX","ZMX-3DE2500HF-Q7-AMZCHD","11.200.1.184"]
[null,null,null,null,null,"S012071_ZMX1","ZMX","ZMX-3DE2500HF-Q7-AMZCHD","11.200.1.185"]
[null,null,null,null,null,"S012073_ZMX1","ZMX","ZMX-3DE2500HF-Q7-AMZCHD","11.200.1.186"]
[null,null,null,null,null,"S012075_ZMX1","ZMX","ZMX-3DE2500HF-Q7-AMZCHD","11.200.1.187"]
[null,null,null,null,null,"S012077_ZMX1","ZMX","ZMX-3DE2500HF-Q7-AMZCHD","11.200.1.188"]
[null,null,null,null,null,"S012079_ZMX1","ZMX","ZMX-3DE2500HF-Q7-AMZCHD","11.200.1.189"]
[null,null,null,null,null,"VSB_DPM3_FIO1","FIO","5032-8IOLM12DR","11.200.1.190"]
[null,null,null,null,null,"VSB_DPM3_FIO2","FIO","5032-8IOLM12DR","11.200.1.191"]
[null,null,null,null,null,"VSB_DPM3_FIO3","FIO","5032-8IOLM12DR","11.200.1.192"]
[null,null,null,null,null,"VSB_DPM3_FIO4","FIO","5032-8IOLM12DR","11.200.1.193"]
[null,null,null,null,null,"VSB_DPM3_FIO6","FIO","5032-8IOLM12DR","11.200.1.194"]
[null,null,null,null,null,"VSB_DPM3_FIO8","FIO","5032-8IOLM12DR","11.200.1.195"]

{"sheet":"Part Number","index":5,"n_rows":13,"n_cols":2,"rows_kept":13,"cut":false,"hidden":false,"merged":[]}
["HP","PART NUMBER"]
["2HP","35S-6D2-P101"]
["3HP","35S-6D3-P101"]
["5HP","35S-6D4-P111"]
["7.5HP","35S-6D5-P111"]
["10HP","35S-6D6-P111"]
["15HP","25B-D024N104"]
["20HP","25B-D030N104"]
["30HP","25B-D043N114 "]
["EXTENDO","CALJAN"]
["TIPPER","PIONEER"]
["ZMX","ZMX-3DE2500HF-Q7-AMZCHD"]
["FIO","5032-8IOLM12DR"]

{"sheet":"MCM05_DESC","index":6,"n_rows":701,"n_cols":19,"rows_kept":701,"cut":false,"hidden":false,"merged":[[56,8,60,8],[1,8,5,8],[6,8,10,8],[11,8,15,8],[16,8,20,8],[21,8,25,8],[26,8,30,8],[31,8,35,8],[36,8,40,8],[41,8,45,8],[46,8,50,8],[51,8,55,8],[61,8,65,8],[66,8,70,8],[71,8,75,8],[76,8,80,8],[81,8,85,8]]}
["TAGNAME","ADDR","TERM","TERMDESC","DESCA","DESCB",null,"CONTROLLERS"]
["PRS1_2A_VFD1","PRS1_2A_VFD1_I0","I0",null,"PRS1_2A_VFD1_DISC","DISCONNECT AUX",null,"PRS1_2A_VFD1",600,{"$f":"_xlfn.XLOOKUP(H2,NETWORK!$F$3:$F$176,NETWORK!$H$3:$H$176,\"not found\")","v":"35S_6D4_P111"},null,null,{"$f":"_xlfn.CONCAT(H2,\"/\",H3,\"/\",H4,\"/\",H5)","v":"PRS1_2A_VFD1/PRS1_2B_VFD1/PRS1_3_VFD1/PRS1_4_VFD1"},null,null,null,null,null,"PRS1_2A_VFD1/PRS1_2B_VFD1/PRS1_3_VFD1/PRS1_4_VFD1"]
["PRS1_2A_VFD1","PRS1_2A_VFD1_I1","I1",null,"SPARE",null,null,"PRS1_2B_VFD1",null,{"$f":"_xlfn.XLOOKUP(H3,NETWORK!$F$3:$F$176,NETWORK!$H$3:$H$176,\"not found\")","v":"35S_6D3_P101"},null,null,null,null,null,null,null,null,"PRS1_6_VFD1/PRS2_1_VFD1/PS8_1_VFD1/PS8_11_VFD1"]
["PRS1_2A_VFD1","PRS1_2A_VFD1_I2","I2",null,"PRS1_2A_JPE1","JAM PHOTOEYE",null,"PRS1_3_VFD1",null,{"$f":"_xlfn.XLOOKUP(H4,NETWORK!$F$3:$F$176,NETWORK!$H$3:$H$176,\"not found\")","v":"35S_6D5_P111"},null,null,null,null,null,null,null,null,"PS8_2_VFD1/PS8_4_VFD1/PS8_5_VFD1/PS8_6_VFD1"]
["PRS1_2A_VFD1","PRS1_2A_VFD1_I3","I3",null,"PRS1_2A_JPE2","JAM PHOTOEYE",null,"PRS1_4_VFD1",null,{"$f":"_xlfn.XLOOKUP(H5,NETWORK!$F$3:$F$176,NETWORK!$H$3:$H$176,\"not found\")","v":"35S_6D3_P101"},null,null,null,null,null,null,null,null,"PS8_8_VFD1/PS8_9_VFD1/PS9_2_VFD1/PS9_3_VFD1"]
["PRS1_2A_VFD1","PRS1_2A_VFD1_IO0","IO0",null,"SPARE",null,null,null,null,{"$f":"_xlfn.XLOOKUP(H6,NETWORK!$F$3:$F$176,NETWORK!$H$3:$H$176,\"not found\")","v":"not found"},null,null,null,null,null,null,null,null,"ULC1_3_VFD1/ULC2_3_VFD1/ULC3_3_VFD1/ULC4_3_VFD1"]
["PRS1_2A_VFD1","PRS1_2A_VFD1_IO1","IO1",null,"SPARE",null,null,"PRS1_6_VFD1",601,{"$f":"_xlfn.XLOOKUP(H7,NETWORK!$F$3:$F$176,NETWORK!$H$3:$H$176,\"not found\")","v":"35S_6D2_P101"},null,null,{"$f":"_xlfn.CONCAT(H7,\"/\",H8,\"/\",H9,\"/\",H10)","v":"PRS1_6_VFD1/PRS2_1_VFD1/PS8_1_VFD1/PS8_11_VFD1"},null,null,null,null,null,"PRS1_1ACH_FIO1/PRS1_1BCH_FIO1/PRS1_4_FIO1/PS8_1_FIO1"]
["PRS1_2A_VFD1","PRS1_2A_VFD1_SI0","SI0",null,"SPARE",null,null,"PRS2_1_VFD1",null,{"$f":"_xlfn.XLOOKUP(H8,NETWORK!$F$3:$F$176,NETWORK!$H$3:$H$176,\"not found\")","v":"35S_6D5_P111"},null,null,null,null,null,null,null,null,"PS8_1_FIO2/PS8_1_FIOH1/PS8_1_FIOH2/PS8_1_FIOH3"]
["PRS1_2A_VFD1","PRS1_2A_VFD1_SI1","SI1",null,"SPARE",null,null,"PS8_1_VFD1",null,{"$f":"_xlfn.XLOOKUP(H9,NETWORK!$F$3:$F$176,NETWORK!$H$3:$H$176,\"not found\")","v":"35S_6D5_P111"},null,null,null,null,null,null,null,null,"PS8_4_SIO1/PS8_4_FIOH1/PS8_5_FIO1/PS8_9_FIO1"]
["PRS1_2A_VFD1","PRS1_2A_VFD1_SI2","SI2",null,"SPARE",null,null,"PS8_11_VFD1",null,{"$f":"_xlfn.XLOOKUP(H10,NETWORK!$F$3:$F$176,NETWORK!$H$3:$H$176,\"not found\")","v":"35S_6D6_P111"},null,null,null,null,null,null,null,null,"PS8_11_FIO1/PS8_11_FIO2/PS8_11_FIOH1/PS8_11_FIOH2"]
["PRS1_2A_VFD1","PRS1_2A_VFD1_SI3","SI3",null,"SPARE",null,null,null,null,{"$f":"_xlfn.XLOOKUP(H11,NETWORK!$F$3:$F$176,NETWORK!$H$3:$H$176,\"not found\")","v":"not found"},null,null,null,null,null,null,null,null,"PS9_3_FIO1/PS9_3_FIO2/PS9_3_FIOH1/PS9_3_FIOH2"]
["PRS1_2A_VFD1","PRS1_2A_VFD1_SO0","SO0",null,"SPARE",null,null,"PS8_2_VFD1",602,{"$f":"_xlfn.XLOOKUP(H12,NETWORK!$F$3:$F$176,NETWORK!$H$3:$H$176,\"not found\")","v":"35S_6D6_P111"},null,null,{"$f":"_xlfn.CONCAT(H12,\"/\",H13,\"/\",H14,\"/\",H15)","v":"PS8_2_VFD1/PS8_4_VFD1/PS8_5_VFD1/PS8_6_VFD1"},null,null,null,null,null,"FL2074_2_VFD1/FL2078_2_VFD1/FL2086_2_VFD1/FL2090_2_VFD1"]
["PRS1_2B_VFD1","PRS1_2B_VFD1_I0","I0",null,"PRS1_2B_VFD1_DISC","DISCONNECT AUX",null,"PS8_4_VFD1",null,{"$f":"_xlfn.XLOOKUP(H13,NETWORK!$F$3:$F$176,NETWORK!$H$3:$H$176,\"not found\")","v":"25B_D024N104"},null,null,null,null,null,null,null,null,"FL2094_2_VFD1/FL4066_2_VFD1/FL4070_2_VFD1/FL4074_2_VFD1"]
["PRS1_2B_VFD1","PRS1_2B_VFD1_I1","I1",null,"SPARE",null,null,"PS8_5_VFD1",null,{"$f":"_xlfn.XLOOKUP(H14,NETWORK!$F$3:$F$176,NETWORK!$H$3:$H$176,\"not found\")","v":"25B_D024N104"},null,null,null,null,null,null,null,null,"FL4078_2_VFD1/FL4082_2_VFD1/FL2074_FIOH1/S012080_FIOH1"]
["PRS1_2B_VFD1","PRS1_2B_VFD1_I2","I2",null,"PRS1_2B_JPE1","JAM PHOTOEYE",null,"PS8_6_VFD1",null,{"$f":"_xlfn.XLOOKUP(H15,NETWORK!$F$3:$F$176,NETWORK!$H$3:$H$176,\"not found\")","v":"35S_6D4_P111"},null,null,null,null,null,null,null,null,"FL2086_FIOH1/FL2090_FIOH1/S012096_FIOH1/FL4082_FIOH1"]
["PRS1_2B_VFD1","PRS1_2B_VFD1_I3","I3",null,"PRS1_2B_JPE2","JAM PHOTOEYE",null,null,null,{"$f":"_xlfn.XLOOKUP(H16,NETWORK!$F$3:$F$176,NETWORK!$H$3:$H$176,\"not found\")","v":"not found"},null,null,null,null,null,null,null,null,"S014080_FIOH1/FL4074_FIOH1/FL4072_FIOH1/FL4066_FIOH1"]
["PRS1_2B_VFD1","PRS1_2B_VFD1_IO0","IO0",null,"SPARE",null,null,"PS8_8_VFD1",603,{"$f":"_xlfn.XLOOKUP(H17,NETWORK!$F$3:$F$176,NETWORK!$H$3:$H$176,\"not found\")","v":"35S_6D5_P111"},null,null,{"$f":"_xlfn.CONCAT(H17,\"/\",H18,\"/\",H19,\"/\",H20)","v":"PS8_8_VFD1/PS8_9_VFD1/PS9_2_VFD1/PS9_3_VFD1"}]
["PRS1_2B_VFD1","PRS1_2B_VFD1_IO1","IO1",null,"SPARE",null,null,"PS8_9_VFD1",null,{"$f":"_xlfn.XLOOKUP(H18,NETWORK!$F$3:$F$176,NETWORK!$H$3:$H$176,\"not found\")","v":"25B_D024N104"}]
["PRS1_2B_VFD1","PRS1_2B_VFD1_SI0","SI0",null,"SPARE",null,null,"PS9_2_VFD1",null,{"$f":"_xlfn.XLOOKUP(H19,NETWORK!$F$3:$F$176,NETWORK!$H$3:$H$176,\"not found\")","v":"35S_6D5_P111"}]
["PRS1_2B_VFD1","PRS1_2B_VFD1_SI1","SI1",null,"SPARE",null,null,"PS9_3_VFD1",null,{"$f":"_xlfn.XLOOKUP(H20,NETWORK!$F$3:$F$176,NETWORK!$H$3:$H$176,\"not found\")","v":"35S_6D5_P111"}]
["PRS1_2B_VFD1","PRS1_2B_VFD1_SI2","SI2",null,"SPARE",null,null,null,null,{"$f":"_xlfn.XLOOKUP(H21,NETWORK!$F$3:$F$176,NETWORK!$H$3:$H$176,\"not found\")","v":"not found"}]
["PRS1_2B_VFD1","PRS1_2B_VFD1_SI3","SI3",null,"SPARE",null,null,"ULC1_3_VFD1",604,{"$f":"_xlfn.XLOOKUP(H22,NETWORK!$F$3:$F$176,NETWORK!$H$3:$H$176,\"not found\")","v":"35S_6D2_P101"},null,null,{"$f":"_xlfn.CONCAT(H22,\"/\",H23,\"/\",H24,\"/\",H25)","v":"ULC1_3_VFD1/ULC2_3_VFD1/ULC3_3_VFD1/ULC4_3_VFD1"}]
["PRS1_2B_VFD1","PRS1_2B_VFD1_SO0","SO0",null,"SPARE",null,null,"ULC2_3_VFD1",null,{"$f":"_xlfn.XLOOKUP(H23,NETWORK!$F$3:$F$176,NETWORK!$H$3:$H$176,\"not found\")","v":"35S_6D2_P101"}]
["PRS1_3_VFD1","PRS1_3_VFD1_I0","I0",null,"PRS1_3_VFD1_DISC","DISCONNECT AUX",null,"ULC3_3_VFD1",null,{"$f":"_xlfn.XLOOKUP(H24,NETWORK!$F$3:$F$176,NETWORK!$H$3:$H$176,\"not found\")","v":"35S_6D2_P101"}]
["PRS1_3_VFD1","PRS1_3_VFD1_I1","I1",null,"SPARE",null,null,"ULC4_3_VFD1",null,{"$f":"_xlfn.XLOOKUP(H25,NETWORK!$F$3:$F$176,NETWORK!$H$3:$H$176,\"not found\")","v":"35S_6D2_P101"}]
["PRS1_3_VFD1","PRS1_3_VFD1_I2","I2",null,"PRS1_3_JPE2","JAM PHOTOEYE",null,null,null,{"$f":"_xlfn.XLOOKUP(H26,NETWORK!$F$3:$F$176,NETWORK!$H$3:$H$176,\"not found\")","v":"not found"}]
["PRS1_3_VFD1","PRS1_3_VFD1_I3","I3",null,"SPARE",null,null,"PRS1_1ACH_FIO1",605,{"$f":"_xlfn.XLOOKUP(H27,NETWORK!$F$3:$F$176,NETWORK!$H$3:$H$176,\"not found\")","v":"5032-8IOLM12DR"},null,null,{"$f":"_xlfn.CONCAT(H27,\"/\",H28,\"/\",H29,\"/\",H30)","v":"PRS1_1ACH_FIO1/PRS1_1BCH_FIO1/PRS1_4_FIO1/PS8_1_FIO1"}]
["PRS1_3_VFD1","PRS1_3_VFD1_IO0","IO0",null,"PRS1_3_JR1_PB","JAM RESET PUSHBUTTON",null,"PRS1_1BCH_FIO1",null,{"$f":"_xlfn.XLOOKUP(H28,NETWORK!$F$3:$F$176,NETWORK!$H$3:$H$176,\"not found\")","v":"5032-8IOLM12DR"}]
["PRS1_3_VFD1","PRS1_3_VFD1_IO1","IO1",null,"PRS1_3_JR1_PB_LT","JAM RESET PUSHBUTTON LIGHT",null,"PRS1_4_FIO1",null,{"$f":"_xlfn.XLOOKUP(H29,NETWORK!$F$3:$F$176,NETWORK!$H$3:$H$176,\"not found\")","v":"5032-8IOLM12DR"}]
["PRS1_3_VFD1","PRS1_3_VFD1_SI0","SI0",null,"SPARE",null,null,"PS8_1_FIO1",null,{"$f":"_xlfn.XLOOKUP(H30,NETWORK!$F$3:$F$176,NETWORK!$H$3:$H$176,\"not found\")","v":"5032-8IOLM12DR"}]
["PRS1_3_VFD1","PRS1_3_VFD1_SI1","SI1",null,"SPARE",null,null,null,null,{"$f":"_xlfn.XLOOKUP(H31,NETWORK!$F$3:$F$176,NETWORK!$H$3:$H$176,\"not found\")","v":"not found"}]
["PRS1_3_VFD1","PRS1_3_VFD1_SI2","SI2",null,"SPARE",null,null,"PS8_1_FIO2",606,{"$f":"_xlfn.XLOOKUP(H32,NETWORK!$F$3:$F$176,NETWORK!$H$3:$H$176,\"not found\")","v":"5032-8IOLM12DR"},null,null,{"$f":"_xlfn.CONCAT(H32,\"/\",H33,\"/\",H34,\"/\",H35)","v":"PS8_1_FIO2/PS8_1_FIOH1/PS8_1_FIOH2/PS8_1_FIOH3"}]
["PRS1_3_VFD1","PRS1_3_VFD1_SI3","SI3",null,"SPARE",null,null,"PS8_1_FIOH1",null,{"$f":"_xlfn.XLOOKUP(H33,NETWORK!$F$3:$F$176,NETWORK!$H$3:$H$176,\"not found\")","v":"not found"}]
["PRS1_3_VFD1","PRS1_3_VFD1_SO0","SO0",null,"PRS1_3_BCN1_A","AMBER BEACON LIGHT",null,"PS8_1_FIOH2",null,{"$f":"_xlfn.XLOOKUP(H34,NETWORK!$F$3:$F$176,NETWORK!$H$3:$H$176,\"not found\")","v":"not found"}]
["PRS1_4_VFD1","PRS1_4_VFD1_I0","I0",null,"PRS1_4_VFD1_DISC","DISCONNECT AUX",null,"PS8_1_FIOH3",null,{"$f":"_xlfn.XLOOKUP(H35,NETWORK!$F$3:$F$176,NETWORK!$H$3:$H$176,\"not found\")","v":"not found"}]
["PRS1_4_VFD1","PRS1_4_VFD1_I1","I1",null,"SPARE",null,null,null,null,{"$f":"_xlfn.XLOOKUP(H36,NETWORK!$F$3:$F$176,NETWORK!$H$3:$H$176,\"not found\")","v":"not found"}]
["PRS1_4_VFD1","PRS1_4_VFD1_I2","I2",null,"PRS1_4_JPE1","JAM PHOTOEYE",null,"PS8_4_SIO1",607,{"$f":"_xlfn.XLOOKUP(H37,NETWORK!$F$3:$F$176,NETWORK!$H$3:$H$176,\"not found\")","v":"0980SSL3131-121-007D-202"},null,null,{"$f":"_xlfn.CONCAT(H37,\"/\",H38,\"/\",H39,\"/\",H40)","v":"PS8_4_SIO1/PS8_4_FIOH1/PS8_5_FIO1/PS8_9_FIO1"}]
["PRS1_4_VFD1","PRS1_4_VFD1_I3","I3",null,"PRS1_4_JPE2","JAM PHOTOEYE",null,"PS8_4_FIOH1",null,{"$f":"_xlfn.XLOOKUP(H38,NETWORK!$F$3:$F$176,NETWORK!$H$3:$H$176,\"not found\")","v":"not found"}]
["PRS1_4_VFD1","PRS1_4_VFD1_IO0","IO0",null,"SPARE",null,null,"PS8_5_FIO1",null,{"$f":"_xlfn.XLOOKUP(H39,NETWORK!$F$3:$F$176,NETWORK!$H$3:$H$176,\"not found\")","v":"5032-8IOLM12DR"}]
["PRS1_4_VFD1","PRS1_4_VFD1_IO1","IO1",null,"SPARE",null,null,"PS8_9_FIO1",null,{"$f":"_xlfn.XLOOKUP(H40,NETWORK!$F$3:$F$176,NETWORK!$H$3:$H$176,\"not found\")","v":"5032-8IOLM12DR"}]
["PRS1_4_VFD1","PRS1_4_VFD1_SI0","SI0",null,"SPARE",null,null,null,null,{"$f":"_xlfn.XLOOKUP(H41,NETWORK!$F$3:$F$176,NETWORK!$H$3:$H$176,\"not found\")","v":"not found"}]
["PRS1_4_VFD1","PRS1_4_VFD1_SI1","SI1",null,"SPARE",null,null,"PS8_11_FIO1",608,{"$f":"_xlfn.XLOOKUP(H42,NETWORK!$F$3:$F$176,NETWORK!$H$3:$H$176,\"not found\")","v":"5032-8IOLM12DR"},null,null,{"$f":"_xlfn.CONCAT(H42,\"/\",H43,\"/\",H44,\"/\",H45)","v":"PS8_11_FIO1/PS8_11_FIO2/PS8_11_FIOH1/PS8_11_FIOH2"}]
["PRS1_4_VFD1","PRS1_4_VFD1_SI2","SI2",null,"SPARE",null,null,"PS8_11_FIO2",null,{"$f":"_xlfn.XLOOKUP(H43,NETWORK!$F$3:$F$176,NETWORK!$H$3:$H$176,\"not found\")","v":"5032-8IOLM12DR"}]
["PRS1_4_VFD1","PRS1_4_VFD1_SI3","SI3",null,"SPARE",null,null,"PS8_11_FIOH1",null,{"$f":"_xlfn.XLOOKUP(H44,NETWORK!$F$3:$F$176,NETWORK!$H$3:$H$176,\"not found\")","v":"not found"}]
["PRS1_4_VFD1","PRS1_4_VFD1_SO0","SO0",null,"SPARE",null,null,"PS8_11_FIOH2",null,{"$f":"_xlfn.XLOOKUP(H45,NETWORK!$F$3:$F$176,NETWORK!$H$3:$H$176,\"not found\")","v":"not found"}]
["PRS1_6_VFD1","PRS1_6_VFD1_I0","I0",null,"PRS1_6_VFD1_DISC","DISCONNECT AUX",null,null,null,{"$f":"_xlfn.XLOOKUP(H46,NETWORK!$F$3:$F$176,NETWORK!$H$3:$H$176,\"not found\")","v":"not found"}]
["PRS1_6_VFD1","PRS1_6_VFD1_I1","I1",null,"SPARE",null,null,"PS9_3_FIO1",609,{"$f":"_xlfn.XLOOKUP(H47,NETWORK!$F$3:$F$176,NETWORK!$H$3:$H$176,\"not found\")","v":"5032-8IOLM12DR"},null,null,{"$f":"_xlfn.CONCAT(H47,\"/\",H48,\"/\",H49,\"/\",H50)","v":"PS9_3_FIO1/PS9_3_FIO2/PS9_3_FIOH1/PS9_3_FIOH2"}]
["PRS1_6_VFD1","PRS1_6_VFD1_I2","I2",null,"PRS1_6_JPE1","JAM PHOTOEYE",null,"PS9_3_FIO2",null,{"$f":"_xlfn.XLOOKUP(H48,NETWORK!$F$3:$F$176,NETWORK!$H$3:$H$176,\"not found\")","v":"5032-8IOLM12DR"}]
["PRS1_6_VFD1","PRS1_6_VFD1_I3","I3",null,"PRS1_6_JPE2","JAM PHOTOEYE",null,"PS9_3_FIOH1",null,{"$f":"_xlfn.XLOOKUP(H49,NETWORK!$F$3:$F$176,NETWORK!$H$3:$H$176,\"not found\")","v":"not found"}]
["PRS1_6_VFD1","PRS1_6_VFD1_IO0","IO0",null,"SPARE",null,null,"PS9_3_FIOH2",null,{"$f":"_xlfn.XLOOKUP(H50,NETWORK!$F$3:$F$176,NETWORK!$H$3:$H$176,\"not found\")","v":"not found"}]
["PRS1_6_VFD1","PRS1_6_VFD1_IO1","IO1",null,"SPARE",null,null,null,null,{"$f":"_xlfn.XLOOKUP(H51,NETWORK!$F$3:$F$176,NETWORK!$H$3:$H$176,\"not found\")","v":"not found"}]
["PRS1_6_VFD1","PRS1_6_VFD1_SI0","SI0",null,"PRS1_6_EPC1","E-STOP PULLCORD",null,"FL2074_2_VFD1",610,{"$f":"_xlfn.XLOOKUP(H52,NETWORK!$F$3:$F$176,NETWORK!$H$3:$H$176,\"not found\")","v":"35S_6D4_P111"},null,null,{"$f":"_xlfn.CONCAT(H52,\"/\",H53,\"/\",H54,\"/\",H55)","v":"FL2074_2_VFD1/FL2078_2_VFD1/FL2086_2_VFD1/FL2090_2_VFD1"}]
["PRS1_6_VFD1","PRS1_6_VFD1_SI1","SI1",null,"PRS1_6_EPC1_2","E-STOP PULLCORD",null,"FL2078_2_VFD1",null,{"$f":"_xlfn.XLOOKUP(H53,NETWORK!$F$3:$F$176,NETWORK!$H$3:$H$176,\"not found\")","v":"35S_6D4_P111"}]
["PRS1_6_VFD1","PRS1_6_VFD1_SI2","SI2",null,"PRS1_6_EPC2","E-STOP PULLCORD",null,"FL2086_2_VFD1",null,{"$f":"_xlfn.XLOOKUP(H54,NETWORK!$F$3:$F$176,NETWORK!$H$3:$H$176,\"not found\")","v":"35S_6D4_P111"}]
["PRS1_6_VFD1","PRS1_6_VFD1_SI3","SI3",null,"PRS1_6_EPC2_2","E-STOP PULLCORD",null,"FL2090_2_VFD1",null,{"$f":"_xlfn.XLOOKUP(H55,NETWORK!$F$3:$F$176,NETWORK!$H$3:$H$176,\"not found\")","v":"35S_6D4_P111"}]
["PRS1_6_VFD1","PRS1_6_VFD1_SO0","SO0",null,"SPARE",null,null,null,null,{"$f":"_xlfn.XLOOKUP(H56,NETWORK!$F$3:$F$176,NETWORK!$H$3:$H$176,\"not found\")","v":"not found"}]
["PRS2_1_VFD1","PRS2_1_VFD1_I0","I0",null,"PRS2_1_VFD1_DISC","DISCONNECT AUX",null,"FL2094_2_VFD1",611,{"$f":"_xlfn.XLOOKUP(H57,NETWORK!$F$3:$F$176,NETWORK!$H$3:$H$176,\"not found\")","v":"35S_6D4_P111"},null,null,{"$f":"_xlfn.CONCAT(H57,\"/\",H58,\"/\",H59,\"/\",H60)","v":"FL2094_2_VFD1/FL4066_2_VFD1/FL4070_2_VFD1/FL4074_2_VFD1"}]
["PRS2_1_VFD1","PRS2_1_VFD1_I1","I1",null,"SPARE",null,null,"FL4066_2_VFD1",null,{"$f":"_xlfn.XLOOKUP(H58,NETWORK!$F$3:$F$176,NETWORK!$H$3:$H$176,\"not found\")","v":"35S_6D4_P111"}]
["PRS2_1_VFD1","PRS2_1_VFD1_I2","I2",null,"PRS2_1_JPE1","JAM PHOTOEYE",null,"FL4070_2_VFD1",null,{"$f":"_xlfn.XLOOKUP(H59,NETWORK!$F$3:$F$176,NETWORK!$H$3:$H$176,\"not found\")","v":"35S_6D4_P111"}]
["PRS2_1_VFD1","PRS2_1_VFD1_I3","I3",null,"SPARE",null,null,"FL4074_2_VFD1",null,{"$f":"_xlfn.XLOOKUP(H60,NETWORK!$F$3:$F$176,NETWORK!$H$3:$H$176,\"not found\")","v":"35S_6D4_P111"}]
["PRS2_1_VFD1","PRS2_1_VFD1_IO0","IO0",null,"SPARE",null,null,null,null,{"$f":"_xlfn.XLOOKUP(H61,NETWORK!$F$3:$F$176,NETWORK!$H$3:$H$176,\"not found\")","v":"not found"}]
["PRS2_1_VFD1","PRS2_1_VFD1_IO1","IO1",null,"SPARE",null,null,"FL4078_2_VFD1",612,{"$f":"_xlfn.XLOOKUP(H62,NETWORK!$F$3:$F$176,NETWORK!$H$3:$H$176,\"not found\")","v":"35S_6D4_P111"},null,null,{"$f":"_xlfn.CONCAT(H62,\"/\",H63,\"/\",H64,\"/\",H65)","v":"FL4078_2_VFD1/FL4082_2_VFD1/FL2074_FIOH1/S012080_FIOH1"}]
["PRS2_1_VFD1","PRS2_1_VFD1_SI0","SI0",null,"PRS2_1_EPC1","E-STOP PULLCORD",null,"FL4082_2_VFD1",null,{"$f":"_xlfn.XLOOKUP(H63,NETWORK!$F$3:$F$176,NETWORK!$H$3:$H$176,\"not found\")","v":"35S_6D4_P111"}]
["PRS2_1_VFD1","PRS2_1_VFD1_SI1","SI1",null,"PRS2_1_EPC1_2","E-STOP PULLCORD",null,"FL2074_FIOH1",null,{"$f":"_xlfn.XLOOKUP(H64,NETWORK!$F$3:$F$176,NETWORK!$H$3:$H$176,\"not found\")","v":"not found"}]
["PRS2_1_VFD1","PRS2_1_VFD1_SI2","SI2",null,"PRS2_1_EPC2","E-STOP PULLCORD",null,"S012080_FIOH1",null,{"$f":"_xlfn.XLOOKUP(H65,NETWORK!$F$3:$F$176,NETWORK!$H$3:$H$176,\"not found\")","v":"not found"}]
["PRS2_1_VFD1","PRS2_1_VFD1_SI3","SI3",null,"PRS2_1_EPC2_2","E-STOP PULLCORD",null,null,null,{"$f":"_xlfn.XLOOKUP(H66,NETWORK!$F$3:$F$176,NETWORK!$H$3:$H$176,\"not found\")","v":"not found"}]
["PRS2_1_VFD1","PRS2_1_VFD1_SO0","SO0",null,"SPARE",null,null,"FL2086_FIOH1",613,{"$f":"_xlfn.XLOOKUP(H67,NETWORK!$F$3:$F$176,NETWORK!$H$3:$H$176,\"not found\")","v":"not found"},null,null,"FL2086_FIOH1/FL2090_FIOH1/S012096_FIOH1/FL4082_FIOH1"]
["PS8_1_VFD1","PS8_1_VFD1_I0","I0",null,"PS8_1_VFD1_DISC","DISCONNECT AUX",null,"FL2086_FIOH2",null,{"$f":"_xlfn.XLOOKUP(H68,NETWORK!$F$3:$F$176,NETWORK!$H$3:$H$176,\"not found\")","v":"not found"}]
["PS8_1_VFD1","PS8_1_VFD1_I1","I1",null,"PS8_1_ENC1","ENCODER",null,"FL2086_FIOH3",null,{"$f":"_xlfn.XLOOKUP(H69,NETWORK!$F$3:$F$176,NETWORK!$H$3:$H$176,\"not found\")","v":"not found"}]
["PS8_1_VFD1","PS8_1_VFD1_I2","I2",null,"PS8_1_JPE1","JAM PHOTOEYE",null,"FL2086_FIOH4",null,{"$f":"_xlfn.XLOOKUP(H70,NETWORK!$F$3:$F$176,NETWORK!$H$3:$H$176,\"not found\")","v":"not found"}]
["PS8_1_VFD1","PS8_1_VFD1_I3","I3",null,"PS8_1_JPE2","JAM PHOTOEYE",null,null,null,{"$f":"_xlfn.XLOOKUP(H71,NETWORK!$F$3:$F$176,NETWORK!$H$3:$H$176,\"not found\")","v":"not found"}]
["PS8_1_VFD1","PS8_1_VFD1_IO0","IO0",null,"PS8_1_JPE3","JAM PHOTOEYE",null,"FL2086_FIOH5",614,{"$f":"_xlfn.XLOOKUP(H72,NETWORK!$F$3:$F$176,NETWORK!$H$3:$H$176,\"not found\")","v":"not found"},null,null,"S014080_FIOH1/FL4074_FIOH1/FL4072_FIOH1/FL4066_FIOH1"]
["PS8_1_VFD1","PS8_1_VFD1_IO1","IO1",null,"SPARE",null,null,"FL2086_FIOH6",null,{"$f":"_xlfn.XLOOKUP(H73,NETWORK!$F$3:$F$176,NETWORK!$H$3:$H$176,\"not found\")","v":"not found"}]
["PS8_1_VFD1","PS8_1_VFD1_SI0","SI0",null,"PS8_1_EPC1","E-STOP PULLCORD",null,"FL2086_FIOH7",null,{"$f":"_xlfn.XLOOKUP(H74,NETWORK!$F$3:$F$176,NETWORK!$H$3:$H$176,\"not found\")","v":"not found"}]
["PS8_1_VFD1","PS8_1_VFD1_SI1","SI1",null,"PS8_1_EPC1_2","E-STOP PULLCORD",null,"FL2086_FIOH8",null,{"$f":"_xlfn.XLOOKUP(H75,NETWORK!$F$3:$F$176,NETWORK!$H$3:$H$176,\"not found\")","v":"not found"}]
["PS8_1_VFD1","PS8_1_VFD1_SI2","SI2",null,"SPARE",null,null,null,null,{"$f":"_xlfn.XLOOKUP(H76,NETWORK!$F$3:$F$176,NETWORK!$H$3:$H$176,\"not found\")","v":"not found"}]
["PS8_1_VFD1","PS8_1_VFD1_SI3","SI3",null,"SPARE",null,null,"FL2090_FIOH1",615,{"$f":"_xlfn.XLOOKUP(H77,NETWORK!$F$3:$F$176,NETWORK!$H$3:$H$176,\"not found\")","v":"not found"}]
["PS8_1_VFD1","PS8_1_VFD1_SO0","SO0",null,"SPARE",null,null,"S012096_FIOH1",null,{"$f":"_xlfn.XLOOKUP(H78,NETWORK!$F$3:$F$176,NETWORK!$H$3:$H$176,\"not found\")","v":"not found"}]
["PS8_11_VFD1","PS8_11_VFD1_I0","I0",null,"PS8_11_VFD1_DISC","DISCONNECT AUX",null,"FL4066_FIOH1",null,{"$f":"_xlfn.XLOOKUP(H79,NETWORK!$F$3:$F$176,NETWORK!$H$3:$H$176,\"not found\")","v":"not found"}]
["PS8_11_VFD1","PS8_11_VFD1_I1","I1",null,"PS8_11_ENC1","ENCODER",null,"S014072_FIOH1",null,{"$f":"_xlfn.XLOOKUP(H80,NETWORK!$F$3:$F$176,NETWORK!$H$3:$H$176,\"not found\")","v":"not found"}]
["PS8_11_VFD1","PS8_11_VFD1_I2","I2",null,"PS8_11_CH1_JPE1","JAM PHOTOEYE",null,null,null,{"$f":"_xlfn.XLOOKUP(H81,NETWORK!$F$3:$F$176,NETWORK!$H$3:$H$176,\"not found\")","v":"not found"}]
["PS8_11_VFD1","PS8_11_VFD1_I3","I3",null,"PS8_11_CH2_JPE1","JAM PHOTOEYE",null,"FL4074_FIOH1",616,{"$f":"_xlfn.XLOOKUP(H82,NETWORK!$F$3:$F$176,NETWORK!$H$3:$H$176,\"not found\")","v":"not found"}]
["PS8_11_VFD1","PS8_11_VFD1_IO0","IO0",null,"PS8_12CH_FPE1","FULL PHOTOEYE",null,"S014080_FIOH1",null,{"$f":"_xlfn.XLOOKUP(H83,NETWORK!$F$3:$F$176,NETWORK!$H$3:$H$176,\"not found\")","v":"not found"}]
["PS8_11_VFD1","PS8_11_VFD1_IO1","IO1",null,"PS8_12CH-PS1","PRESSURE SENSOR",null,"FL4082_FIOH1",null,{"$f":"_xlfn.XLOOKUP(H84,NETWORK!$F$3:$F$176,NETWORK!$H$3:$H$176,\"not found\")","v":"not found"}]
["PS8_11_VFD1","PS8_11_VFD1_SI0","SI0",null,"PS8_11_EPC1","E-STOP PULLCORD",null,null,null,{"$f":"_xlfn.XLOOKUP(H85,NETWORK!$F$3:$F$176,NETWORK!$H$3:$H$176,\"not found\")","v":"not found"}]
["PS8_11_VFD1","PS8_11_VFD1_SI1","SI1",null,"PS8_11_EPC1_2","E-STOP PULLCORD",null,null,null,{"$f":"_xlfn.XLOOKUP(H86,NETWORK!$F$3:$F$176,NETWORK!$H$3:$H$176,\"not found\")","v":"not found"}]
["PS8_11_VFD1","PS8_11_VFD1_SI2","SI2",null,"SPARE"]
["PS8_11_VFD1","PS8_11_VFD1_SI3","SI3",null,"SPARE"]
["PS8_11_VFD1","PS8_11_VFD1_SO0","SO0",null,"PS8_9_VFD1_STO","VFD SAFETY ACTIVE"]
["PS8_2_VFD1","PS8_2_VFD1_I0","I0",null,"PS8_2_VFD1_DISC","DISCONNECT AUX"]
["PS8_2_VFD1","PS8_2_VFD1_I1","I1",null,"PS8_2_ENC1","ENCODER"]
["PS8_2_VFD1","PS8_2_VFD1_I2","I2",null,"PS8_2_JPE1","JAM PHOTOEYE",null,null,"PS8_11_BCN2_A","AMBER BEACON LIGHT"]
["PS8_2_VFD1","PS8_2_VFD1_I3","I3",null,"SPARE"]
["PS8_2_VFD1","PS8_2_VFD1_IO0","IO0",null,"PS8_2_BCN2_A","AMBER BEACON LIGHT"]
["PS8_2_VFD1","PS8_2_VFD1_IO1","IO1",null,"PS8_2_BCN2_R","RED BEACON LIGHT"]
["PS8_2_VFD1","PS8_2_VFD1_SI0","SI0",null,"PS8_2_EPC1","E-STOP PULLCORD"]
["PS8_2_VFD1","PS8_2_VFD1_SI1","SI1",null,"PS8_2_EPC1_2","E-STOP PULLCORD"]
["PS8_2_VFD1","PS8_2_VFD1_SI2","SI2",null,"PS8_2_EPC2","E-STOP PULLCORD"]
["PS8_2_VFD1","PS8_2_VFD1_SI3","SI3",null,"PS8_2_EPC2_2","E-STOP PULLCORD"]
["PS8_2_VFD1","PS8_2_VFD1_SO0","SO0",null,"PS8_2_BCN1_R","RED BEACON LIGHT"]
["PS8_4_VFD1","PS8_4_VFD1_I0","I0",null,"PS8_4_VFD1_DISC","DISCONNECT AUX"]
["PS8_5_VFD1","PS8_5_VFD1_I0","I0",null,"PS8_5_VFD1_DISC","DISCONNECT AUX"]
["PS8_6_VFD1","PS8_6_VFD1_I0","I0",null,"PS8_6_VFD1_DISC","DISCONNECT AUX"]
["PS8_6_VFD1","PS8_6_VFD1_I1","I1",null,"SPARE"]
["PS8_6_VFD1","PS8_6_VFD1_I2","I2",null,"SPARE"]
["PS8_6_VFD1","PS8_6_VFD1_I3","I3",null,"SPARE"]
["PS8_6_VFD1","PS8_6_VFD1_IO0","IO0",null,"SPARE"]
["PS8_6_VFD1","PS8_6_VFD1_IO1","IO1",null,"SPARE"]
["PS8_6_VFD1","PS8_6_VFD1_SI0","SI0",null,"SPARE"]
["PS8_6_VFD1","PS8_6_VFD1_SI1","SI1",null,"SPARE"]
["PS8_6_VFD1","PS8_6_VFD1_SI2","SI2",null,"SPARE"]
["PS8_6_VFD1","PS8_6_VFD1_SI3","SI3",null,"SPARE"]
["PS8_6_VFD1","PS8_6_VFD1_SO0","SO0",null,"SPARE"]
["PS8_8_VFD1","PS8_8_VFD1_I0","I0",null,"PS8_8_VFD1_DISC","DISCONNECT AUX"]
["PS8_8_VFD1","PS8_8_VFD1_I1","I1",null,"PS8_8_ENC1","ENCODER"]
["PS8_8_VFD1","PS8_8_VFD1_I2","I2",null,"PS8_8_JPE1","JAM PHOTOEYE"]
["PS8_8_VFD1","PS8_8_VFD1_I3","I3",null,"PS8_8_JPE2","JAM PHOTOEYE"]
["PS8_8_VFD1","PS8_8_VFD1_IO0","IO0",null,"SPARE"]
["PS8_8_VFD1","PS8_8_VFD1_IO1","IO1",null,"SPARE"]
["PS8_8_VFD1","PS8_8_VFD1_SI0","SI0",null,"SPARE"]
["PS8_8_VFD1","PS8_8_VFD1_SI1","SI1",null,"SPARE"]
["PS8_8_VFD1","PS8_8_VFD1_SI2","SI2",null,"SPARE"]
["PS8_8_VFD1","PS8_8_VFD1_SI3","SI3",null,"SPARE"]
["PS8_8_VFD1","PS8_8_VFD1_SO0","SO0",null,"SPARE"]
["PS8_9_VFD1","PS8_9_VFD1_I0","I0",null,"PS8_9_VFD1_DISC","DISCONNECT AUX"]
["PS9_2_VFD1","PS9_2_VFD1_I0","I0",null,"PS9_2_VFD1_DISC","DISCONNECT AUX"]
["PS9_2_VFD1","PS9_2_VFD1_I1","I1",null,"PS9_2_ENC1","ENCODER"]
["PS9_2_VFD1","PS9_2_VFD1_I2","I2",null,"PS9_2_JPE1","JAM PHOTOEYE"]
["PS9_2_VFD1","PS9_2_VFD1_I3","I3",null,"PS9_2_JPE2","JAM PHOTOEYE"]
["PS9_2_VFD1","PS9_2_VFD1_IO0","IO0",null,"SPARE"]
["PS9_2_VFD1","PS9_2_VFD1_IO1","IO1",null,"SPARE"]
["PS9_2_VFD1","PS9_2_VFD1_SI0","SI0",null,"PS9_2_EPC1","E-STOP PULLCORD"]
["PS9_2_VFD1","PS9_2_VFD1_SI1","SI1",null,"PS9_2_EPC1_2","E-STOP PULLCORD"]
["PS9_2_VFD1","PS9_2_VFD1_SI2","SI2",null,"PS9_2_EPC2","E-STOP PULLCORD"]
["PS9_2_VFD1","PS9_2_VFD1_SI3","SI3",null,"PS9_2_EPC2_2","E-STOP PULLCORD"]
["PS9_2_VFD1","PS9_2_VFD1_SO0","SO0",null,"SPARE"]
["PS9_3_VFD1","PS9_3_VFD1_I0","I0",null,"PS9_3_VFD1_DISC","DISCONNECT AUX"]
["PS9_3_VFD1","PS9_3_VFD1_I1","I1",null,"PS9_3_ENC1","ENCODER"]
["PS9_3_VFD1","PS9_3_VFD1_I2","I2",null,"PS9_3_JPE1","JAM PHOTOEYE"]
["PS9_3_VFD1","PS9_3_VFD1_I3","I3",null,"PS9_3_JPE2","JAM PHOTOEYE"]
["PS9_3_VFD1","PS9_3_VFD1_IO0","IO0",null,"PS9_3_BCN2_A","AMBER BEACON LIGHT"]
["PS9_3_VFD1","PS9_3_VFD1_IO1","IO1",null,"PS9_3_BCN2_B","BLUE BEACON LIGHT"]
["PS9_3_VFD1","PS9_3_VFD1_SI0","SI0",null,"PS9_3_EPC1","E-STOP PULLCORD"]
["PS9_3_VFD1","PS9_3_VFD1_SI1","SI1",null,"PS9_3_EPC1_2","E-STOP PULLCORD"]
["PS9_3_VFD1","PS9_3_VFD1_SI2","SI2",null,"SPARE"]
["PS9_3_VFD1","PS9_3_VFD1_SI3","SI3",null,"SPARE"]
["PS9_3_VFD1","PS9_3_VFD1_SO0","SO0",null,"PS9_3_BCN2_R","RED BEACON LIGHT"]
["ULC1_3_VFD1","ULC1_3_VFD1_I0","I0",null,"ULC1_3_VFD1_DISC","DISCONNECT AUX"]
["ULC1_3_VFD1","ULC1_3_VFD1_I1","I1",null,"ULC1_3_ENC1","ENCODER"]
["ULC1_3_VFD1","ULC1_3_VFD1_I2","I2",null,"ULC1_3_JPE1","JAM PHOTOEYE"]
["ULC1_3_VFD1","ULC1_3_VFD1_I3","I3",null,"ULC1_3_JPE2","JAM PHOTOEYE"]
["ULC1_3_VFD1","ULC1_3_VFD1_IO0","IO0",null,"SPARE"]
["ULC1_3_VFD1","ULC1_3_VFD1_IO1","IO1",null,"SPARE"]
["ULC1_3_VFD1","ULC1_3_VFD1_SI0","SI0",null,"ULC1_3_EPC1","E-STOP PULLCORD"]
["ULC1_3_VFD1","ULC1_3_VFD1_SI1","SI1",null,"ULC1_3_EPC1_2","E-STOP PULLCORD"]
["ULC1_3_VFD1","ULC1_3_VFD1_SI2","SI2",null,"ULC1_3_EPC2","E-STOP PULLCORD"]
["ULC1_3_VFD1","ULC1_3_VFD1_SI3","SI3",null,"ULC1_3_EPC2_2","E-STOP PULLCORD"]
["ULC1_3_VFD1","ULC1_3_VFD1_SO0","SO0",null,"SPARE"]
["ULC2_3_VFD1","ULC2_3_VFD1_I0","I0",null,"ULC2_3_VFD1_DISC","DISCONNECT AUX"]
["ULC2_3_VFD1","ULC2_3_VFD1_I1","I1",null,"ULC2_3_ENC1","ENCODER"]
["ULC2_3_VFD1","ULC2_3_VFD1_I2","I2",null,"ULC2_3_JPE1","JAM PHOTOEYE"]
["ULC2_3_VFD1","ULC2_3_VFD1_I3","I3",null,"ULC2_3_JPE2","JAM PHOTOEYE"]
["ULC2_3_VFD1","ULC2_3_VFD1_IO0","IO0",null,"SPARE"]
["ULC2_3_VFD1","ULC2_3_VFD1_IO1","IO1",null,"SPARE"]
["ULC2_3_VFD1","ULC2_3_VFD1_SI0","SI0",null,"ULC2_3_EPC1","E-STOP PULLCORD"]
["ULC2_3_VFD1","ULC2_3_VFD1_SI1","SI1",null,"ULC2_3_EPC1_2","E-STOP PULLCORD"]
["ULC2_3_VFD1","ULC2_3_VFD1_SI2","SI2",null,"SPARE"]
["ULC2_3_VFD1","ULC2_3_VFD1_SI3","SI3",null,"SPARE"]
["ULC2_3_VFD1","ULC2_3_VFD1_SO0","SO0",null,"SPARE"]
["ULC3_3_VFD1","ULC3_3_VFD1_I0","I0",null,"ULC3_3_VFD1_DISC","DISCONNECT AUX"]
["ULC3_3_VFD1","ULC3_3_VFD1_I1","I1",null,"ULC3_3_ENC1","ENCODER"]
["ULC3_3_VFD1","ULC3_3_VFD1_I2","I2",null,"ULC3_3_JPE1","JAM PHOTOEYE"]
["ULC3_3_VFD1","ULC3_3_VFD1_I3","I3",null,"ULC3_3_JPE2","JAM PHOTOEYE"]
["ULC3_3_VFD1","ULC3_3_VFD1_IO0","IO0",null,"SPARE"]
["ULC3_3_VFD1","ULC3_3_VFD1_IO1","IO1",null,"SPARE"]
["ULC3_3_VFD1","ULC3_3_VFD1_SI0","SI0",null,"ULC3_3_EPC1","E-STOP PULLCORD"]
["ULC3_3_VFD1","ULC3_3_VFD1_SI1","SI1",null,"ULC3_3_EPC1_2","E-STOP PULLCORD"]
["ULC3_3_VFD1","ULC3_3_VFD1_SI2","SI2",null,"SPARE"]
["ULC3_3_VFD1","ULC3_3_VFD1_SI3","SI3",null,"SPARE"]
["ULC3_3_VFD1","ULC3_3_VFD1_SO0","SO0",null,"SPARE"]
["ULC4_3_VFD1","ULC4_3_VFD1_I0","I0",null,"ULC4_3_VFD1_DISC","DISCONNECT AUX"]
["ULC4_3_VFD1","ULC4_3_VFD1_I1","I1",null,"ULC4_3_ENC1","ENCODER"]
["ULC4_3_VFD1","ULC4_3_VFD1_I2","I2",null,"ULC4_3_JPE1","JAM PHOTOEYE"]
["ULC4_3_VFD1","ULC4_3_VFD1_I3","I3",null,"ULC4_3_JPE2","JAM PHOTOEYE"]
["ULC4_3_VFD1","ULC4_3_VFD1_IO0","IO0",null,"SPARE"]
["ULC4_3_VFD1","ULC4_3_VFD1_IO1","IO1",null,"SPARE"]
["ULC4_3_VFD1","ULC4_3_VFD1_SI0","SI0",null,"ULC4_3_EPC1","E-STOP PULLCORD"]
["ULC4_3_VFD1","ULC4_3_VFD1_SI1","SI1",null,"ULC4_3_EPC1_2","E-STOP PULLCORD"]
["ULC4_3_VFD1","ULC4_3_VFD1_SI2","SI2",null,"SPARE"]
["ULC4_3_VFD1","ULC4_3_VFD1_SI3","SI3",null,"SPARE"]
["ULC4_3_VFD1","ULC4_3_VFD1_SO0","SO0",null,"SPARE"]
["PRS1_1ACH_FIO1","PRS1_3_FIO1_IO00","IO00",null,"PRS1_1ACH_BCN1_A","AMBER BEACON LIGHT"]
["PRS1_1ACH_FIO1","PRS1_3_FIO1_IO01","IO01",null,"PRS1_1ACH_BCN1_B","BLUE BEACON LIGHT"]
["PRS1_1ACH_FIO1","PRS1_3_FIO1_IO02","IO02",null,"PRS1_1ACH_FPE1","FULL PHOTOEYE"]
["PRS1_1ACH_FIO1","PRS1_3_FIO1_IO03","IO03",null,"SPARE"]
["PRS1_1ACH_FIO1","PRS1_3_FIO1_IO04","IO04",null,"PRS1_2A_BCN1_A","AMBER BEACON LIGHT"]
["PRS1_1ACH_FIO1","PRS1_3_FIO1_IO05","IO05",null,"SPARE"]
["PRS1_1ACH_FIO1","PRS1_3_FIO1_IO06","IO06",null,"PRS1_2A_JR1_PB","JAM RESET PUSHBUTTON"]
["PRS1_1ACH_FIO1","PRS1_3_FIO1_IO07","IO07",null,"PRS1_2A_JR1_PB_LT","JAM RESET PUSHBUTTON LIGHT"]
["PRS1_1ACH_FIO1","PRS1_3_FIO1_IO08","IO08",null,"PRS1_2A_JR2_PB","JAM RESET PUSHBUTTON"]
["PRS1_1ACH_FIO1","PRS1_3_FIO1_IO09","IO09",null,"PRS1_2A_JR2_PB_LT","JAM RESET PUSHBUTTON LIGHT"]
["PRS1_1ACH_FIO1","PRS1_3_FIO1_IO10","IO10",null,"PRS1_3_JPE1","JAM PHOTOEYE"]
["PRS1_1ACH_FIO1","PRS1_3_FIO1_IO11","IO11",null,"SPARE"]
["PRS1_1ACH_FIO1","PRS1_3_FIO1_IO12","IO12",null,"SPARE"]
["PRS1_1ACH_FIO1","PRS1_3_FIO1_IO13","IO13",null,"SPARE"]
["PRS1_1ACH_FIO1","PRS1_3_FIO1_IO14","IO14",null,"SPARE"]
["PRS1_1ACH_FIO1","PRS1_3_FIO1_IO15","IO15",null,"SPARE"]
["PRS1_1BCH_FIO1","PRS1_3_FIO1_IO00","IO00",null,"PRS1_1BCH_BCN1_A","AMBER BEACON LIGHT"]
["PRS1_1BCH_FIO1","PRS1_3_FIO1_IO01","IO01",null,"PRS1_1BCH_BCN1_B","BLUE BEACON LIGHT"]
["PRS1_1BCH_FIO1","PRS1_3_FIO1_IO02","IO02",null,"PRS1_1BCH_FPE1","FULL PHOTOEYE"]
["PRS1_1BCH_FIO1","PRS1_3_FIO1_IO03","IO03",null,"SPARE"]
["PRS1_1BCH_FIO1","PRS1_3_FIO1_IO04","IO04",null,"PRS1_2B_BCN1_A","AMBER BEACON LIGHT"]
["PRS1_1BCH_FIO1","PRS1_3_FIO1_IO05","IO05",null,"SPARE"]
["PRS1_1BCH_FIO1","PRS1_3_FIO1_IO06","IO06",null,"PRS1_2B_JR1_PB","JAM RESET PUSHBUTTON"]
["PRS1_1BCH_FIO1","PRS1_3_FIO1_IO07","IO07",null,"PRS1_2B_JR1_PB_LT","JAM RESET PUSHBUTTON LIGHT"]
["PRS1_1BCH_FIO1","PRS1_3_FIO1_IO08","IO08",null,"PRS1_2B_JR2_PB","JAM RESET PUSHBUTTON"]
["PRS1_1BCH_FIO1","PRS1_3_FIO1_IO09","IO09",null,"PRS1_2B_JR2_PB_LT","JAM RESET PUSHBUTTON LIGHT"]
["PRS1_1BCH_FIO1","PRS1_3_FIO1_IO10","IO10",null,"SPARE"]
["PRS1_1BCH_FIO1","PRS1_3_FIO1_IO11","IO11",null,"SPARE"]
["PRS1_1BCH_FIO1","PRS1_3_FIO1_IO12","IO12",null,"SPARE"]
["PRS1_1BCH_FIO1","PRS1_3_FIO1_IO13","IO13",null,"SPARE"]
["PRS1_1BCH_FIO1","PRS1_3_FIO1_IO14","IO14",null,"SPARE"]
["PRS1_1BCH_FIO1","PRS1_3_FIO1_IO15","IO15",null,"SPARE"]
["PRS1_4_FIO1","PRS1_4_FIO1_IO00","IO00",null,"PRS1_4_BCN1_A","AMBER BEACON LIGHT"]
["PRS1_4_FIO1","PRS1_4_FIO1_IO01","IO01",null,"PRS1_4_BCN1_B","BLUE BEACON LIGHT"]
["PRS1_4_FIO1","PRS1_4_FIO1_IO02","IO02",null,"PRS1_4_JR1_PB","JAM RESET PUSHBUTTON"]
["PRS1_4_FIO1","PRS1_4_FIO1_IO03","IO03",null,"PRS1_4_JR1_PB_LT","JAM RESET PUSHBUTTON LIGHT"]
["PRS1_4_FIO1","PRS1_4_FIO1_IO04","IO04",null,"PRS1_5CH_FPE1","FULL PHOTOEYE"]
["PRS1_4_FIO1","PRS1_4_FIO1_IO05","IO05",null,"SPARE"]
["PRS1_4_FIO1","PRS1_4_FIO1_IO06","IO06",null,"PRS1_5CH_FPE2","FULL PHOTOEYE"]
["PRS1_4_FIO1","PRS1_4_FIO1_IO07","IO07",null,"SPARE"]
["PRS1_4_FIO1","PRS1_4_FIO1_IO08","IO08",null,"PRS1_6_BCN1_R","RED BEACON LIGHT"]
["PRS1_4_FIO1","PRS1_4_FIO1_IO09","IO09",null,"SPARE"]
["PRS1_4_FIO1","PRS1_4_FIO1_IO10","IO10",null,"PRS1_6_BCN2_R","RED BEACON LIGHT"]
["PRS1_4_FIO1","PRS1_4_FIO1_IO11","IO11",null,"SPARE"]
["PRS1_4_FIO1","PRS1_4_FIO1_IO12","IO12",null,"PRS1_6_S1_PB","START PUSHBUTTON"]
["PRS1_4_FIO1","PRS1_4_FIO1_IO13","IO13",null,"PRS1_6_S1_PB_LT","START PUSHBUTTON LIGHT"]
["PRS1_4_FIO1","PRS1_4_FIO1_IO14","IO14",null,"PRS1_6_S2_PB","START PUSHBUTTON"]
["PRS1_4_FIO1","PRS1_4_FIO1_IO15","IO15",null,"PRS1_6_S2_PB_LT","START PUSHBUTTON LIGHT"]
["PS8_1_FIO1","PS8_1_FIO1_IO00","IO00",null,"PRS2_1_BCN1_A","AMBER BEACON LIGHT"]
["PS8_1_FIO1","PS8_1_FIO1_IO01","IO01",null,"PRS2_1_BCN1_R","RED BEACON LIGHT"]
["PS8_1_FIO1","PS8_1_FIO1_IO02","IO02",null,"PRS2_1_BCN2_R","RED BEACON LIGHT"]
["PS8_1_FIO1","PS8_1_FIO1_IO03","IO03",null,"PS8_1_JPE4","JAM PHOTOEYE"]
["PS8_1_FIO1","PS8_1_FIO1_IO04","IO04",null,"PS8_1_JPE5","JAM PHOTOEYE"]
["PS8_1_FIO1","PS8_1_FIO1_IO05","IO05",null,"PS8_1_JPE6","JAM PHOTOEYE"]
["PS8_1_FIO1","PS8_1_FIO1_IO06","IO06",null,"PRS2_1_S1_PB","START PUSHBUTTON"]
["PS8_1_FIO1","PS8_1_FIO1_IO07","IO07",null,"PRS2_1_S1_PB_LT","START PUSHBUTTON LIGHT"]
["PS8_1_FIO1","PS8_1_FIO1_IO08","IO08",null,"PRS2_1_S2_PB","START PUSHBUTTON"]
["PS8_1_FIO1","PS8_1_FIO1_IO09","IO09",null,"PRS2_1_S2_PB_LT","START PUSHBUTTON LIGHT"]
["PS8_1_FIO1","PS8_1_FIO1_IO10","IO10",null,"PS8_1_BCN1_A","AMBER BEACON LIGHT"]
["PS8_1_FIO1","PS8_1_FIO1_IO11","IO11",null,"PS8_1_BCN1_R","RED BEACON LIGHT"]
["PS8_1_FIO1","PS8_1_FIO1_IO12","IO12",null,"PS8_1_FIOH1","HUB ARMOR BLOCK"]
["PS8_1_FIO1","PS8_1_FIO1_IO13","IO13",null,"SPARE"]
["PS8_1_FIO1","PS8_1_FIO1_IO14","IO14",null,"PS8_1_FIOH2","HUB ARMOR BLOCK"]
["PS8_1_FIO1","PS8_1_FIO1_IO15","IO15",null,"SPARE"]
["PS8_1_FIO2","PS8_1_FIO2_IO00","IO00",null,"ULC3_3_BCN1_A","AMBER BEACON LIGHT"]
["PS8_1_FIO2","PS8_1_FIO2_IO01","IO01",null,"ULC3_3_BCN1_R","RED BEACON LIGHT"]
["PS8_1_FIO2","PS8_1_FIO2_IO02","IO02",null,"ULC3_3_JR1_PB","JAM RESET PUSHBUTTON"]
["PS8_1_FIO2","PS8_1_FIO2_IO03","IO03",null,"ULC3_3_JR1_PB_LT","JAM RESET PUSHBUTTON LIGHT"]
["PS8_1_FIO2","PS8_1_FIO2_IO04","IO04",null,"ULC3_3_SS1_SPB","SS STATION START PUSHBUTTON","2025-07-01"]
["PS8_1_FIO2","PS8_1_FIO2_IO05","IO05",null,"ULC3_3_SS1_SPB_LT","SS STATION START PUSHBUTTON LIGHT"]
["PS8_1_FIO2","PS8_1_FIO2_IO06","IO06",null,"ULC3_3_SS1_STPB","SS STATION STOP PUSHBUTTON"]
["PS8_1_FIO2","PS8_1_FIO2_IO07","IO07",null,"SPARE"]
["PS8_1_FIO2","PS8_1_FIO2_IO08","IO08",null,"ULC4_3_BCN1_A","AMBER BEACON LIGHT"]
["PS8_1_FIO2","PS8_1_FIO2_IO09","IO09",null,"ULC4_3_BCN1_R","RED BEACON LIGHT"]
["PS8_1_FIO2","PS8_1_FIO2_IO10","IO10",null,"ULC4_3_JR1_PB","JAM RESET PUSHBUTTON"]
["PS8_1_FIO2","PS8_1_FIO2_IO11","IO11",null,"ULC4_3_JR1_PB_LT","JAM RESET PUSHBUTTON LIGHT"]
["PS8_1_FIO2","PS8_1_FIO2_IO12","IO12",null,"SPARE"]
["PS8_1_FIO2","PS8_1_FIO2_IO13","IO13",null,"SPARE"]
["PS8_1_FIO2","PS8_1_FIO2_IO14","IO14",null,"PS8_1_FIOH3","HUB ARMOR BLOCK"]
["PS8_1_FIO2","PS8_1_FIO2_IO15","IO15",null,"SPARE"]
["PS8_1_FIOH1","PS8_1_FIOH1_IO00","IO00",null,"PS8_1_BCN2_A","AMBER BEACON LIGHT"]
["PS8_1_FIOH1","PS8_1_FIOH1_IO01","IO01",null,"SPARE"]
["PS8_1_FIOH1","PS8_1_FIOH1_IO02","IO02",null,"PS8_1_BCN3_A","AMBER BEACON LIGHT"]
["PS8_1_FIOH1","PS8_1_FIOH1_IO03","IO03",null,"SPARE"]
["PS8_1_FIOH1","PS8_1_FIOH1_IO04","IO04",null,"PS8_1_JR1_PB","JAM RESET PUSHBUTTON"]
["PS8_1_FIOH1","PS8_1_FIOH1_IO05","IO05",null,"PS8_1_JR1_PB_LT","JAM RESET PUSHBUTTON LIGHT"]
["PS8_1_FIOH1","PS8_1_FIOH1_IO06","IO06",null,"PS8_1_JR2_PB","JAM RESET PUSHBUTTON"]
["PS8_1_FIOH1","PS8_1_FIOH1_IO07","IO07",null,"PS8_1_JR2_PB_LT","JAM RESET PUSHBUTTON LIGHT"]
["PS8_1_FIOH1","PS8_1_FIOH1_IO08","IO08",null,"PS8_1_SS1_SPB","SS STATION START PUSHBUTTON","2025-07-01"]
["PS8_1_FIOH1","PS8_1_FIOH1_IO09","IO09",null,"PS8_1_SS1_SPB_LT","SS STATION START PUSHBUTTON LIGHT"]
["PS8_1_FIOH1","PS8_1_FIOH1_IO10","IO10",null,"PS8_1_SS1_STPB","SS STATION STOP PUSHBUTTON"]
["PS8_1_FIOH1","PS8_1_FIOH1_IO11","IO11",null,"SPARE"]
["PS8_1_FIOH1","PS8_1_FIOH1_IO12","IO12",null,"ULC1_3_BCN1_A","AMBER BEACON LIGHT"]
["PS8_1_FIOH1","PS8_1_FIOH1_IO13","IO13",null,"ULC1_3_BCN1_R","RED BEACON LIGHT"]
["PS8_1_FIOH1","PS8_1_FIOH1_IO14","IO14",null,"ULC1_3_JR1_PB","JAM RESET PUSHBUTTON"]
["PS8_1_FIOH1","PS8_1_FIOH1_IO15","IO15",null,"ULC1_3_JR1_PB_LT","JAM RESET PUSHBUTTON LIGHT"]
["PS8_1_FIOH2","PS8_1_FIOH2_IO00","IO00",null,"ULC1_3_SS1_SPB","SS STATION START PUSHBUTTON","2025-07-01"]
["PS8_1_FIOH2","PS8_1_FIOH2_IO01","IO01",null,"ULC1_3_SS1_SPB_LT","SS STATION START PUSHBUTTON LIGHT"]
["PS8_1_FIOH2","PS8_1_FIOH2_IO02","IO02",null,"ULC1_3_SS1_STPB","SS STATION STOP PUSHBUTTON"]
["PS8_1_FIOH2","PS8_1_FIOH2_IO03","IO03",null,"SPARE"]
["PS8_1_FIOH2","PS8_1_FIOH2_IO04","IO04",null,"ULC1_3_SS2_SPB","SS STATION START PUSHBUTTON"]
["PS8_1_FIOH2","PS8_1_FIOH2_IO05","IO05",null,"ULC1_3_SS2_SPB_LT","SS STATION START PUSHBUTTON LIGHT","2025-07-01"]
["PS8_1_FIOH2","PS8_1_FIOH2_IO06","IO06",null,"ULC1_3_SS2_STPB","SS STATION STOP PUSHBUTTON"]
["PS8_1_FIOH2","PS8_1_FIOH2_IO07","IO07",null,"SPARE"]
["PS8_1_FIOH2","PS8_1_FIOH2_IO08","IO08",null,"ULC2_3_SS1_SPB","SS STATION START PUSHBUTTON"]
["PS8_1_FIOH2","PS8_1_FIOH2_IO09","IO09",null,"ULC2_3_SS1_SPB_LT","SS STATION START PUSHBUTTON LIGHT","2025-07-01"]
["PS8_1_FIOH2","PS8_1_FIOH2_IO10","IO10",null,"ULC2_3_SS1_STPB","SS STATION STOP PUSHBUTTON"]
["PS8_1_FIOH2","PS8_1_FIOH2_IO11","IO11",null,"SPARE"]
["PS8_1_FIOH2","PS8_1_FIOH2_IO12","IO12",null,"ULC2_3_BCN1_A","AMBER BEACON LIGHT"]
["PS8_1_FIOH2","PS8_1_FIOH2_IO13","IO13",null,"ULC2_3_BCN1_R","RED BEACON LIGHT"]
["PS8_1_FIOH2","PS8_1_FIOH2_IO14","IO14",null,"ULC2_3_JR1_PB","JAM RESET PUSHBUTTON"]
["PS8_1_FIOH2","PS8_1_FIOH2_IO15","IO15",null,"ULC2_3_JR1_PB_LT","JAM RESET PUSHBUTTON LIGHT"]
["PS8_1_FIOH3","PS8_1_FIOH3_IO00","IO00",null,"ULC4_3_SS1_SPB","SS STATION START PUSHBUTTON"]
["PS8_1_FIOH3","PS8_1_FIOH3_IO01","IO01",null,"ULC4_3_SS1_SPB_LT","SS STATION START PUSHBUTTON LIGHT","2025-07-01"]
["PS8_1_FIOH3","PS8_1_FIOH3_IO02","IO02",null,"ULC4_3_SS1_STPB","SS STATION STOP PUSHBUTTON"]
["PS8_1_FIOH3","PS8_1_FIOH3_IO03","IO03",null,"SPARE"]
["PS8_1_FIOH3","PS8_1_FIOH3_IO04","IO04",null,"PS8_2_S1_PB","START PUSHBUTTON"]
["PS8_1_FIOH3","PS8_1_FIOH3_IO05","IO05",null,"PS8_2_S1_PB_LT","START PUSHBUTTON LIGHT"]
["PS8_1_FIOH3","PS8_1_FIOH3_IO06","IO06",null,"PS8_2_S2_PB","START PUSHBUTTON"]
["PS8_1_FIOH3","PS8_1_FIOH3_IO07","IO07",null,"PS8_2_S2_PB_LT","START PUSHBUTTON LIGHT"]
["PS8_1_FIOH3","PS8_1_FIOH3_IO08","IO08",null,"SPARE"]
["PS8_1_FIOH3","PS8_1_FIOH3_IO09","IO09",null,"SPARE"]
["PS8_1_FIOH3","PS8_1_FIOH3_IO10","IO10",null,"SPARE"]
["PS8_1_FIOH3","PS8_1_FIOH3_IO11","IO11",null,"SPARE"]
["PS8_1_FIOH3","PS8_1_FIOH3_IO12","IO12",null,"SPARE"]
["PS8_1_FIOH3","PS8_1_FIOH3_IO13","IO13",null,"SPARE"]
["PS8_1_FIOH3","PS8_1_FIOH3_IO14","IO14",null,"SPARE"]
["PS8_1_FIOH3","PS8_1_FIOH3_IO15","IO15",null,"SPARE"]
["PS8_4_SIO1","PS8_4_SIO1_SI0","SI0",null,"PS8_4_EPC1","E-STOP PULLCORD"]
["PS8_4_SIO1","PS8_4_SIO1_SI1","SI1",null,"PS8_4_EPC1_2","E-STOP PULLCORD"]
["PS8_4_SIO1","PS8_4_SIO1_SI2","SI2",null,"PS8_4_EPC2","E-STOP PULLCORD"]
["PS8_4_SIO1","PS8_4_SIO1_SI3","SI3",null,"PS8_4_EPC2_2","E-STOP PULLCORD"]
["PS8_4_SIO1","PS8_4_SIO1_SI4","SI4",null,"PS8_5_EPC1","E-STOP PULLCORD"]
["PS8_4_SIO1","PS8_4_SIO1_SI5","SI5",null,"PS8_5_EPC1_2","E-STOP PULLCORD"]
["PS8_4_SIO1","PS8_4_SIO1_SI6","SI6",null,"PS8_5_EPC2","E-STOP PULLCORD"]
["PS8_4_SIO1","PS8_4_SIO1_SI7","SI7",null,"PS8_5_EPC2_2","E-STOP PULLCORD"]
["PS8_4_SIO1","PS8_4_SIO1_SO0","SO0",null,"PS8_4_VFD1_STO","VFD SAFETY ACTIVE"]
["PS8_4_SIO1","PS8_4_SIO1_SO1","SO1",null,"SPARE"]
["PS8_4_SIO1","PS8_4_SIO1_SO2","SO2",null,"PS8_5_VFD1_STO","VFD SAFETY ACTIVE"]
["PS8_4_SIO1","PS8_4_SIO1_SO3","SO3",null,"SPARE"]
["PS8_4_SIO1","PS8_4_SIO1_IO0","IO0",null,"PS8_4_FIOH1","HUB ARMOR BLOCK"]
["PS8_4_SIO1","PS8_4_SIO1_IO1","IO1",null,"SPARE"]
["PS8_4_SIO1","PS8_4_SIO1_IO2","IO2",null,"SPARE"]
["PS8_4_SIO1","PS8_4_SIO1_IO3","IO3",null,"SPARE"]
["PS8_4_FIOH1","PS8_4_FIOH1_IO00","IO00",null,"PS8_4_BCN1_A","AMBER BEACON LIGHT"]
["PS8_4_FIOH1","PS8_4_FIOH1_IO01","IO01",null,"PS8_4_BCN1_R","RED BEACON LIGHT"]
["PS8_4_FIOH1","PS8_4_FIOH1_IO02","IO02",null,"PS8_4_BCN2_R","RED BEACON LIGHT"]
["PS8_4_FIOH1","PS8_4_FIOH1_IO03","IO03",null,"SPARE"]
["PS8_4_FIOH1","PS8_4_FIOH1_IO04","IO04",null,"PS8_4_S1_PB","START PUSHBUTTON"]
["PS8_4_FIOH1","PS8_4_FIOH1_IO05","IO05",null,"PS8_4_S1_PB_LT","START PUSHBUTTON LIGHT"]
["PS8_4_FIOH1","PS8_4_FIOH1_IO06","IO06",null,"PS8_4_S2_PB","START PUSHBUTTON"]
["PS8_4_FIOH1","PS8_4_FIOH1_IO07","IO07",null,"PS8_4_S2_PB_LT","START PUSHBUTTON LIGHT"]
["PS8_4_FIOH1","PS8_4_FIOH1_IO08","IO08",null,"PS8_4_ENC1","ENCODER"]
["PS8_4_FIOH1","PS8_4_FIOH1_IO09","IO09",null,"SPARE"]
["PS8_4_FIOH1","PS8_4_FIOH1_IO10","IOH10",null,"PS8_4_JPE1","JAM PHOTOEYE"]
["PS8_4_FIOH1","PS8_4_FIOH1_IO11","IOH11",null,"SPARE"]
["PS8_4_FIOH1","PS8_4_FIOH1_IO12","IOH12",null,"PS8_4_JPE2","JAM PHOTOEYE"]
["PS8_4_FIOH1","PS8_4_FIOH1_IO13","IOH13",null,"SPARE"]
["PS8_4_FIOH1","PS8_4_FIOH1_IO14","IOH14",null,"SPARE"]
["PS8_4_FIOH1","PS8_4_FIOH1_IO15","IOH15",null,"SPARE"]
["PS8_5_FIO1","PS8_5_FIO1_IO00","IO00",null,"PS8_5_BCN1_A","AMBER BEACON LIGHT"]
["PS8_5_FIO1","PS8_5_FIO1_IO01","IO01",null,"PS8_5_BCN1_R","RED BEACON LIGHT"]
["PS8_5_FIO1","PS8_5_FIO1_IO02","IO02",null,"PS8_5_S1_PB","START PUSHBUTTON"]
["PS8_5_FIO1","PS8_5_FIO1_IO03","IO03",null,"PS8_5_S1_PB_LT","START PUSHBUTTON LIGHT"]
["PS8_5_FIO1","PS8_5_FIO1_IO04","IO04",null,"PS8_5_S2_PB","START PUSHBUTTON"]
["PS8_5_FIO1","PS8_5_FIO1_IO05","IO05",null,"PS8_5_S2_PB_LT","START PUSHBUTTON LIGHT"]
["PS8_5_FIO1","PS8_5_FIO1_IO06","IO06",null,"PS9_2_BCN1_A","AMBER BEACON LIGHT"]
["PS8_5_FIO1","PS8_5_FIO1_IO07","IO07",null,"PS9_2_BCN1_R","RED BEACON LIGHT"]
["PS8_5_FIO1","PS8_5_FIO1_IO08","IO08",null,"PS9_2_BCN2_R","RED BEACON LIGHT"]
["PS8_5_FIO1","PS8_5_FIO1_IO09","IO09",null,"SPARE"]
["PS8_5_FIO1","PS8_5_FIO1_IO10","IO10",null,"PS9_2_S1_PB","START PUSHBUTTON"]
["PS8_5_FIO1","PS8_5_FIO1_IO11","IO11",null,"PS9_2_S1_PB_LT","START PUSHBUTTON LIGHT"]
["PS8_5_FIO1","PS8_5_FIO1_IO12","IO12",null,"PS9_2_S2_PB","START PUSHBUTTON"]
["PS8_5_FIO1","PS8_5_FIO1_IO13","IO13",null,"PS9_2_S2_PB_LT","START PUSHBUTTON LIGHT"]
["PS8_5_FIO1","PS8_5_FIO1_IO14","IO14",null,"PS8_5_ENC1","ENCODER"]
["PS8_5_FIO1","PS8_5_FIO1_IO15","IO15",null,"PS8_5_JPE1","JAM PHOTOEYE"]
["PS8_9_FIO1","PS8_9_FIO1_IO00","IO00",null,"PS8_9_ENC1","ENCODER"]
["PS8_9_FIO1","PS8_9_FIO1_IO01","IO01",null,"SPARE"]
["PS8_9_FIO1","PS8_9_FIO1_IO02","IO02",null,"PS8_9_JPE1","JAM PHOTOEYE"]
["PS8_9_FIO1","PS8_9_FIO1_IO03","IO03",null,"SPARE"]
["PS8_9_FIO1","PS8_9_FIO1_IO04","IO04",null,"PS8_9_JR1_PB","JAM RESET PUSHBUTTON"]
["PS8_9_FIO1","PS8_9_FIO1_IO05","IO05",null,"PS8_9_JR1_PB_LT","JAM RESET PUSHBUTTON LIGHT"]
["PS8_9_FIO1","PS8_9_FIO1_IO06","IO06",null,"PS8_9_BCN1_A","AMBER BEACON LIGHT"]
["PS8_9_FIO1","PS8_9_FIO1_IO07","IO07",null,"SPARE"]
["PS8_9_FIO1","PS8_9_FIO1_IO08","IO08",null,"SPARE"]
["PS8_9_FIO1","PS8_9_FIO1_IO09","IO09",null,"SPARE"]
["PS8_9_FIO1","PS8_9_FIO1_IO10","IO10",null,"SPARE"]
["PS8_9_FIO1","PS8_9_FIO1_IO11","IO11",null,"SPARE"]
["PS8_9_FIO1","PS8_9_FIO1_IO12","IO12",null,"SPARE"]
["PS8_9_FIO1","PS8_9_FIO1_IO13","IO13",null,"SPARE"]
["PS8_9_FIO1","PS8_9_FIO1_IO14","IO14",null,"SPARE"]
["PS8_9_FIO1","PS8_9_FIO1_IO15","IO15",null,"SPARE"]
["PS8_11_FIO1","PS8_11_FIO1_IO00","IO00",null,"PS8_11_JPE1","JAM PHOTOEYE"]
["PS8_11_FIO1","PS8_11_FIO1_IO01","IO01",null,"PS8_11_JPE2","JAM PHOTOEYE"]
["PS8_11_FIO1","PS8_11_FIO1_IO02","IO02",null,"PS8_11_JPE3","JAM PHOTOEYE"]
["PS8_11_FIO1","PS8_11_FIO1_IO03","IO03",null,"PS8_11_JPE4","JAM PHOTOEYE"]
["PS8_11_FIO1","PS8_11_FIO1_IO04","IO04",null,"PS8_11_BCN1_A","AMBER BEACON LIGHT"]
["PS8_11_FIO1","PS8_11_FIO1_IO05","IO05",null,"PS8_11_BCN1_R","RED BEACON LIGHT"]
["PS8_11_FIO1","PS8_11_FIO1_IO06","IO06",null,"PS8_11_JR1_PB","JAM RESET PUSHBUTTON"]
["PS8_11_FIO1","PS8_11_FIO1_IO07","IO07",null,"PS8_11_JR1_PB_LT","JAM RESET PUSHBUTTON LIGHT"]
["PS8_11_FIO1","PS8_11_FIO1_IO08","IO08",null,"PS8_11_JR2_PB","JAM RESET PUSHBUTTON"]
["PS8_11_FIO1","PS8_11_FIO1_IO09","IO09",null,"PS8_11_JR2_PB_LT","JAM RESET PUSHBUTTON LIGHT"]
["PS8_11_FIO1","PS8_11_FIO1_IO10","IO10",null,"PS8_11_S1_PB","START PUSHBUTTON"]
["PS8_11_FIO1","PS8_11_FIO1_IO11","IO11",null,"PS8_11_S1_PB_LT","START PUSHBUTTON LIGHT"]
["PS8_11_FIO1","PS8_11_FIO1_IO12","IO12",null,"PS8_11_BCN3_A","AMBER BEACON LIGHT"]
["PS8_11_FIO1","PS8_11_FIO1_IO13","IO13",null,"PS8_11_BCN3_B","BLUE BEACON LIGHT"]
["PS8_11_FIO1","PS8_11_FIO1_IO14","IO14",null,"PS8_11_FIOH1","HUB ARMOR BLOCK"]
["PS8_11_FIO1","PS8_11_FIO1_IO15","IO15",null,"SPARE"]
["PS8_11_FIO2","PS8_11_FIO2_IO00","IO00",null,"PS8_11_CH3_BCN1_A","AMBER BEACON LIGHT"]
["PS8_11_FIO2","PS8_11_FIO2_IO01","IO01",null,"PS8_11_CH3_BCN1_B","BLUE BEACON LIGHT"]
["PS8_11_FIO2","PS8_11_FIO2_IO02","IO02",null,"PS8_11_CH3_BCN1_G","GREEN BEACON LIGHT"]
["PS8_11_FIO2","PS8_11_FIO2_IO03","IO03",null,"PS8_11_CH3_FPE1","FULL PHOTOEYE"]
["PS8_11_FIO2","PS8_11_FIO2_IO04","IO04",null,"PS8_11_CH3_FPE2","FULL PHOTOEYE"]
["PS8_11_FIO2","PS8_11_FIO2_IO05","IO05",null,"PS8_11_CH3_JPE1","JAM PHOTOEYE"]
["PS8_11_FIO2","PS8_11_FIO2_IO06","IO06",null,"PS8_11_CH3_S1_PB","START PUSHBUTTON"]
["PS8_11_FIO2","PS8_11_FIO2_IO07","IO07",null,"PS8_11_CH3_S1_PB_LT","START PUSHBUTTON LIGHT"]
["PS8_11_FIO2","PS8_11_FIO2_IO08","IO08",null,"PS8_11_CH4_BCN1_A","AMBER BEACON LIGHT"]
["PS8_11_FIO2","PS8_11_FIO2_IO09","IO09",null,"PS8_11_CH4_BCN1_B","BLUE BEACON LIGHT"]
["PS8_11_FIO2","PS8_11_FIO2_IO10","IO10",null,"PS8_11_CH4_BCN1_G","GREEN BEACON LIGHT"]
["PS8_11_FIO2","PS8_11_FIO2_IO11","IO11",null,"PS8_11_CH4_FPE1","FULL PHOTOEYE"]
["PS8_11_FIO2","PS8_11_FIO2_IO12","IO12",null,"PS8_11_CH4_FPE2","FULL PHOTOEYE"]
["PS8_11_FIO2","PS8_11_FIO2_IO13","IO13",null,"PS8_11_CH4_JPE1","JAM PHOTOEYE"]
["PS8_11_FIO2","PS8_11_FIO2_IO14","IO14",null,"PS8_11_FIOH2","HUB ARMOR BLOCK"]
["PS8_11_FIO2","PS8_11_FIO2_IO15","IO15",null,"SPARE"]
["PS8_11_FIOH1","PS8_11_FIOH1_IO00","IO00",null,"PS8_11_CH1_BCN1_A","AMBER BEACON LIGHT"]
["PS8_11_FIOH1","PS8_11_FIOH1_IO01","IO01",null,"PS8_11_CH1_BCN1_B","BLUE BEACON LIGHT"]
["PS8_11_FIOH1","PS8_11_FIOH1_IO02","IO02",null,"PS8_11_CH1_BCN1_G","GREEN BEACON LIGHT"]
["PS8_11_FIOH1","PS8_11_FIOH1_IO03","IO03",null,"PS8_11_CH1_FPE1","FULL PHOTOEYE"]
["PS8_11_FIOH1","PS8_11_FIOH1_IO04","IO04",null,"PS8_11_CH1_FPE2","FULL PHOTOEYE"]
["PS8_11_FIOH1","PS8_11_FIOH1_IO05","IO05",null,"PS8_11_CH1_S1_PB","START PUSHBUTTON"]
["PS8_11_FIOH1","PS8_11_FIOH1_IO06","IO06",null,"PS8_11_CH1_S1_PB_LT","START PUSHBUTTON LIGHT"]
["PS8_11_FIOH1","PS8_11_FIOH1_IO07","IO07",null,"PS8_11_CH2_BCN1_A","AMBER BEACON LIGHT"]
["PS8_11_FIOH1","PS8_11_FIOH1_IO08","IO08",null,"PS8_11_CH2_BCN1_B","BLUE BEACON LIGHT"]
["PS8_11_FIOH1","PS8_11_FIOH1_IO09","IO09",null,"PS8_11_CH2_BCN1_G","GREEN BEACON LIGHT"]
["PS8_11_FIOH1","PS8_11_FIOH1_IO10","IO10",null,"PS8_11_CH2_FPE1","FULL PHOTOEYE"]
["PS8_11_FIOH1","PS8_11_FIOH1_IO11","IO11",null,"PS8_11_CH2_FPE2","FULL PHOTOEYE"]
["PS8_11_FIOH1","PS8_11_FIOH1_IO12","IO12",null,"PS8_11_CH2_S1_PB","START PUSHBUTTON"]
["PS8_11_FIOH1","PS8_11_FIOH1_IO13","IO13",null,"PS8_11_CH2_S1_PB_LT","START PUSHBUTTON LIGHT"]
["PS8_11_FIOH1","PS8_11_FIOH1_IO14","IO14",null,"PS8_11_CH4_S1_PB","START PUSHBUTTON"]
["PS8_11_FIOH1","PS8_11_FIOH1_IO15","IO15",null,"PS8_11_CH4_S1_PB_LT","START PUSHBUTTON LIGHT"]
["PS8_11_FIOH2","PS8_11_FIOH2_IO00","IO00",null,"PS8_11_DIV1_PX1","LIMIT SWITCH"]
["PS8_11_FIOH2","PS8_11_FIOH2_IO01","IO01",null,"PS8_11_DIV1_PX2","LIMIT SWITCH"]
["PS8_11_FIOH2","PS8_11_FIOH2_IO02","IO02",null,"PS8_11_DIV1_SOL1","SOLENOID VALVE"]
["PS8_11_FIOH2","PS8_11_FIOH2_IO03","IO03",null,"PS8_11_DIV1_SOL2","SOLENOID VALVE"]
["PS8_11_FIOH2","PS8_11_FIOH2_IO04","IO04",null,"PS8_11_DIV2_PX1","LIMIT SWITCH"]
["PS8_11_FIOH2","PS8_11_FIOH2_IO05","IO05",null,"PS8_11_DIV2_PX2","LIMIT SWITCH"]
["PS8_11_FIOH2","PS8_11_FIOH2_IO06","IO06",null,"PS8_11_DIV2_SOL1","SOLENOID VALVE"]
["PS8_11_FIOH2","PS8_11_FIOH2_IO07","IO07",null,"PS8_11_DIV2_SOL2","SOLENOID VALVE"]
["PS8_11_FIOH2","PS8_11_FIOH2_IO08","IO08",null,"PS8_11_DIV3_PX1","LIMIT SWITCH"]
["PS8_11_FIOH2","PS8_11_FIOH2_IO09","IO09",null,"PS8_11_DIV3_PX2","LIMIT SWITCH"]
["PS8_11_FIOH2","PS8_11_FIOH2_IO10","IO10",null,"PS8_11_DIV3_SOL1","SOLENOID VALVE"]
["PS8_11_FIOH2","PS8_11_FIOH2_IO11","IO11",null,"PS8_11_DIV3_SOL2","SOLENOID VALVE"]
["PS8_11_FIOH2","PS8_11_FIOH2_IO12","IO12",null,"PS8_11_DIV4_PX1","LIMIT SWITCH"]
["PS8_11_FIOH2","PS8_11_FIOH2_IO13","IO13",null,"PS8_11_DIV4_PX2","LIMIT SWITCH"]
["PS8_11_FIOH2","PS8_11_FIOH2_IO14","IO14",null,"PS8_11_DIV4_SOL1","SOLENOID VALVE"]
["PS8_11_FIOH2","PS8_11_FIOH2_IO15","IO15",null,"PS8_11_DIV4_SOL2","SOLENOID VALVE"]
["PS9_3_FIO1","PS9_3_FIO1_IO00","IO00",null,"PS9_3_BCN1_A","AMBER BEACON LIGHT"]
["PS9_3_FIO1","PS9_3_FIO1_IO01","IO01",null,"SPARE"]
["PS9_3_FIO1","PS9_3_FIO1_IO02","IO02",null,"PS9_3_JR1_PB","JAM RESET PUSHBUTTON"]
["PS9_3_FIO1","PS9_3_FIO1_IO03","IO03",null,"PS9_3_JR1_PB_LT","JAM RESET PUSHBUTTON LIGHT"]
["PS9_3_FIO1","PS9_3_FIO1_IO04","IO04",null,"PS9_3CH1_BCN1_A","AMBER BEACON LIGHT"]
["PS9_3_FIO1","PS9_3_FIO1_IO05","IO05",null,"PS9_3CH1_BCN1_B","BLUE BEACON LIGHT"]
["PS9_3_FIO1","PS9_3_FIO1_IO06","IO06",null,"PS9_3CH1_BCN1_G","GREEN BEACON LIGHT"]
["PS9_3_FIO1","PS9_3_FIO1_IO07","IO07",null,"PS9_3_JPE3","JAM PHOTOEYE"]
["PS9_3_FIO1","PS9_3_FIO1_IO08","IO08",null,"PS9_3CH1_S1_PB","START PUSHBUTTON"]
["PS9_3_FIO1","PS9_3_FIO1_IO09","IO09",null,"PS9_3CH1_S1_PB_LT","START PUSHBUTTON LIGHT"]
["PS9_3_FIO1","PS9_3_FIO1_IO10","IO10",null,"PS9_3CH2_BCN1_A","AMBER BEACON LIGHT"]
["PS9_3_FIO1","PS9_3_FIO1_IO11","IO11",null,"PS9_3CH2_BCN1_B","BLUE BEACON LIGHT"]
["PS9_3_FIO1","PS9_3_FIO1_IO12","IO12",null,"PS9_3CH2_BCN1_G","GREEN BEACON LIGHT"]
["PS9_3_FIO1","PS9_3_FIO1_IO13","IO13",null,"SPARE"]
["PS9_3_FIO1","PS9_3_FIO1_IO14","IO14",null,"PS9_3_FIOH1","HUB ARMOR BLOCK"]
["PS9_3_FIO1","PS9_3_FIO1_IO15","IO15",null,"SPARE"]
["PS9_3_FIO2","PS9_3_FIO2_IO00","IO00",null,"PS9_3CH3_BCN1_A","AMBER BEACON LIGHT"]
["PS9_3_FIO2","PS9_3_FIO2_IO01","IO01",null,"PS9_3CH3_BCN1_B","BLUE BEACON LIGHT"]
["PS9_3_FIO2","PS9_3_FIO2_IO02","IO02",null,"PS9_3CH3_BCN1_G","GREEN BEACON LIGHT"]
["PS9_3_FIO2","PS9_3_FIO2_IO03","IO03",null,"PS9_3CH3_JPE1","JAM PHOTOEYE"]
["PS9_3_FIO2","PS9_3_FIO2_IO04","IO04",null,"PS9_3CH3_FPE1","FULL PHOTOEYE"]
["PS9_3_FIO2","PS9_3_FIO2_IO05","IO05",null,"PS9_3CH3_FPE2","FULL PHOTOEYE"]
["PS9_3_FIO2","PS9_3_FIO2_IO06","IO06",null,"PS9_3_S1_PB","START PUSHBUTTON"]
["PS9_3_FIO2","PS9_3_FIO2_IO07","IO07",null,"PS9_3_S1_PB_LT","START PUSHBUTTON LIGHT"]
["PS9_3_FIO2","PS9_3_FIO2_IO08","IO08",null,"PS9_3CH3_S1_PB","START PUSHBUTTON"]
["PS9_3_FIO2","PS9_3_FIO2_IO09","IO09",null,"PS9_3CH3_S1_PB_LT","START PUSHBUTTON LIGHT"]
["PS9_3_FIO2","PS9_3_FIO2_IO10","IO10",null,"PS9_3CH4_BCN1_A","AMBER BEACON LIGHT"]
["PS9_3_FIO2","PS9_3_FIO2_IO11","IO11",null,"PS9_3CH4_BCN1_B","BLUE BEACON LIGHT"]
["PS9_3_FIO2","PS9_3_FIO2_IO12","IO12",null,"PS9_3CH4_BCN1_G","GREEN BEACON LIGHT"]
["PS9_3_FIO2","PS9_3_FIO2_IO13","IO13",null,"SPARE"]
["PS9_3_FIO2","PS9_3_FIO2_IO14","IO14",null,"PS9_3_FIOH2","HUB ARMOR BLOCK"]
["PS9_3_FIO2","PS9_3_FIO2_IO15","IO15",null,"SPARE"]
["PS9_3_FIOH1","PS9_3_FIOH1_IO00","IO00",null,"PS9_3CH1_FPE1","FULL PHOTOEYE"]
["PS9_3_FIOH1","PS9_3_FIOH1_IO01","IO01",null,"PS9_3CH1_FPE2","FULL PHOTOEYE"]
["PS9_3_FIOH1","PS9_3_FIOH1_IO02","IO02",null,"PS9_3CH1_JPE1","JAM PHOTOEYE"]
["PS9_3_FIOH1","PS9_3_FIOH1_IO03","IO03",null,"PS9_3CH2_JPE1","JAM PHOTOEYE"]
["PS9_3_FIOH1","PS9_3_FIOH1_IO04","IO04",null,"PS9_3CH2_FPE1","FULL PHOTOEYE"]
["PS9_3_FIOH1","PS9_3_FIOH1_IO05","IO05",null,"PS9_3CH2_FPE2","FULL PHOTOEYE"]
["PS9_3_FIOH1","PS9_3_FIOH1_IO06","IO06",null,"PS9_3CH2_S1_PB","START PUSHBUTTON"]
["PS9_3_FIOH1","PS9_3_FIOH1_IO07","IO07",null,"PS9_3CH2_S1_PB_LT","START PUSHBUTTON LIGHT"]
["PS9_3_FIOH1","PS9_3_FIOH1_IO08","IO08",null,"PS9_3DIV1_PX1","LIMIT SWITCH"]
["PS9_3_FIOH1","PS9_3_FIOH1_IO09","IO09",null,"PS9_3DIV1_PX2","LIMIT SWITCH"]
["PS9_3_FIOH1","PS9_3_FIOH1_IO10","IO10",null,"PS9_3DIV1_SOL1","SOLENOID VALVE"]
["PS9_3_FIOH1","PS9_3_FIOH1_IO11","IO11",null,"PS9_3DIV1_SOL2","SOLENOID VALVE"]
["PS9_3_FIOH1","PS9_3_FIOH1_IO12","IO12",null,"PS9_3DIV2_PX1","LIMIT SWITCH"]
["PS9_3_FIOH1","PS9_3_FIOH1_IO13","IO13",null,"PS9_3DIV2_PX2","LIMIT SWITCH"]
["PS9_3_FIOH1","PS9_3_FIOH1_IO14","IO14",null,"PS9_3DIV2_SOL1","SOLENOID VALVE"]
["PS9_3_FIOH1","PS9_3_FIOH1_IO15","IO15",null,"PS9_3DIV2_SOL2","SOLENOID VALVE"]
["PS9_3_FIOH2","PS9_3_FIOH2_IO00","IO00",null,"PS9_3CH4_FPE1","FULL PHOTOEYE"]
["PS9_3_FIOH2","PS9_3_FIOH2_IO01","IO01",null,"PS9_3CH4_FPE2","FULL PHOTOEYE"]
["PS9_3_FIOH2","PS9_3_FIOH2_IO02","IO02",null,"PS9_3CH4_JPE1","JAM PHOTOEYE"]
["PS9_3_FIOH2","PS9_3_FIOH2_IO03","IO03",null,"PS9_3CH4_S1_PB","START PUSHBUTTON"]
["PS9_3_FIOH2","PS9_3_FIOH2_IO04","IO04",null,"PS9_3CH4_S1_PB_LT","START PUSHBUTTON LIGHT"]
["PS9_3_FIOH2","PS9_3_FIOH2_IO05","IO05",null,"PS9_3DIV3_PX1","LIMIT SWITCH"]
["PS9_3_FIOH2","PS9_3_FIOH2_IO06","IO06",null,"PS9_3DIV3_PX2","LIMIT SWITCH"]
["PS9_3_FIOH2","PS9_3_FIOH2_IO07","IO07",null,"PS9_3DIV3_SOL1","SOLENOID VALVE"]
["PS9_3_FIOH2","PS9_3_FIOH2_IO08","IO08",null,"PS9_3DIV3_SOL2","SOLENOID VALVE"]
["PS9_3_FIOH2","PS9_3_FIOH2_IO09","IO09",null,"PS9_3DIV4_PX1","LIMIT SWITCH"]
["PS9_3_FIOH2","PS9_3_FIOH2_IO10","IO10",null,"PS9_3DIV4_PX2","LIMIT SWITCH"]
["PS9_3_FIOH2","PS9_3_FIOH2_IO11","IO11",null,"PS9_3DIV4_SOL1","SOLENOID VALVE"]
["PS9_3_FIOH2","PS9_3_FIOH2_IO12","IO12",null,"PS9_3DIV4_SOL2","SOLENOID VALVE"]
["PS9_3_FIOH2","PS9_3_FIOH2_IO13","IO13",null,"PS9_4CH_FPE1","FULL PHOTOEYE"]
["PS9_3_FIOH2","PS9_3_FIOH2_IO14","IO14",null,"PS9_3_PS1","PRESSURE SENSOR"]
["PS9_3_FIOH2","PS9_3_FIOH2_IO15","IO15",null,"SPARE"]
["FL2074_2_VFD1","FL2074_2_VFD1_I0","I0",null,"FL2074_2_DISC","DISCONNECT AUX"]
["FL2074_2_VFD1","FL2074_2_VFD1_I1","I1",null,"SPARE"]
["FL2074_2_VFD1","FL2074_2_VFD1_I2","I2",null,"FL2074_2_PE1","TRACKING PHOTOEYE"]
["FL2074_2_VFD1","FL2074_2_VFD1_I3","I3",null,"FL2074_3CH_PE1","FULL PHOTOEYE"]
["FL2074_2_VFD1","FL2074_2_VFD1_IO0","IO0",null,"FL2074_2_JR2_PB","JAM RESET PUSHBUTTON"]
["FL2074_2_VFD1","FL2074_2_VFD1_IO1","IO1",null,"FL2074_2_JR2_PB_LT","JAM RESET PUSHBUTTON LIGHT"]
["FL2074_2_VFD1","FL2074_2_VFD1_SI0","SI0",null,"FL2074_1_ESTOP","ESTOP OK"]
["FL2074_2_VFD1","FL2074_2_VFD1_SI1","SI1",null,"SPARE"]
["FL2074_2_VFD1","FL2074_2_VFD1_SI2","SI2",null,"SPARE"]
["FL2074_2_VFD1","FL2074_2_VFD1_SI3","SI3",null,"SPARE"]
["FL2074_2_VFD1","FL2074_2_VFD1_SO0","SO0",null,"FL2074_1_STO1","ESTOP OK"]
["FL2078_2_VFD1","FL2078_2_VFD1_I0","I0",null,"FL2078_2_DISC","DISCONNECT AUX"]
["FL2078_2_VFD1","FL2078_2_VFD1_I1","I1",null,"SPARE"]
["FL2078_2_VFD1","FL2078_2_VFD1_I2","I2",null,"FL2078_2_PE1","TRACKING PHOTOEYE"]
["FL2078_2_VFD1","FL2078_2_VFD1_I3","I3",null,"FL2078_3CH_PE1","FULL PHOTOEYE"]
["FL2078_2_VFD1","FL2078_2_VFD1_IO0","IO0",null,"FL2078_2_JR2_PB","JAM RESET PUSHBUTTON"]
["FL2078_2_VFD1","FL2078_2_VFD1_IO1","IO1",null,"FL2078_2_JR2_PB_LT","JAM RESET PUSHBUTTON LIGHT"]
["FL2078_2_VFD1","FL2078_2_VFD1_SI0","SI0",null,"FL2078_1_ESTOP","ESTOP OK"]
["FL2078_2_VFD1","FL2078_2_VFD1_SI1","SI1",null,"SPARE"]
["FL2078_2_VFD1","FL2078_2_VFD1_SI2","SI2",null,"SPARE"]
["FL2078_2_VFD1","FL2078_2_VFD1_SI3","SI3",null,"SPARE"]
["FL2078_2_VFD1","FL2078_2_VFD1_SO0","SO0",null,"FL2078_1_STO1","ESTOP OK"]
["FL2086_2_VFD1","FL2086_2_VFD1_I0","I0",null,"FL2086_2_DISC","DISCONNECT AUX"]
["FL2086_2_VFD1","FL2086_2_VFD1_I1","I1",null,"SPARE"]
["FL2086_2_VFD1","FL2086_2_VFD1_I2","I2",null,"FL2086_2_PE1","TRACKING PHOTOEYE"]
["FL2086_2_VFD1","FL2086_2_VFD1_I3","I3",null,"FL2086_3CH_PE1","FULL PHOTOEYE"]
["FL2086_2_VFD1","FL2086_2_VFD1_IO0","IO0",null,"FL2086_2_JR2_PB","JAM RESET PUSHBUTTON"]
["FL2086_2_VFD1","FL2086_2_VFD1_IO1","IO1",null,"FL2086_2_JR2_PB_LT","JAM RESET PUSHBUTTON LIGHT"]
["FL2086_2_VFD1","FL2086_2_VFD1_SI0","SI0",null,"FL2086_1_ESTOP","ESTOP OK"]
["FL2086_2_VFD1","FL2086_2_VFD1_SI1","SI1",null,"SPARE"]
["FL2086_2_VFD1","FL2086_2_VFD1_SI2","SI2",null,"SPARE"]
["FL2086_2_VFD1","FL2086_2_VFD1_SI3","SI3",null,"SPARE"]
["FL2086_2_VFD1","FL2086_2_VFD1_SO0","SO0",null,"FL2086_1_STO1","ESTOP OK"]
["FL2090_2_VFD1","FL2090_2_VFD1_I0","I0",null,"FL2090_2_DISC","DISCONNECT AUX"]
["FL2090_2_VFD1","FL2090_2_VFD1_I1","I1",null,"SPARE"]
["FL2090_2_VFD1","FL2090_2_VFD1_I2","I2",null,"FL2090_2_PE1","TRACKING PHOTOEYE"]
["FL2090_2_VFD1","FL2090_2_VFD1_I3","I3",null,"FL2090_3CH_PE1","FULL PHOTOEYE"]
["FL2090_2_VFD1","FL2090_2_VFD1_IO0","IO0",null,"FL2090_2_JR2_PB","JAM RESET PUSHBUTTON"]
["FL2090_2_VFD1","FL2090_2_VFD1_IO1","IO1",null,"FL2090_2_JR2_PB_LT","JAM RESET PUSHBUTTON LIGHT"]
["FL2090_2_VFD1","FL2090_2_VFD1_SI0","SI0",null,"FL2090_1_ESTOP","ESTOP OK"]
["FL2090_2_VFD1","FL2090_2_VFD1_SI1","SI1",null,"SPARE"]
["FL2090_2_VFD1","FL2090_2_VFD1_SI2","SI2",null,"SPARE"]
["FL2090_2_VFD1","FL2090_2_VFD1_SI3","SI3",null,"SPARE"]
["FL2090_2_VFD1","FL2090_2_VFD1_SO0","SO0",null,"FL2090_1_STO1","ESTOP OK"]
["FL2094_2_VFD1","FL2094_2_VFD1_I0","I0",null,"FL2094_2_DISC","DISCONNECT AUX"]
["FL2094_2_VFD1","FL2094_2_VFD1_I1","I1",null,"SPARE"]
["FL2094_2_VFD1","FL2094_2_VFD1_I2","I2",null,"FL2094_2_PE1","TRACKING PHOTOEYE"]
["FL2094_2_VFD1","FL2094_2_VFD1_I3","I3",null,"FL2094_3CH_PE1","FULL PHOTOEYE"]
["FL2094_2_VFD1","FL2094_2_VFD1_IO0","IO0",null,"FL2094_2_JR2_PB","JAM RESET PUSHBUTTON"]
["FL2094_2_VFD1","FL2094_2_VFD1_IO1","IO1",null,"FL2094_2_JR2_PB_LT","JAM RESET PUSHBUTTON LIGHT"]
["FL2094_2_VFD1","FL2094_2_VFD1_SI0","SI0",null,"FL2094_1_ESTOP","ESTOP OK"]
["FL2094_2_VFD1","FL2094_2_VFD1_SI1","SI1",null,"SPARE"]
["FL2094_2_VFD1","FL2094_2_VFD1_SI2","SI2",null,"SPARE"]
["FL2094_2_VFD1","FL2094_2_VFD1_SI3","SI3",null,"SPARE"]
["FL2094_2_VFD1","FL2094_2_VFD1_SO0","SO0",null,"FL2094_1_STO1","ESTOP OK"]
["FL4066_2_VFD1","FL4066_2_VFD1_I0","I0",null,"FL4066_2_DISC","DISCONNECT AUX"]
["FL4066_2_VFD1","FL4066_2_VFD1_I1","I1",null,"SPARE"]
["FL4066_2_VFD1","FL4066_2_VFD1_I2","I2",null,"FL4066_2_PE1","TRACKING PHOTOEYE"]
["FL4066_2_VFD1","FL4066_2_VFD1_I3","I3",null,"FL4066_3CH_PE1","FULL PHOTOEYE"]
["FL4066_2_VFD1","FL4066_2_VFD1_IO0","IO0",null,"FL4066_2_JR2_PB","JAM RESET PUSHBUTTON"]
["FL4066_2_VFD1","FL4066_2_VFD1_IO1","IO1",null,"FL4066_2_JR2_PB_LT","JAM RESET PUSHBUTTON LIGHT"]
["FL4066_2_VFD1","FL4066_2_VFD1_SI0","SI0",null,"FL4066_1_ESTOP","ESTOP OK"]
["FL4066_2_VFD1","FL4066_2_VFD1_SI1","SI1",null,"SPARE"]
["FL4066_2_VFD1","FL4066_2_VFD1_SI2","SI2",null,"SPARE"]
["FL4066_2_VFD1","FL4066_2_VFD1_SI3","SI3",null,"SPARE"]
["FL4066_2_VFD1","FL4066_2_VFD1_SO0","SO0",null,"FL4066_1_STO1","ESTOP OK"]
["FL4070_2_VFD1","FL4070_2_VFD1_I0","I0",null,"FL4070_2_DISC","DISCONNECT AUX"]
["FL4070_2_VFD1","FL4070_2_VFD1_I1","I1",null,"SPARE"]
["FL4070_2_VFD1","FL4070_2_VFD1_I2","I2",null,"FL4070_2_PE1","TRACKING PHOTOEYE"]
["FL4070_2_VFD1","FL4070_2_VFD1_I3","I3",null,"FL4070_3CH_PE1","FULL PHOTOEYE"]
["FL4070_2_VFD1","FL4070_2_VFD1_IO0","IO0",null,"FL4070_2_JR2_PB","JAM RESET PUSHBUTTON"]
["FL4070_2_VFD1","FL4070_2_VFD1_IO1","IO1",null,"FL4070_2_JR2_PB_LT","JAM RESET PUSHBUTTON LIGHT"]
["FL4070_2_VFD1","FL4070_2_VFD1_SI0","SI0",null,"FL4070_1_ESTOP","ESTOP OK"]
["FL4070_2_VFD1","FL4070_2_VFD1_SI1","SI1",null,"SPARE"]
["FL4070_2_VFD1","FL4070_2_VFD1_SI2","SI2",null,"SPARE"]
["FL4070_2_VFD1","FL4070_2_VFD1_SI3","SI3",null,"SPARE"]
["FL4070_2_VFD1","FL4070_2_VFD1_SO0","SO0",null,"FL4070_1_STO1","ESTOP OK"]
["FL4074_2_VFD1","FL4074_2_VFD1_I0","I0",null,"FL4074_2_DISC","DISCONNECT AUX"]
["FL4074_2_VFD1","FL4074_2_VFD1_I1","I1",null,"SPARE"]
["FL4074_2_VFD1","FL4074_2_VFD1_I2","I2",null,"FL4074_2_PE1","TRACKING PHOTOEYE"]
["FL4074_2_VFD1","FL4074_2_VFD1_I3","I3",null,"FL4074_3CH_PE1","FULL PHOTOEYE"]
["FL4074_2_VFD1","FL4074_2_VFD1_IO0","IO0",null,"FL4074_2_JR2_PB","JAM RESET PUSHBUTTON"]
["FL4074_2_VFD1","FL4074_2_VFD1_IO1","IO1",null,"FL4074_2_JR2_PB_LT","JAM RESET PUSHBUTTON LIGHT"]
["FL4074_2_VFD1","FL4074_2_VFD1_SI0","SI0",null,"FL4074_1_ESTOP","ESTOP OK"]
["FL4074_2_VFD1","FL4074_2_VFD1_SI1","SI1",null,"SPARE"]
["FL4074_2_VFD1","FL4074_2_VFD1_SI2","SI2",null,"SPARE"]
["FL4074_2_VFD1","FL4074_2_VFD1_SI3","SI3",null,"SPARE"]
["FL4074_2_VFD1","FL4074_2_VFD1_SO0","SO0",null,"FL4074_1_STO1","ESTOP OK"]
["FL4078_2_VFD1","FL4078_2_VFD1_I0","I0",null,"FL4078_2_DISC","DISCONNECT AUX"]
["FL4078_2_VFD1","FL4078_2_VFD1_I1","I1",null,"SPARE"]
["FL4078_2_VFD1","FL4078_2_VFD1_I2","I2",null,"FL4078_2_PE1","TRACKING PHOTOEYE"]
["FL4078_2_VFD1","FL4078_2_VFD1_I3","I3",null,"FL4078_3CH_PE1","FULL PHOTOEYE"]
["FL4078_2_VFD1","FL4078_2_VFD1_IO0","IO0",null,"FL4078_2_JR2_PB","JAM RESET PUSHBUTTON"]
["FL4078_2_VFD1","FL4078_2_VFD1_IO1","IO1",null,"FL4078_2_JR2_PB_LT","JAM RESET PUSHBUTTON LIGHT"]
["FL4078_2_VFD1","FL4078_2_VFD1_SI0","SI0",null,"FL4078_1_ESTOP","ESTOP OK"]
["FL4078_2_VFD1","FL4078_2_VFD1_SI1","SI1",null,"SPARE"]
["FL4078_2_VFD1","FL4078_2_VFD1_SI2","SI2",null,"SPARE"]
["FL4078_2_VFD1","FL4078_2_VFD1_SI3","SI3",null,"SPARE"]
["FL4078_2_VFD1","FL4078_2_VFD1_SO0","SO0",null,"FL4078_1_STO1","ESTOP OK"]
["FL4082_2_VFD1","FL4082_2_VFD1_I0","I0",null,"FL4082_2_DISC","DISCONNECT AUX"]
["FL4082_2_VFD1","FL4082_2_VFD1_I1","I1",null,"SPARE"]
["FL4082_2_VFD1","FL4082_2_VFD1_I2","I2",null,"FL4082_2_PE1","TRACKING PHOTOEYE"]
["FL4082_2_VFD1","FL4082_2_VFD1_I3","I3",null,"FL4082_3CH_PE1","FULL PHOTOEYE"]
["FL4082_2_VFD1","FL4082_2_VFD1_IO0","IO0",null,"FL4082_2_JR2_PB","JAM RESET PUSHBUTTON"]
["FL4082_2_VFD1","FL4082_2_VFD1_IO1","IO1",null,"FL4082_2_JR2_PB_LT","JAM RESET PUSHBUTTON LIGHT"]
["FL4082_2_VFD1","FL4082_2_VFD1_SI0","SI0",null,"FL4082_1_ESTOP","ESTOP OK"]
["FL4082_2_VFD1","FL4082_2_VFD1_SI1","SI1",null,"SPARE"]
["FL4082_2_VFD1","FL4082_2_VFD1_SI2","SI2",null,"SPARE"]
["FL4082_2_VFD1","FL4082_2_VFD1_SI3","SI3",null,"SPARE"]
["FL4082_2_VFD1","FL4082_2_VFD1_SO0","SO0",null,"FL4082_1_STO1","ESTOP OK"]
["FL2074_FIOH1","FL2074_FIOH1_IO0","IO0",null,"FL2074_2_BCN1_A","AMBER BEACON LIGHT"]
["FL2074_FIOH1","FL2074_FIOH1_IO1","IO1",null,"FL2074_2_BCN1_B","BLUE BEACON LIGHT"]
["FL2074_FIOH1","FL2074_FIOH1_IO2","IO2",null,"FL2074_2_JR1_PB","JAM RESET PUSHBUTTON"]
["FL2074_FIOH1","FL2074_FIOH1_IO3","IO3",null,"FL2074_2_JR1_PB_LT","JAM RESET PUSHBUTTON LIGHT"]
["FL2074_FIOH1","FL2074_FIOH1_IO4","IO4",null,"FL2074_1CH_PE1","FULL PHOTOEYE"]
["FL2074_FIOH1","FL2074_FIOH1_IO5","IO5",null,"SPARE"]
["FL2074_FIOH1","FL2074_FIOH1_IO6","IO6",null,"FL2074_BCN2_A","AMBER BEACON LIGHT","2025-06-18"]
["FL2074_FIOH1","FL2074_FIOH1_IO7","IO7",null,"FL2074_BCN2_B","BLUE BEACON LIGHT"]
["S012080_FIOH1","S012080_FIOH1_IO0","IO0",null,"FL2078_2_BCN1_A","AMBER BEACON LIGHT"]
["S012080_FIOH1","S012080_FIOH1_IO1","IO1",null,"FL2078_2_BCN1_B","BLUE BEACON LIGHT"]
["S012080_FIOH1","S012080_FIOH1_IO2","IO2",null,"FL2078_2_JR1_PB","JAM RESET PUSHBUTTON"]
["S012080_FIOH1","S012080_FIOH1_IO3","IO3",null,"FL2078_2_JR1_PB_LT","JAM RESET PUSHBUTTON LIGHT"]
["S012080_FIOH1","S012080_FIOH1_IO4","IO4",null,"FL2078_1CH_PE1","FULL PHOTOEYE"]
["S012080_FIOH1","S012080_FIOH1_IO5","IO5",null,"SPARE"]
["S012080_FIOH1","S012080_FIOH1_IO6","IO6",null,"FL2078_BCN2_A","AMBER BEACON LIGHT","2025-06-18"]
["S012080_FIOH1","S012080_FIOH1_IO7","IO7",null,"FL2078_BCN2_B","BLUE BEACON LIGHT"]
["FL2086_FIOH1","FL2086_FIOH1_IO0","IO0",null,"FL2086_2_BCN1_A","AMBER BEACON LIGHT"]
["FL2086_FIOH1","FL2086_FIOH2_IO1","IO1",null,"FL2086_2_BCN1_B","BLUE BEACON LIGHT"]
["FL2086_FIOH1","FL2086_FIOH3_IO2","IO2",null,"FL2086_2_JR1_PB","JAM RESET PUSHBUTTON"]
["FL2086_FIOH1","FL2086_FIOH4_IO3","IO3",null,"FL2086_2_JR1_PB_LT","JAM RESET PUSHBUTTON LIGHT"]
["FL2086_FIOH1","FL2086_FIOH5_IO4","IO4",null,"FL2086_1CH_PE1","FULL PHOTOEYE"]
["FL2086_FIOH1","FL2086_FIOH6_IO5","IO5",null,"SPARE"]
["FL2086_FIOH1","FL2086_FIOH7_IO6","IO6",null,"FL2086_BCN2_A","AMBER BEACON LIGHT","2025-06-18"]
["FL2086_FIOH1","FL2086_FIOH8_IO7","IO7",null,"FL2086_BCN2_B","BLUE BEACON LIGHT"]
["FL2090_FIOH1","FL2090_FIOH1_IO0","IO0",null,"FL2090_2_BCN1_A","AMBER BEACON LIGHT"]
["FL2090_FIOH1","FL2090_FIOH1_IO1","IO1",null,"FL2090_2_BCN1_B","BLUE BEACON LIGHT"]
["FL2090_FIOH1","FL2090_FIOH1_IO2","IO2",null,"FL2090_2_JR1_PB","JAM RESET PUSHBUTTON"]
["FL2090_FIOH1","FL2090_FIOH1_IO3","IO3",null,"FL2090_2_JR1_PB_LT","JAM RESET PUSHBUTTON LIGHT"]
["FL2090_FIOH1","FL2090_FIOH1_IO4","IO4",null,"FL2090_1CH_PE1","FULL PHOTOEYE"]
["FL2090_FIOH1","FL2090_FIOH1_IO5","IO5",null,"SPARE"]
["FL2090_FIOH1","FL2090_FIOH1_IO6","IO6",null,"FL2090_BCN2_A","AMBER BEACON LIGHT","2025-06-18"]
["FL2090_FIOH1","FL2090_FIOH1_IO7","IO7",null,"FL2090_BCN2_B","BLUE BEACON LIGHT"]
["S012096_FIOH1","S012096_FIOH1_IO0","IO0",null,"FL2094_2_BCN1_A","AMBER BEACON LIGHT"]
["S012096_FIOH1","S012096_FIOH1_IO1","IO1",null,"FL2094_2_BCN1_B","BLUE BEACON LIGHT"]
["S012096_FIOH1","S012096_FIOH1_IO2","IO2",null,"FL2094_2_JR1_PB","JAM RESET PUSHBUTTON"]
["S012096_FIOH1","S012096_FIOH1_IO3","IO3",null,"FL2094_2_JR1_PB_LT","JAM RESET PUSHBUTTON LIGHT"]
["S012096_FIOH1","S012096_FIOH1_IO4","IO4",null,"FL2094_1CH_PE1","FULL PHOTOEYE"]
["S012096_FIOH1","S012096_FIOH1_IO5","IO5",null,"SPARE"]
["S012096_FIOH1","S012096_FIOH1_IO6","IO6",null,"FL2094_BCN2_A","AMBER BEACON LIGHT","2025-06-18"]
["S012096_FIOH1","S012096_FIOH1_IO7","IO7",null,"FL2094_BCN2_B","BLUE BEACON LIGHT"]
["FL4066_FIOH1","FL4066_FIOH1_IO0","IO0",null,"FL4066_2_BCN1_A","AMBER BEACON LIGHT"]
["FL4066_FIOH1","FL4066_FIOH1_IO1","IO1",null,"FL4066_2_BCN1_B","BLUE BEACON LIGHT"]
["FL4066_FIOH1","FL4066_FIOH1_IO2","IO2",null,"FL4066_2_JR1_PB","JAM RESET PUSHBUTTON"]
["FL4066_FIOH1","FL4066_FIOH1_IO3","IO3",null,"FL4066_2_JR1_PB_LT","JAM RESET PUSHBUTTON LIGHT"]
["FL4066_FIOH1","FL4066_FIOH1_IO4","IO4",null,"FL4066_1CH_PE1","FULL PHOTOEYE"]
["FL4066_FIOH1","FL4066_FIOH1_IO5","IO5",null,"SPARE"]
["FL4066_FIOH1","FL4066_FIOH1_IO6","IO6",null,"FL4066_BCN2_A","AMBER BEACON LIGHT","2025-06-18"]
["FL4066_FIOH1","FL4066_FIOH1_IO7","IO7",null,"FL4066_BCN2_B","BLUE BEACON LIGHT"]
["S014072_FIOH1","S014072_FIOH1_IO0","IO0",null,"FL4070_2_BCN1_A","AMBER BEACON LIGHT"]
["S014072_FIOH1","S014072_FIOH1_IO1","IO1",null,"FL4070_2_BCN1_B","BLUE BEACON LIGHT"]
["S014072_FIOH1","S014072_FIOH1_IO2","IO2",null,"FL4070_2_JR1_PB","JAM RESET PUSHBUTTON"]
["S014072_FIOH1","S014072_FIOH1_IO3","IO3",null,"FL4070_2_JR1_PB_LT","JAM RESET PUSHBUTTON LIGHT"]
["S014072_FIOH1","S014072_FIOH1_IO4","IO4",null,"FL4070_1CH_PE1","FULL PHOTOEYE"]
["S014072_FIOH1","S014072_FIOH1_IO5","IO5",null,"SPARE"]
["S014072_FIOH1","S014072_FIOH1_IO6","IO6",null,"FL4070_BCN2_A","AMBER BEACON LIGHT","2025-06-18"]
["S014072_FIOH1","S014072_FIOH1_IO7","IO7",null,"FL4070_BCN2_B","BLUE BEACON LIGHT"]
["FL4074_FIOH1","FL4074_FIOH1_IO0","IO0",null,"FL4074_2_BCN1_A","AMBER BEACON LIGHT"]
["FL4074_FIOH1","FL4074_FIOH1_IO1","IO1",null,"FL4074_2_BCN1_B","BLUE BEACON LIGHT"]
["FL4074_FIOH1","FL4074_FIOH1_IO2","IO2",null,"FL4074_2_JR1_PB","JAM RESET PUSHBUTTON"]
["FL4074_FIOH1","FL4074_FIOH1_IO3","IO3",null,"FL4074_2_JR1_PB_LT","JAM RESET PUSHBUTTON LIGHT"]
["FL4074_FIOH1","FL4074_FIOH1_IO4","IO4",null,"FL4074_1CH_PE1","FULL PHOTOEYE"]
["FL4074_FIOH1","FL4074_FIOH1_IO5","IO5",null,"SPARE"]
["FL4074_FIOH1","FL4074_FIOH1_IO6","IO6",null,"FL4074_BCN2_A","AMBER BEACON LIGHT","2025-06-18"]
["FL4074_FIOH1","FL4074_FIOH1_IO7","IO7",null,"FL4074_BCN2_B","BLUE BEACON LIGHT"]
["S014080_FIOH1","S014080_FIOH1_IO0","IO0",null,"FL4078_2_BCN1_A","AMBER BEACON LIGHT"]
["S014080_FIOH1","S014080_FIOH1_IO1","IO1",null,"FL4078_2_BCN1_B","BLUE BEACON LIGHT"]
["S014080_FIOH1","S014080_FIOH1_IO2","IO2",null,"FL4078_2_JR1_PB","JAM RESET PUSHBUTTON"]
["S014080_FIOH1","S014080_FIOH1_IO3","IO3",null,"FL4078_2_JR1_PB_LT","JAM RESET PUSHBUTTON LIGHT"]
["S014080_FIOH1","S014080_FIOH1_IO4","IO4",null,"FL4078_1CH_PE1","FULL PHOTOEYE"]
["S014080_FIOH1","S014080_FIOH1_IO5","IO5",null,"SPARE"]
["S014080_FIOH1","S014080_FIOH1_IO6","IO6",null,"FL4078_BCN2_A","AMBER BEACON LIGHT","2025-06-18"]
["S014080_FIOH1","S014080_FIOH1_IO7","IO7",null,"FL4078_BCN2_B","BLUE BEACON LIGHT"]
["FL4082_FIOH1","FL4082_FIOH1_IO0","IO0",null,"FL4082_2_BCN1_A","AMBER BEACON LIGHT"]
["FL4082_FIOH1","FL4082_FIOH1_IO1","IO1",null,"FL4082_2_BCN1_B","BLUE BEACON LIGHT"]
["FL4082_FIOH1","FL4082_FIOH1_IO2","IO2",null,"FL4082_2_JR1_PB","JAM RESET PUSHBUTTON"]
["FL4082_FIOH1","FL4082_FIOH1_IO3","IO3",null,"FL4082_2_JR1_PB_LT","JAM RESET PUSHBUTTON LIGHT"]
["FL4082_FIOH1","FL4082_FIOH1_IO4","IO4",null,"FL4082_1CH_PE1","FULL PHOTOEYE"]
["FL4082_FIOH1","FL4082_FIOH1_IO5","IO5",null,"SPARE"]
["FL4082_FIOH1","FL4082_FIOH1_IO6","IO6",null,"FL4082_BCN2_A","AMBER BEACON LIGHT","2025-06-18"]
["FL4082_FIOH1","FL4082_FIOH1_IO7","IO7",null,"FL4082_BCN2_B","BLUE BEACON LIGHT"]