{"text_format":"1","workbook":"xlsx","n_sheets":8,"sheets":["Templates","Devices","Instructions","NETWORK(IOLINK)","NETWORK(EIP)","Part Number","IO Assignment MCM06","MCM06_DESC"],"not_rendered":{"charts":0,"images":10,"macros":1,"external_links":1,"defined_names":4,"comments":4,"pivot_tables":0},"unopened":[],"bounds":{"document_bytes":16777216,"sheet_cells":100000,"rows_first":2000,"rows_last":500,"rows_between":2000,"halvings":0,"cell_chars":16384,"cell_head_chars":4096},"cells_cut":0,"cells_raw":0,"read":"whole","date_system":"1900"}

{"sheet":"Templates","index":0,"n_rows":19,"n_cols":3,"rows_kept":19,"cut":false,"hidden":false,"merged":[]}
[]
["VFD IO TEMPLATE",null,"FIO IO Template"]
["I0",null,"IO00"]
["I1",null,"IO01"]
["I2",null,"IO02"]
["I3",null,"IO03"]
["IO0",null,"IO04"]
["IO1",null,"IO05"]
["SI0",null,"IO06"]
["SI1",null,"IO07"]
["SI2",null,"IO08"]
["SI3",null,"IO09"]
["SO0",null,"IO10"]
[null,null,"IO11"]
[null,null,"IO12"]
[null,null,"IO13"]
[null,null,"IO14"]
[null,null,"IO15"]
[null,null,"IO16"]

{"sheet":"Devices","index":1,"n_rows":206,"n_cols":9,"rows_kept":206,"cut":false,"hidden":false,"merged":[]}
[null,null,null,null,null,null,null,"Which MCM we assign?","MCM06"]
["NCP_11_TPE1"]
["NCP_11_TPE2"]
["NCP1_10A_DISC"]
["NCP1_10A_VFD1"]
["NCP1_10B_DISC"]
["NCP1_10B_VFD1"]
["NCP1_11_DISC"]
["NCP1_11_ENC1"]
["NCP1_11_VFD1"]
["NCP1_12_DISC"]
["NCP1_12_ENC1"]
["NCP1_12_TPE1"]
["NCP1_12_VFD1"]
["NCP1_13_DISC"]
["NCP1_13_TPE1"]
["NCP1_13_VFD1"]
["NCP1_14A_DISC"]
["NCP1_14A_VFD1"]
["NCP1_14B_DISC"]
["NCP1_14B_VFD1"]
["NCP1_14C_DISC"]
["NCP1_14C_VFD1"]
["NCP1_14D_DISC"]
["NCP1_14D_VFD1"]
["NCP1_15_BCN1_R"]
["NCP1_15_BCN2_A"]
["NCP1_15_BCN2_R"]
["NCP1_15_DISC"]
["NCP1_15_ENC1"]
["NCP1_15_EPC1"]
["NCP1_15_EPC1_2"]
["NCP1_15_EPC2"]
["NCP1_15_EPC2_2"]
["NCP1_15_S1_PB"]
["NCP1_15_S1_PB_LT"]
["NCP1_15_S2_PB"]
["NCP1_15_S2_PB_LT"]
["NCP1_15_TPE1"]
["NCP1_15_TPE2"]
{"$rows_left_out":167}
{"sheet":"Instructions","index":2,"n_rows":116,"n_cols":2,"rows_kept":116,"cut":false,"hidden":false,"merged":[]}
[]
["1. ","Put all device tags to cell A2"]
[]
[]
[]
[]
[]
[]
[]
[]
[]
[]
[]
[]
[]
[]
[]
[]
[]
[]
[]
[]
[]
[]
[]
[]
[]
[]
[]
[]
[]
[]
[]
[]
[]
[]
["2.","In cell I1 write MCM number"]
[]
[]
[]
{"$rows_left_out":77}
{"sheet":"NETWORK(IOLINK)","index":3,"n_rows":85,"n_cols":14,"rows_kept":85,"cut":false,"hidden":false,"merged":[[0,3,0,4],[0,5,0,8],[21,3,32,3],[21,4,32,4],[2,3,20,3],[2,4,20,4],[73,3,84,3],[73,4,84,4],[33,3,40,3],[33,4,40,4],[41,3,50,3],[41,4,50,4],[51,3,62,3],[51,4,62,4],[63,3,72,3],[63,4,72,4]]}
[null,"MCM05",null,"RING",null,"STAR"]
["SLOT0","1756_L83ES","IP","DPM","IP","VFD NAME","TYPE","VFD PART NUMBER","IP"]
["SLOT1","1756_N2",null,"NCP1_15_DPM1","11.200.1.2","NCP1_9_VFD1","2HP",{"$f":"VLOOKUP(G3,'Part Number'!$A$1:$B$13,2,0)","v":"35S-6D2-P101"},"11.200.1.30",null,null,null,"NCP1_9_VFD1",{"$f":"VLOOKUP(M3,[1]MCM06!$C$1:$M$157,11,0)","v":"2HP"}]
["SLOT2","1756_EN4TR","11.200.1.1",null,null,"NCP1_10A_VFD1","2HP",{"$f":"VLOOKUP(G4,'Part Number'!$A$1:$B$13,2,0)","v":"35S-6D2-P101"},"11.200.1.31",null,null,null,"NCP1_10A_VFD1",{"$f":"VLOOKUP(M4,[1]MCM06!$C$1:$M$157,11,0)","v":"2HP"}]
["SLOT3","1756_EN2TR","11.200.1.1",null,null,"NCP1_10B_VFD1","2HP",{"$f":"VLOOKUP(G5,'Part Number'!$A$1:$B$13,2,0)","v":"35S-6D2-P101"},"11.200.1.32",null,null,null,"NCP1_10B_VFD1",{"$f":"VLOOKUP(M5,[1]MCM06!$C$1:$M$157,11,0)","v":"2HP"}]
["SLOT4","1756_EN2TR","11.200.1.1",null,null,"NCP1_11_VFD1","2HP",{"$f":"VLOOKUP(G6,'Part Number'!$A$1:$B$13,2,0)","v":"35S-6D2-P101"},"11.200.1.33",null,null,null,"NCP1_11_VFD1",{"$f":"VLOOKUP(M6,[1]MCM06!$C$1:$M$157,11,0)","v":"2HP"}]
["SLOT5","1756_IB16",null,null,null,"NCP1_12_VFD1","2HP",{"$f":"VLOOKUP(G7,'Part Number'!$A$1:$B$13,2,0)","v":"35S-6D2-P101"},"11.200.1.34",null,null,null,"NCP1_12_VFD1",{"$f":"VLOOKUP(M7,[1]MCM06!$C$1:$M$157,11,0)","v":"2HP"}]
["SLOT6","1756_OB16E",null,null,null,"NCP1_13_VFD1","2HP",{"$f":"VLOOKUP(G8,'Part Number'!$A$1:$B$13,2,0)","v":"35S-6D2-P101"},"11.200.1.35",null,null,null,"NCP1_13_VFD1",{"$f":"VLOOKUP(M8,[1]MCM06!$C$1:$M$157,11,0)","v":"2HP"}]
["SLOT7","1756_IB16S",null,null,null,"NCP1_14A_VFD1","2HP",{"$f":"VLOOKUP(G9,'Part Number'!$A$1:$B$13,2,0)","v":"35S-6D2-P101"},"11.200.1.36",null,null,null,"NCP1_14A_VFD1",{"$f":"VLOOKUP(M9,[1]MCM06!$C$1:$M$157,11,0)","v":"2HP"}]
["SLOT8","1756_EN2TR","11.200.1.1",null,null,"NCP1_14B_VFD1","2HP",{"$f":"VLOOKUP(G10,'Part Number'!$A$1:$B$13,2,0)","v":"35S-6D2-P101"},"11.200.1.37",null,null,null,"NCP1_14B_VFD1",{"$f":"VLOOKUP(M10,[1]MCM06!$C$1:$M$157,11,0)","v":"2HP"}]
["SLOT9","1756_EN2TR","11.200.1.1",null,null,"NCP1_14C_VFD1","2HP",{"$f":"VLOOKUP(G11,'Part Number'!$A$1:$B$13,2,0)","v":"35S-6D2-P101"},"11.200.1.38",null,null,null,"NCP1_14C_VFD1",{"$f":"VLOOKUP(M11,[1]MCM06!$C$1:$M$157,11,0)","v":"2HP"}]
[null,null,null,null,null,"NCP1_14D_VFD1","2HP",{"$f":"VLOOKUP(G12,'Part Number'!$A$1:$B$13,2,0)","v":"35S-6D2-P101"},"11.200.1.39",null,null,null,"NCP1_14D_VFD1",{"$f":"VLOOKUP(M12,[1]MCM06!$C$1:$M$157,11,0)","v":"2HP"}]
[null,null,null,null,null,"NCP1_15_VFD1","7.5HP",{"$f":"VLOOKUP(G13,'Part Number'!$A$1:$B$13,2,0)","v":"35S-6D5-P111"},"11.200.1.40",null,null,null,"NCP1_15_VFD1",{"$f":"VLOOKUP(M13,[1]MCM06!$C$1:$M$157,11,0)","v":"7.5HP"}]
["DPM COUNT",7,null,null,null,"NCP1_16_VFD1","5HP",{"$f":"VLOOKUP(G14,'Part Number'!$A$1:$B$13,2,0)","v":"35S-6D4-P111"},"11.200.1.41",null,null,null,"NCP1_16_VFD1",{"$f":"VLOOKUP(M14,[1]MCM06!$C$1:$M$157,11,0)","v":"5HP"}]
["FIO COUNT",53,null,null,null,"NCP1_17_VFD1","2HP",{"$f":"VLOOKUP(G15,'Part Number'!$A$1:$B$13,2,0)","v":"35S-6D2-P101"},"11.200.1.42",null,null,null,"NCP1_17_VFD1",{"$f":"VLOOKUP(M15,[1]MCM06!$C$1:$M$157,11,0)","v":"2HP"}]
[null,null,null,null,null,"NCP1_18A_VFD1","2HP",{"$f":"VLOOKUP(G16,'Part Number'!$A$1:$B$13,2,0)","v":"35S-6D2-P101"},"11.200.1.43",null,null,null,"NCP1_18A_VFD1",{"$f":"VLOOKUP(M16,[1]MCM06!$C$1:$M$157,11,0)","v":"2HP"}]
[null,null,null,null,null,"NCP1_18B_VFD1","2HP",{"$f":"VLOOKUP(G17,'Part Number'!$A$1:$B$13,2,0)","v":"35S-6D2-P101"},"11.200.1.44",null,null,null,"NCP1_18B_VFD1",{"$f":"VLOOKUP(M17,[1]MCM06!$C$1:$M$157,11,0)","v":"2HP"}]
[null,null,null,null,null,"NCP1_19_VFD1","2HP",{"$f":"VLOOKUP(G18,'Part Number'!$A$1:$B$13,2,0)","v":"35S-6D2-P101"},"11.200.1.45",null,null,null,"NCP1_19_VFD1",{"$f":"VLOOKUP(M18,[1]MCM06!$C$1:$M$157,11,0)","v":"2HP"}]
[null,null,null,null,null,"NCP1_20_VFD1","5HP",{"$f":"VLOOKUP(G19,'Part Number'!$A$1:$B$13,2,0)","v":"35S-6D4-P111"},"11.200.1.46",null,null,null,"NCP1_20_VFD1",{"$f":"VLOOKUP(M19,[1]MCM06!$C$1:$M$157,11,0)","v":"5HP"}]
[null,null,null,null,null,"NCP1_21_VFD1","7.5HP",{"$f":"VLOOKUP(G20,'Part Number'!$A$1:$B$13,2,0)","v":"35S-6D5-P111"},"11.200.1.47",null,null,null,"NCP1_21_VFD1",{"$f":"VLOOKUP(M20,[1]MCM06!$C$1:$M$157,11,0)","v":"7.5HP"}]
[null,null,null,null,null,"NCP1_20_FIO1","FIO",{"$f":"VLOOKUP(G21,'Part Number'!$A$1:$B$13,2,0)","v":"5032-8IOLM12DR"},"11.200.1.146","5-26 ADDED"]
[null,null,null,"NCS1_6_DPM1","11.200.1.3","NCS1_1_VFD1","2HP",{"$f":"VLOOKUP(G22,'Part Number'!$A$1:$B$13,2,0)","v":"35S-6D2-P101"},"11.200.1.48"]
[null,null,null,null,null,"NCS1_2_VFD1","2HP",{"$f":"VLOOKUP(G23,'Part Number'!$A$1:$B$13,2,0)","v":"35S-6D2-P101"},"11.200.1.49",null,null,null,"NCS1_2_VFD1",{"$f":"VLOOKUP(M23,[1]MCM06!$C$1:$M$157,11,0)","v":"2HP"}]
[null,null,null,null,null,"NCS1_3_VFD1","5HP",{"$f":"VLOOKUP(G24,'Part Number'!$A$1:$B$13,2,0)","v":"35S-6D4-P111"},"11.200.1.50",null,null,null,"NCS1_3_VFD1",{"$f":"VLOOKUP(M24,[1]MCM06!$C$1:$M$157,11,0)","v":"5HP"}]
[null,null,null,null,null,"NCS1_4_VFD1","2HP",{"$f":"VLOOKUP(G25,'Part Number'!$A$1:$B$13,2,0)","v":"35S-6D2-P101"},"11.200.1.51",null,null,null,"NCS1_4_VFD1",{"$f":"VLOOKUP(M25,[1]MCM06!$C$1:$M$157,11,0)","v":"2HP"}]
[null,null,null,null,null,"NCS1_5A_VFD1","2HP",{"$f":"VLOOKUP(G26,'Part Number'!$A$1:$B$13,2,0)","v":"35S-6D2-P101"},"11.200.1.52",null,null,null,"NCS1_5A_VFD1",{"$f":"VLOOKUP(M26,[1]MCM06!$C$1:$M$157,11,0)","v":"2HP"}]
[null,null,null,null,null,"NCS1_5B_VFD1","2HP",{"$f":"VLOOKUP(G27,'Part Number'!$A$1:$B$13,2,0)","v":"35S-6D2-P101"},"11.200.1.53",null,null,null,"NCS1_5B_VFD1",{"$f":"VLOOKUP(M27,[1]MCM06!$C$1:$M$157,11,0)","v":"2HP"}]
[null,null,null,null,null,"NCS1_6_VFD1","2HP",{"$f":"VLOOKUP(G28,'Part Number'!$A$1:$B$13,2,0)","v":"35S-6D2-P101"},"11.200.1.54",null,null,null,"NCS1_6_VFD1",{"$f":"VLOOKUP(M28,[1]MCM06!$C$1:$M$157,11,0)","v":"2HP"}]
[null,null,null,null,null,"NCS1_7_VFD1","2HP",{"$f":"VLOOKUP(G29,'Part Number'!$A$1:$B$13,2,0)","v":"35S-6D2-P101"},"11.200.1.55",null,null,null,"NCS1_7_VFD1",{"$f":"VLOOKUP(M29,[1]MCM06!$C$1:$M$157,11,0)","v":"2HP"}]
[null,null,null,null,null,"NCS1_8_VFD1","2HP",{"$f":"VLOOKUP(G30,'Part Number'!$A$1:$B$13,2,0)","v":"35S-6D2-P101"},"11.200.1.56",null,null,null,"NCS1_8_VFD1",{"$f":"VLOOKUP(M30,[1]MCM06!$C$1:$M$157,11,0)","v":"2HP"}]
[null,null,null,null,null,"NCS1_9_VFD1","2HP",{"$f":"VLOOKUP(G31,'Part Number'!$A$1:$B$13,2,0)","v":"35S-6D2-P101"},"11.200.1.57",null,null,null,"NCS1_9_VFD1",{"$f":"VLOOKUP(M31,[1]MCM06!$C$1:$M$157,11,0)","v":"2HP"}]
[null,null,null,null,null,"PDP08_FIO1","FIO",{"$f":"VLOOKUP(G32,'Part Number'!$A$1:$B$13,2,0)","v":"5032-8IOLM12DR"},"11.200.1.144","ADDED","2025-05-25"]
[null,null,null,null,null,"PDP08_PMM1","PMM","1420-V2-ENT","11.200.1.145","ADDED","2025-05-25"]
[null,null,null,"NCS2_4_DPM1","11.200.1.4","NCS2_1_VFD1","5HP",{"$f":"VLOOKUP(G34,'Part Number'!$A$1:$B$13,2,0)","v":"35S-6D4-P111"},"11.200.1.58","added",null,null,"NCP2_1_VFD1",{"$f":"VLOOKUP(M34,[1]MCM06!$C$1:$M$157,11,0)","v":"5HP"}]
[null,null,null,null,null,"NCS2_2_VFD1","2HP",{"$f":"VLOOKUP(G35,'Part Number'!$A$1:$B$13,2,0)","v":"35S-6D2-P101"},"11.200.1.59",null,null,null,"NCS2_2_VFD1",{"$f":"VLOOKUP(M35,[1]MCM06!$C$1:$M$157,11,0)","v":"2HP"}]
[null,null,null,null,null,"NCS2_3A_VFD1","2HP",{"$f":"VLOOKUP(G36,'Part Number'!$A$1:$B$13,2,0)","v":"35S-6D2-P101"},"11.200.1.60",null,null,null,"NCS2_3A_VFD1",{"$f":"VLOOKUP(M36,[1]MCM06!$C$1:$M$157,11,0)","v":"2HP"}]
[null,null,null,null,null,"NCS2_3B_VFD1","2HP",{"$f":"VLOOKUP(G37,'Part Number'!$A$1:$B$13,2,0)","v":"35S-6D2-P101"},"11.200.1.61",null,null,null,"NCS2_3B_VFD1",{"$f":"VLOOKUP(M37,[1]MCM06!$C$1:$M$157,11,0)","v":"2HP"}]
[null,null,null,null,null,"NCS2_4_VFD1","2HP",{"$f":"VLOOKUP(G38,'Part Number'!$A$1:$B$13,2,0)","v":"35S-6D2-P101"},"11.200.1.62",null,null,null,"NCS2_4_VFD1",{"$f":"VLOOKUP(M38,[1]MCM06!$C$1:$M$157,11,0)","v":"2HP"}]
[null,null,null,null,null,"NCS2_5_VFD1","2HP",{"$f":"VLOOKUP(G39,'Part Number'!$A$1:$B$13,2,0)","v":"35S-6D2-P101"},"11.200.1.63",null,null,null,"NCS2_5_VFD1",{"$f":"VLOOKUP(M39,[1]MCM06!$C$1:$M$157,11,0)","v":"2HP"}]
[null,null,null,null,null,"NCS2_6_VFD1","2HP",{"$f":"VLOOKUP(G40,'Part Number'!$A$1:$B$13,2,0)","v":"35S-6D2-P101"},"11.200.1.64",null,null,null,"NCS2_6_VFD1",{"$f":"VLOOKUP(M40,[1]MCM06!$C$1:$M$157,11,0)","v":"2HP"}]
{"$rows_left_out":46}
{"sheet":"NETWORK(EIP)","index":4,"n_rows":232,"n_cols":14,"rows_kept":232,"cut":false,"hidden":false,"merged":[[0,5,0,8],[2,3,19,3],[2,4,19,4],[30,3,37,3],[0,3,0,4],[30,4,37,4],[52,4,57,4],[20,3,29,3],[20,4,29,4],[148,4,189,4],[190,4,231,4],[105,4,146,4],[63,4,104,4],[38,3,41,3],[42,3,47,3],[48,3,51,3],[52,3,57,3],[38,4,41,4],[42,4,47,4],[48,4,51,4]]}
[null,"MCM05",null,"RING",null,"STAR"]
["SLOT0","1756_L83ES","IP","DPM","IP","VFD NAME","TYPE","VFD PART NUMBER","IP"]
["SLOT1","1756_N2",null,"NCP1_15_DPM1","11.200.1.2","NCP1_9_VFD1","2HP",{"$f":"VLOOKUP(G3,'Part Number'!$A$1:$B$13,2,0)","v":"35S-6D2-P101"},"11.200.1.30",null,null,null,"NCP1_9_VFD1",{"$f":"VLOOKUP(M3,[1]MCM06!$C$1:$M$157,11,0)","v":"2HP"}]
["SLOT2","1756_EN4TR","11.200.1.1",null,null,"NCP1_10A_VFD1","2HP",{"$f":"VLOOKUP(G4,'Part Number'!$A$1:$B$13,2,0)","v":"35S-6D2-P101"},"11.200.1.31",null,null,null,"NCP1_10A_VFD1",{"$f":"VLOOKUP(M4,[1]MCM06!$C$1:$M$157,11,0)","v":"2HP"}]
["SLOT3","1756_EN2TR","11.200.1.1",null,null,"NCP1_10B_VFD1","2HP",{"$f":"VLOOKUP(G5,'Part Number'!$A$1:$B$13,2,0)","v":"35S-6D2-P101"},"11.200.1.32",null,null,null,"NCP1_10B_VFD1",{"$f":"VLOOKUP(M5,[1]MCM06!$C$1:$M$157,11,0)","v":"2HP"}]
["SLOT4","1756_EN2TR","11.200.1.1",null,null,"NCP1_11_VFD1","2HP",{"$f":"VLOOKUP(G6,'Part Number'!$A$1:$B$13,2,0)","v":"35S-6D2-P101"},"11.200.1.33",null,null,null,"NCP1_11_VFD1",{"$f":"VLOOKUP(M6,[1]MCM06!$C$1:$M$157,11,0)","v":"2HP"}]
["SLOT5","1756_IB16",null,null,null,"NCP1_12_VFD1","2HP",{"$f":"VLOOKUP(G7,'Part Number'!$A$1:$B$13,2,0)","v":"35S-6D2-P101"},"11.200.1.34",null,null,null,"NCP1_12_VFD1",{"$f":"VLOOKUP(M7,[1]MCM06!$C$1:$M$157,11,0)","v":"2HP"}]
["SLOT6","1756_OB16E",null,null,null,"NCP1_13_VFD1","2HP",{"$f":"VLOOKUP(G8,'Part Number'!$A$1:$B$13,2,0)","v":"35S-6D2-P101"},"11.200.1.35",null,null,null,"NCP1_13_VFD1",{"$f":"VLOOKUP(M8,[1]MCM06!$C$1:$M$157,11,0)","v":"2HP"}]
["SLOT7","1756_IB16S",null,null,null,"NCP1_14A_VFD1","2HP",{"$f":"VLOOKUP(G9,'Part Number'!$A$1:$B$13,2,0)","v":"35S-6D2-P101"},"11.200.1.36",null,null,null,"NCP1_14A_VFD1",{"$f":"VLOOKUP(M9,[1]MCM06!$C$1:$M$157,11,0)","v":"2HP"}]
["SLOT8","1756_EN2TR","11.200.1.1",null,null,"NCP1_14B_VFD1","2HP",{"$f":"VLOOKUP(G10,'Part Number'!$A$1:$B$13,2,0)","v":"35S-6D2-P101"},"11.200.1.37",null,null,null,"NCP1_14B_VFD1",{"$f":"VLOOKUP(M10,[1]MCM06!$C$1:$M$157,11,0)","v":"2HP"}]
["SLOT9","1756_EN2TR","11.200.1.1",null,null,"NCP1_14C_VFD1","2HP",{"$f":"VLOOKUP(G11,'Part Number'!$A$1:$B$13,2,0)","v":"35S-6D2-P101"},"11.200.1.38",null,null,null,"NCP1_14C_VFD1",{"$f":"VLOOKUP(M11,[1]MCM06!$C$1:$M$157,11,0)","v":"2HP"}]
[null,null,null,null,null,"NCP1_14D_VFD1","2HP",{"$f":"VLOOKUP(G12,'Part Number'!$A$1:$B$13,2,0)","v":"35S-6D2-P101"},"11.200.1.39",null,null,null,"NCP1_14D_VFD1",{"$f":"VLOOKUP(M12,[1]MCM06!$C$1:$M$157,11,0)","v":"2HP"}]
[null,null,null,null,null,"NCP1_15_VFD1","7.5HP",{"$f":"VLOOKUP(G13,'Part Number'!$A$1:$B$13,2,0)","v":"35S-6D5-P111"},"11.200.1.40",null,null,null,"NCP1_15_VFD1",{"$f":"VLOOKUP(M13,[1]MCM06!$C$1:$M$157,11,0)","v":"7.5HP"}]
["DPM COUNT",7,null,null,null,"NCP1_16_VFD1","5HP",{"$f":"VLOOKUP(G14,'Part Number'!$A$1:$B$13,2,0)","v":"35S-6D4-P111"},"11.200.1.41",null,null,null,"NCP1_16_VFD1",{"$f":"VLOOKUP(M14,[1]MCM06!$C$1:$M$157,11,0)","v":"5HP"}]
["FIO COUNT",53,null,null,null,"NCP1_17_VFD1","2HP",{"$f":"VLOOKUP(G15,'Part Number'!$A$1:$B$13,2,0)","v":"35S-6D2-P101"},"11.200.1.42",null,null,null,"NCP1_17_VFD1",{"$f":"VLOOKUP(M15,[1]MCM06!$C$1:$M$157,11,0)","v":"2HP"}]
[null,null,null,null,null,"NCP1_18A_VFD1","2HP",{"$f":"VLOOKUP(G16,'Part Number'!$A$1:$B$13,2,0)","v":"35S-6D2-P101"},"11.200.1.43",null,null,null,"NCP1_18A_VFD1",{"$f":"VLOOKUP(M16,[1]MCM06!$C$1:$M$157,11,0)","v":"2HP"}]
[null,null,null,null,null,"NCP1_18B_VFD1","2HP",{"$f":"VLOOKUP(G17,'Part Number'!$A$1:$B$13,2,0)","v":"35S-6D2-P101"},"11.200.1.44",null,null,null,"NCP1_18B_VFD1",{"$f":"VLOOKUP(M17,[1]MCM06!$C$1:$M$157,11,0)","v":"2HP"}]
[null,null,null,null,null,"NCP1_19_VFD1","2HP",{"$f":"VLOOKUP(G18,'Part Number'!$A$1:$B$13,2,0)","v":"35S-6D2-P101"},"11.200.1.45",null,null,null,"NCP1_19_VFD1",{"$f":"VLOOKUP(M18,[1]MCM06!$C$1:$M$157,11,0)","v":"2HP"}]
[null,null,null,null,null,"NCP1_20_VFD1","5HP",{"$f":"VLOOKUP(G19,'Part Number'!$A$1:$B$13,2,0)","v":"35S-6D4-P111"},"11.200.1.46",null,null,null,"NCP1_20_VFD1",{"$f":"VLOOKUP(M19,[1]MCM06!$C$1:$M$157,11,0)","v":"5HP"}]
[null,null,null,null,null,"NCP1_21_VFD1","7.5HP",{"$f":"VLOOKUP(G20,'Part Number'!$A$1:$B$13,2,0)","v":"35S-6D5-P111"},"11.200.1.47",null,null,null,"NCP1_21_VFD1",{"$f":"VLOOKUP(M20,[1]MCM06!$C$1:$M$157,11,0)","v":"7.5HP"}]
[null,null,null,"NCS1_6_DPM1","11.200.1.3","NCS1_1_VFD1","2HP",{"$f":"VLOOKUP(G21,'Part Number'!$A$1:$B$13,2,0)","v":"35S-6D2-P101"},"11.200.1.48"]
[null,null,null,null,null,"NCS1_2_VFD1","2HP",{"$f":"VLOOKUP(G22,'Part Number'!$A$1:$B$13,2,0)","v":"35S-6D2-P101"},"11.200.1.49",null,null,null,"NCS1_2_VFD1",{"$f":"VLOOKUP(M22,[1]MCM06!$C$1:$M$157,11,0)","v":"2HP"}]
[null,null,null,null,null,"NCS1_3_VFD1","5HP",{"$f":"VLOOKUP(G23,'Part Number'!$A$1:$B$13,2,0)","v":"35S-6D4-P111"},"11.200.1.50",null,null,null,"NCS1_3_VFD1",{"$f":"VLOOKUP(M23,[1]MCM06!$C$1:$M$157,11,0)","v":"5HP"}]
[null,null,null,null,null,"NCS1_4_VFD1","2HP",{"$f":"VLOOKUP(G24,'Part Number'!$A$1:$B$13,2,0)","v":"35S-6D2-P101"},"11.200.1.51",null,null,null,"NCS1_4_VFD1",{"$f":"VLOOKUP(M24,[1]MCM06!$C$1:$M$157,11,0)","v":"2HP"}]
[null,null,null,null,null,"NCS1_5A_VFD1","2HP",{"$f":"VLOOKUP(G25,'Part Number'!$A$1:$B$13,2,0)","v":"35S-6D2-P101"},"11.200.1.52",null,null,null,"NCS1_5A_VFD1",{"$f":"VLOOKUP(M25,[1]MCM06!$C$1:$M$157,11,0)","v":"2HP"}]
[null,null,null,null,null,"NCS1_5B_VFD1","2HP",{"$f":"VLOOKUP(G26,'Part Number'!$A$1:$B$13,2,0)","v":"35S-6D2-P101"},"11.200.1.53",null,null,null,"NCS1_5B_VFD1",{"$f":"VLOOKUP(M26,[1]MCM06!$C$1:$M$157,11,0)","v":"2HP"}]
[null,null,null,null,null,"NCS1_6_VFD1","2HP",{"$f":"VLOOKUP(G27,'Part Number'!$A$1:$B$13,2,0)","v":"35S-6D2-P101"},"11.200.1.54",null,null,null,"NCS1_6_VFD1",{"$f":"VLOOKUP(M27,[1]MCM06!$C$1:$M$157,11,0)","v":"2HP"}]
[null,null,null,null,null,"NCS1_7_VFD1","2HP",{"$f":"VLOOKUP(G28,'Part Number'!$A$1:$B$13,2,0)","v":"35S-6D2-P101"},"11.200.1.55",null,null,null,"NCS1_7_VFD1",{"$f":"VLOOKUP(M28,[1]MCM06!$C$1:$M$157,11,0)","v":"2HP"}]
[null,null,null,null,null,"NCS1_8_VFD1","2HP",{"$f":"VLOOKUP(G29,'Part Number'!$A$1:$B$13,2,0)","v":"35S-6D2-P101"},"11.200.1.56",null,null,null,"NCS1_8_VFD1",{"$f":"VLOOKUP(M29,[1]MCM06!$C$1:$M$157,11,0)","v":"2HP"}]
[null,null,null,null,null,"NCS1_9_VFD1","2HP",{"$f":"VLOOKUP(G30,'Part Number'!$A$1:$B$13,2,0)","v":"35S-6D2-P101"},"11.200.1.57",null,null,null,"NCS1_9_VFD1",{"$f":"VLOOKUP(M30,[1]MCM06!$C$1:$M$157,11,0)","v":"2HP"}]
[null,null,null,"NCS2_4_DPM1","11.200.1.4","NCS2_1_VFD1","5HP",{"$f":"VLOOKUP(G31,'Part Number'!$A$1:$B$13,2,0)","v":"35S-6D4-P111"},"11.200.1.58","added",null,null,"NCP2_1_VFD1",{"$f":"VLOOKUP(M31,[1]MCM06!$C$1:$M$157,11,0)","v":"5HP"}]
[null,null,null,null,null,"NCS2_2_VFD1","2HP",{"$f":"VLOOKUP(G32,'Part Number'!$A$1:$B$13,2,0)","v":"35S-6D2-P101"},"11.200.1.59",null,null,null,"NCS2_2_VFD1",{"$f":"VLOOKUP(M32,[1]MCM06!$C$1:$M$157,11,0)","v":"2HP"}]
[null,null,null,null,null,"NCS2_3A_VFD1","2HP",{"$f":"VLOOKUP(G33,'Part Number'!$A$1:$B$13,2,0)","v":"35S-6D2-P101"},"11.200.1.60",null,null,null,"NCS2_3A_VFD1",{"$f":"VLOOKUP(M33,[1]MCM06!$C$1:$M$157,11,0)","v":"2HP"}]
[null,null,null,null,null,"NCS2_3B_VFD1","2HP",{"$f":"VLOOKUP(G34,'Part Number'!$A$1:$B$13,2,0)","v":"35S-6D2-P101"},"11.200.1.61",null,null,null,"NCS2_3B_VFD1",{"$f":"VLOOKUP(M34,[1]MCM06!$C$1:$M$157,11,0)","v":"2HP"}]
[null,null,null,null,null,"NCS2_4_VFD1","2HP",{"$f":"VLOOKUP(G35,'Part Number'!$A$1:$B$13,2,0)","v":"35S-6D2-P101"},"11.200.1.62",null,null,null,"NCS2_4_VFD1",{"$f":"VLOOKUP(M35,[1]MCM06!$C$1:$M$157,11,0)","v":"2HP"}]
[null,null,null,null,null,"NCS2_5_VFD1","2HP",{"$f":"VLOOKUP(G36,'Part Number'!$A$1:$B$13,2,0)","v":"35S-6D2-P101"},"11.200.1.63",null,null,null,"NCS2_5_VFD1",{"$f":"VLOOKUP(M36,[1]MCM06!$C$1:$M$157,11,0)","v":"2HP"}]
[null,null,null,null,null,"NCS2_6_VFD1","2HP",{"$f":"VLOOKUP(G37,'Part Number'!$A$1:$B$13,2,0)","v":"35S-6D2-P101"},"11.200.1.64",null,null,null,"NCS2_6_VFD1",{"$f":"VLOOKUP(M37,[1]MCM06!$C$1:$M$157,11,0)","v":"2HP"}]
[null,null,null,null,null,"NCS2_7_VFD1","2HP",{"$f":"VLOOKUP(G38,'Part Number'!$A$1:$B$13,2,0)","v":"35S-6D2-P101"},"11.200.1.65",null,null,null,"NCS2_7_VFD1",{"$f":"VLOOKUP(M38,[1]MCM06!$C$1:$M$157,11,0)","v":"2HP"}]
[null,null,null,"NCS1_DPM1","11.200.1.5","S02_1_FIO1","FIO",{"$f":"VLOOKUP(G39,'Part Number'!$A$1:$B$13,2,0)","v":"5032-8IOLM12DR"},"11.200.1.100",null,null,null,"S02_1_FIO1","FIO"]
[null,null,null,null,null,"S02_1_FIO2","FIO",{"$f":"VLOOKUP(G40,'Part Number'!$A$1:$B$13,2,0)","v":"5032-8IOLM12DR"},"11.200.1.101",null,null,null,"S02_1_FIO2","FIO"]
{"$rows_left_out":193}
{"sheet":"Part Number","index":5,"n_rows":13,"n_cols":2,"rows_kept":13,"cut":false,"hidden":false,"merged":[]}
["HP","PART NUMBER"]
["2HP","35S-6D2-P101"]
["3HP","35S-6D3-P101"]
["5HP","35S-6D4-P111"]
["7.5HP","35S-6D5-P111"]
["10HP","35S-6D6-P111"]
["15HP","25B-D024N104"]
["20HP","25B-D030N104"]
["30HP","25B-D043N114 "]
["EXTENDO","CALJAN"]
["TIPPER","PIONEER"]
["ZMX","ZMX-3DE2500HF-Q7-AMZCHD"]
["FIO","5032-8IOLM12DR"]

{"sheet":"IO Assignment MCM06","index":6,"n_rows":855,"n_cols":11,"rows_kept":855,"cut":false,"hidden":false,"merged":[[423,5,438,5]]}
["Controller name","Signal type","Address name","Assigned device","Unassigned Device",null,null,null,null,null,"MCM06_DESC"]
["NCP1_10A_VFD1","I0","NCP1_10A_VFD1_I0","NCP1_10A_VFD1_DISC"]
["NCP1_10A_VFD1","I1","NCP1_10A_VFD1_I1"]
["NCP1_10A_VFD1","I2","NCP1_10A_VFD1_I2"]
["NCP1_10A_VFD1","I3","NCP1_10A_VFD1_I3"]
["NCP1_10A_VFD1","IO0","NCP1_10A_VFD1_IO0","NCP1_9_S1_PB"]
["NCP1_10A_VFD1","IO1","NCP1_10A_VFD1_IO1","NCP1_9_S1_PB_LT"]
["NCP1_10A_VFD1","SI0","NCP1_10A_VFD1_SI0"]
["NCP1_10A_VFD1","SI1","NCP1_10A_VFD1_SI1"]
["NCP1_10A_VFD1","SI2","NCP1_10A_VFD1_SI2"]
["NCP1_10A_VFD1","SI3","NCP1_10A_VFD1_SI3"]
["NCP1_10A_VFD1","SO0","NCP1_10A_VFD1_SO0"]
["NCP1_10B_VFD1","I0","NCP1_10B_VFD1_I0","NCP1_10B_VFD1_DISC"]
["NCP1_10B_VFD1","I1","NCP1_10B_VFD1_I1"]
["NCP1_10B_VFD1","I2","NCP1_10B_VFD1_I2"]
["NCP1_10B_VFD1","I3","NCP1_10B_VFD1_I3"]
["NCP1_10B_VFD1","IO0","NCP1_10B_VFD1_IO0","NCP1_9_S2_PB"]
["NCP1_10B_VFD1","IO1","NCP1_10B_VFD1_IO1","NCP1_9_S2_PB_LT"]
["NCP1_10B_VFD1","SI0","NCP1_10B_VFD1_SI0"]
["NCP1_10B_VFD1","SI1","NCP1_10B_VFD1_SI1"]
["NCP1_10B_VFD1","SI2","NCP1_10B_VFD1_SI2"]
["NCP1_10B_VFD1","SI3","NCP1_10B_VFD1_SI3"]
["NCP1_10B_VFD1","SO0","NCP1_10B_VFD1_SO0"]
["NCP1_11_VFD1","I0","NCP1_11_VFD1_I0","NCP1_11_VFD1_DISC"]
["NCP1_11_VFD1","I1","NCP1_11_VFD1_I1"]
["NCP1_11_VFD1","I2","NCP1_11_VFD1_I2","NCP_11_TPE1"]
["NCP1_11_VFD1","I3","NCP1_11_VFD1_I3","NCP_11_TPE2"]
["NCP1_11_VFD1","IO0","NCP1_11_VFD1_IO0"]
["NCP1_11_VFD1","IO1","NCP1_11_VFD1_IO1"]
["NCP1_11_VFD1","SI0","NCP1_11_VFD1_SI0"]
["NCP1_11_VFD1","SI1","NCP1_11_VFD1_SI1"]
["NCP1_11_VFD1","SI2","NCP1_11_VFD1_SI2"]
["NCP1_11_VFD1","SI3","NCP1_11_VFD1_SI3"]
["NCP1_11_VFD1","SO0","NCP1_11_VFD1_SO0"]
["NCP1_12_VFD1","I0","NCP1_12_VFD1_I0","NCP1_12_VFD1_DISC"]
["NCP1_12_VFD1","I1","NCP1_12_VFD1_I1"]
["NCP1_12_VFD1","I2","NCP1_12_VFD1_I2","NCP1_12_TPE1"]
["NCP1_12_VFD1","I3","NCP1_12_VFD1_I3"]
["NCP1_12_VFD1","IO0","NCP1_12_VFD1_IO0"]
["NCP1_12_VFD1","IO1","NCP1_12_VFD1_IO1"]
{"$rows_left_out":816}
{"sheet":"MCM06_DESC","index":7,"n_rows":420,"n_cols":9,"rows_kept":420,"cut":false,"hidden":false,"merged":[[31,8,35,8],[36,8,40,8],[41,8,45,8],[46,8,50,8],[1,8,5,8],[6,8,10,8],[11,8,15,8],[16,8,20,8],[21,8,25,8],[26,8,30,8]]}
["TAGNAME","ADDR","TERM","TERMDESC","DESCA","DESCB",null,"CONTROLLERS"]
["NCP1_10A_VFD1","NCP1_10A_VFD1_I0","I0",null,"NCP1_10A_VFD1_DISC","DISCONNECT AUX",null,"NCP1_10A_VFD1",600]
["NCP1_10A_VFD1","NCP1_10A_VFD1_I1","I1",null,"SPARE",null,null,"NCP1_10B_VFD1"]
["NCP1_10A_VFD1","NCP1_10A_VFD1_I2","I2",null,"SPARE",null,null,"NCP1_11_VFD1"]
["NCP1_10A_VFD1","NCP1_10A_VFD1_I3","I3",null,"SPARE",null,null,"NCP1_12_VFD1"]
["NCP1_10A_VFD1","NCP1_10A_VFD1_IO0","IO0",null,"NCP1_9_S1_PB","START PUSHBUTTON"]
["NCP1_10A_VFD1","NCP1_10A_VFD1_IO1","IO1",null,"NCP1_9_S1_PB_LT","START PUSHBUTTON LIGHT",null,"NCP1_13_VFD1",601]
["NCP1_10A_VFD1","NCP1_10A_VFD1_SI0","SI0",null,"SPARE",null,null,"NCP1_14A_VFD1"]
["NCP1_10A_VFD1","NCP1_10A_VFD1_SI1","SI1",null,"SPARE",null,null,"NCP1_14B_VFD1"]
["NCP1_10A_VFD1","NCP1_10A_VFD1_SI2","SI2",null,"SPARE",null,null,"NCP1_14C_VFD1"]
["NCP1_10A_VFD1","NCP1_10A_VFD1_SI3","SI3",null,"SPARE"]
["NCP1_10A_VFD1","NCP1_10A_VFD1_SO0","SO0",null,"SPARE",null,null,"NCP1_14D_VFD1",602]
["NCP1_10B_VFD1","NCP1_10B_VFD1_I0","I0",null,"NCP1_10B_VFD1_DISC","DISCONNECT AUX",null,"NCP1_15_VFD1"]
["NCP1_10B_VFD1","NCP1_10B_VFD1_I1","I1",null,"SPARE",null,null,"NCP1_16_VFD1"]
["NCP1_10B_VFD1","NCP1_10B_VFD1_I2","I2",null,"SPARE",null,null,"NCP1_17_VFD1"]
["NCP1_10B_VFD1","NCP1_10B_VFD1_I3","I3",null,"SPARE"]
["NCP1_10B_VFD1","NCP1_10B_VFD1_IO0","IO0",null,"NCP1_9_S2_PB","START PUSHBUTTON",null,"NCP1_18A_VFD1",603]
["NCP1_10B_VFD1","NCP1_10B_VFD1_IO1","IO1",null,"NCP1_9_S2_PB_LT","START PUSHBUTTON LIGHT",null,"NCP1_18B_VFD1"]
["NCP1_10B_VFD1","NCP1_10B_VFD1_SI0","SI0",null,"SPARE",null,null,"NCP1_19_VFD1"]
["NCP1_10B_VFD1","NCP1_10B_VFD1_SI1","SI1",null,"SPARE",null,null,"NCP1_20_VFD1"]
["NCP1_10B_VFD1","NCP1_10B_VFD1_SI2","SI2",null,"SPARE"]
["NCP1_10B_VFD1","NCP1_10B_VFD1_SI3","SI3",null,"SPARE",null,null,"NCP1_21_VFD1",604]
["NCP1_10B_VFD1","NCP1_10B_VFD1_SO0","SO0",null,"SPARE",null,null,"NCP1_9_VFD1"]
["NCP1_11_VFD1","NCP1_11_VFD1_I0","I0",null,"NCP1_11_VFD1_DISC","DISCONNECT AUX",null,"NCS2_1_VFD1"]
["NCP1_11_VFD1","NCP1_11_VFD1_I1","I1",null,"SPARE",null,null,"NCS1_2_VFD1"]
["NCP1_11_VFD1","NCP1_11_VFD1_I2","I2",null,"NCP_11_TPE1","TRACKING PHOTOEYE"]
["NCP1_11_VFD1","NCP1_11_VFD1_I3","I3",null,"NCP_11_TPE2","TRACKING PHOTOEYE",null,"NCS1_3_VFD1",605]
["NCP1_11_VFD1","NCP1_11_VFD1_IO0","IO0",null,"SPARE",null,null,"NCS1_4_VFD1"]
["NCP1_11_VFD1","NCP1_11_VFD1_IO1","IO1",null,"SPARE",null,null,"NCS1_5A_VFD1"]
["NCP1_11_VFD1","NCP1_11_VFD1_SI0","SI0",null,"SPARE",null,null,"NCS1_5B_VFD1"]
["NCP1_11_VFD1","NCP1_11_VFD1_SI1","SI1",null,"SPARE"]
["NCP1_11_VFD1","NCP1_11_VFD1_SI2","SI2",null,"SPARE",null,null,"NCS1_6_VFD1",606]
["NCP1_11_VFD1","NCP1_11_VFD1_SI3","SI3",null,"SPARE",null,null,"NCS1_7_VFD1"]
["NCP1_11_VFD1","NCP1_11_VFD1_SO0","SO0",null,"SPARE",null,null,"NCS1_8_VFD1"]
["NCP1_12_VFD1","NCP1_12_VFD1_I0","I0",null,"NCP1_12_VFD1_DISC","DISCONNECT AUX",null,"NCS1_9_VFD1"]
["NCP1_12_VFD1","NCP1_12_VFD1_I1","I1",null,"SPARE"]
["NCP1_12_VFD1","NCP1_12_VFD1_I2","I2",null,"NCP1_12_TPE1","TRACKING PHOTOEYE",null,"NCS2_2_VFD1",607]
["NCP1_12_VFD1","NCP1_12_VFD1_I3","I3",null,"SPARE",null,null,"NCS2_3A_VFD1"]
["NCP1_12_VFD1","NCP1_12_VFD1_IO0","IO0",null,"SPARE",null,null,"NCS2_3B_VFD1"]
["NCP1_12_VFD1","NCP1_12_VFD1_IO1","IO1",null,"SPARE",null,null,"NCS2_4_VFD1"]
{"$rows_left_out":380}